[INFO] Scanning for projects...
[INFO]                                                                         
[INFO] ------------------------------------------------------------------------
[INFO] Building vraptor 3.5.5
[INFO] ------------------------------------------------------------------------
[INFO] 
[INFO] --- maven-enforcer-plugin:1.0:enforce (enforce-maven) @ vraptor ---
[INFO] 
[INFO] --- maven-antrun-plugin:1.7:run (process-sources) @ vraptor ---
[INFO] Executing tasks

main:
[INFO] Executed tasks
[INFO] 
[INFO] --- maven-resources-plugin:2.6:resources (default-resources) @ vraptor ---
[INFO] Using 'UTF-8' encoding to copy filtered resources.
[INFO] Copying 2 resources
[INFO] 
[INFO] --- maven-compiler-plugin:2.3.1:compile (default-compile) @ vraptor ---
[INFO] Compiling 2 source files to /Users/aliparsai/Study/LittleDarwin/Cases/vraptor-vraptor-parent-3.5.5/vraptor-core/target/classes
[INFO] 
[INFO] --- maven-resources-plugin:2.6:testResources (default-testResources) @ vraptor ---
[INFO] Using 'UTF-8' encoding to copy filtered resources.
[INFO] Copying 3 resources
[INFO] 
[INFO] --- maven-compiler-plugin:2.3.1:testCompile (default-testCompile) @ vraptor ---
[INFO] Nothing to compile - all classes are up to date
[INFO] 
[INFO] --- maven-surefire-plugin:2.12.4:test (default-test) @ vraptor ---
[INFO] Surefire report directory: /Users/aliparsai/Study/LittleDarwin/Cases/vraptor-vraptor-parent-3.5.5/vraptor-core/target/surefire-reports

-------------------------------------------------------
 T E S T S
-------------------------------------------------------
Running br.com.caelum.vraptor.config.ApplicationConfigurationTest
Tests run: 2, Failures: 0, Errors: 0, Skipped: 0, Time elapsed: 0.4 sec
Running br.com.caelum.vraptor.config.BasicConfigurationTest
Tests run: 16, Failures: 0, Errors: 0, Skipped: 0, Time elapsed: 0.402 sec
Running br.com.caelum.vraptor.converter.BigDecimalConverterTest
Tests run: 4, Failures: 0, Errors: 0, Skipped: 0, Time elapsed: 0.022 sec
Running br.com.caelum.vraptor.converter.BigIntegerConverterTest
Tests run: 5, Failures: 0, Errors: 0, Skipped: 0, Time elapsed: 0.007 sec
Running br.com.caelum.vraptor.converter.BooleanConverterTest
Tests run: 8, Failures: 0, Errors: 0, Skipped: 0, Time elapsed: 0.02 sec
Running br.com.caelum.vraptor.converter.ByteConverterTest
Tests run: 4, Failures: 0, Errors: 0, Skipped: 0, Time elapsed: 0.012 sec
Running br.com.caelum.vraptor.converter.CharacterConverterTest
Tests run: 3, Failures: 0, Errors: 0, Skipped: 0, Time elapsed: 0.009 sec
Running br.com.caelum.vraptor.converter.DoubleConverterTest
Tests run: 4, Failures: 0, Errors: 0, Skipped: 0, Time elapsed: 0.019 sec
Running br.com.caelum.vraptor.converter.EnumConverterTest
Tests run: 7, Failures: 0, Errors: 0, Skipped: 0, Time elapsed: 0.02 sec
Running br.com.caelum.vraptor.converter.FloatConverterTest
Tests run: 4, Failures: 0, Errors: 0, Skipped: 0, Time elapsed: 0.005 sec
Running br.com.caelum.vraptor.converter.IntegerConverterTest
Tests run: 4, Failures: 0, Errors: 0, Skipped: 0, Time elapsed: 0.002 sec
Running br.com.caelum.vraptor.converter.jodatime.DateMidnightConverterTest
Tests run: 4, Failures: 0, Errors: 0, Skipped: 0, Time elapsed: 0.219 sec
Running br.com.caelum.vraptor.converter.jodatime.DateTimeConverterTest
Tests run: 4, Failures: 0, Errors: 0, Skipped: 0, Time elapsed: 0.012 sec
Running br.com.caelum.vraptor.converter.jodatime.LocalDateConverterTest
Tests run: 4, Failures: 0, Errors: 0, Skipped: 0, Time elapsed: 0.034 sec
Running br.com.caelum.vraptor.converter.jodatime.LocalDateTimeConverterTest
Tests run: 4, Failures: 0, Errors: 0, Skipped: 0, Time elapsed: 0.018 sec
Running br.com.caelum.vraptor.converter.jodatime.LocaleBasedJodaTimeConverterTest
Tests run: 2, Failures: 0, Errors: 0, Skipped: 0, Time elapsed: 0.025 sec
Running br.com.caelum.vraptor.converter.jodatime.LocalTimeConverterTest
Tests run: 4, Failures: 0, Errors: 0, Skipped: 0, Time elapsed: 0.023 sec
Running br.com.caelum.vraptor.converter.l10n.LocaleBasedBigDecimalConverterTest
Tests run: 6, Failures: 0, Errors: 0, Skipped: 0, Time elapsed: 0.022 sec
Running br.com.caelum.vraptor.converter.l10n.LocaleBasedDoubleConverterTest
Tests run: 6, Failures: 0, Errors: 0, Skipped: 0, Time elapsed: 0.015 sec
Running br.com.caelum.vraptor.converter.l10n.LocaleBasedFloatConverterTest
Tests run: 6, Failures: 0, Errors: 0, Skipped: 0, Time elapsed: 0.015 sec
Running br.com.caelum.vraptor.converter.l10n.LocaleBasedPrimitiveDoubleConverterTest
Tests run: 6, Failures: 0, Errors: 0, Skipped: 0, Time elapsed: 0.016 sec
Running br.com.caelum.vraptor.converter.l10n.LocaleBasedPrimitiveFloatConverterTest
Tests run: 6, Failures: 0, Errors: 0, Skipped: 0, Time elapsed: 0.011 sec
Running br.com.caelum.vraptor.converter.LocaleBasedCalendarConverterTest
Tests run: 5, Failures: 0, Errors: 0, Skipped: 0, Time elapsed: 0.011 sec
Running br.com.caelum.vraptor.converter.LocaleBasedDateConverterTest
Tests run: 5, Failures: 0, Errors: 0, Skipped: 0, Time elapsed: 0.048 sec
Running br.com.caelum.vraptor.converter.LocaleBasedTimeConverterTest
Tests run: 5, Failures: 0, Errors: 0, Skipped: 0, Time elapsed: 0.015 sec
Running br.com.caelum.vraptor.converter.LongConverterTest
Tests run: 4, Failures: 0, Errors: 0, Skipped: 0, Time elapsed: 0.01 sec
Running br.com.caelum.vraptor.converter.PrimitiveBooleanConverterTest
Tests run: 8, Failures: 0, Errors: 0, Skipped: 0, Time elapsed: 0.018 sec
Running br.com.caelum.vraptor.converter.PrimitiveByteConverterTest
Tests run: 4, Failures: 0, Errors: 0, Skipped: 0, Time elapsed: 0.004 sec
Running br.com.caelum.vraptor.converter.PrimitiveCharConverterTest
Tests run: 4, Failures: 0, Errors: 0, Skipped: 0, Time elapsed: 0.025 sec
Running br.com.caelum.vraptor.converter.PrimitiveDoubleConverterTest
Tests run: 4, Failures: 0, Errors: 0, Skipped: 0, Time elapsed: 0.003 sec
Running br.com.caelum.vraptor.converter.PrimitiveFloatConverterTest
Tests run: 4, Failures: 0, Errors: 0, Skipped: 0, Time elapsed: 0.003 sec
Running br.com.caelum.vraptor.converter.PrimitiveIntConverterTest
Tests run: 4, Failures: 0, Errors: 0, Skipped: 0, Time elapsed: 0.004 sec
Running br.com.caelum.vraptor.converter.PrimitiveLongConverterTest
Tests run: 4, Failures: 0, Errors: 0, Skipped: 0, Time elapsed: 0.004 sec
Running br.com.caelum.vraptor.converter.PrimitiveShortConverterTest
Tests run: 4, Failures: 0, Errors: 0, Skipped: 0, Time elapsed: 0.004 sec
Running br.com.caelum.vraptor.converter.ShortConverterTest
Tests run: 4, Failures: 0, Errors: 0, Skipped: 0, Time elapsed: 0.005 sec
Running br.com.caelum.vraptor.core.DefaultConvertersTest
Tests run: 6, Failures: 0, Errors: 0, Skipped: 0, Time elapsed: 0.219 sec
Running br.com.caelum.vraptor.core.DefaultInterceptorHandlerFactoryTest
Tests run: 3, Failures: 0, Errors: 0, Skipped: 0, Time elapsed: 0.011 sec
Running br.com.caelum.vraptor.core.DefaultInterceptorStackTest
Tests run: 2, Failures: 0, Errors: 0, Skipped: 0, Time elapsed: 0.028 sec
Running br.com.caelum.vraptor.core.DefaultMethodInfoTest
Tests run: 2, Failures: 0, Errors: 0, Skipped: 0, Time elapsed: 0.006 sec
Running br.com.caelum.vraptor.core.DefaultResultTest
Tests run: 16, Failures: 0, Errors: 0, Skipped: 0, Time elapsed: 0.057 sec
Running br.com.caelum.vraptor.core.DefaultStaticContentHandlerTest
Tests run: 4, Failures: 0, Errors: 0, Skipped: 0, Time elapsed: 0.022 sec
Running br.com.caelum.vraptor.core.ExceptionRecorderTest
Tests run: 3, Failures: 0, Errors: 0, Skipped: 0, Time elapsed: 0.081 sec
Running br.com.caelum.vraptor.core.JstlLocalizationTest
sun.util.ResourceBundleEnumeration@5aa9e4eb
Tests run: 8, Failures: 0, Errors: 0, Skipped: 0, Time elapsed: 0.041 sec
Running br.com.caelum.vraptor.core.LazyInterceptorHandlerTest
Tests run: 4, Failures: 0, Errors: 0, Skipped: 0, Time elapsed: 0.033 sec
Running br.com.caelum.vraptor.core.SafeResourceBundleTest
Tests run: 2, Failures: 0, Errors: 0, Skipped: 0, Time elapsed: 0 sec
Running br.com.caelum.vraptor.core.ToInstantiateInterceptorHandlerTest
Tests run: 3, Failures: 0, Errors: 0, Skipped: 0, Time elapsed: 0.005 sec
Running br.com.caelum.vraptor.deserialization.DefaultDeserializersTest
Tests run: 6, Failures: 0, Errors: 0, Skipped: 0, Time elapsed: 0.007 sec
Running br.com.caelum.vraptor.deserialization.DeserializesHandlerTest
Tests run: 3, Failures: 0, Errors: 0, Skipped: 0, Time elapsed: 0.005 sec
Running br.com.caelum.vraptor.deserialization.gson.GsonDeserializerTest
Tests run: 20, Failures: 0, Errors: 0, Skipped: 0, Time elapsed: 0.134 sec
Running br.com.caelum.vraptor.deserialization.JsonDeserializerTest
Tests run: 6, Failures: 0, Errors: 0, Skipped: 0, Time elapsed: 0.252 sec
Running br.com.caelum.vraptor.deserialization.XStreamXmlDeserializerTest
Tests run: 7, Failures: 0, Errors: 0, Skipped: 0, Time elapsed: 0.055 sec
Running br.com.caelum.vraptor.extra.ForwardToDefaultViewInterceptorTest
Tests run: 3, Failures: 0, Errors: 0, Skipped: 0, Time elapsed: 0.005 sec
Running br.com.caelum.vraptor.http.DefaultFormatResolverTest
Tests run: 5, Failures: 0, Errors: 0, Skipped: 0, Time elapsed: 0.015 sec
Running br.com.caelum.vraptor.http.DefaultParameterNameProviderTest
Tests run: 4, Failures: 0, Errors: 0, Skipped: 0, Time elapsed: 0.003 sec
Running br.com.caelum.vraptor.http.DefaultResourceTranslatorTest
Tests run: 13, Failures: 0, Errors: 0, Skipped: 0, Time elapsed: 0.051 sec
Running br.com.caelum.vraptor.http.EncodingHandlerFactoryTest
Tests run: 2, Failures: 0, Errors: 0, Skipped: 0, Time elapsed: 0.002 sec
Running br.com.caelum.vraptor.http.iogi.IogiGenericTypesSupportTest
Tests run: 6, Failures: 0, Errors: 0, Skipped: 0, Time elapsed: 0.112 sec
Running br.com.caelum.vraptor.http.iogi.IogiParametersProviderTest
Tests run: 36, Failures: 0, Errors: 0, Skipped: 0, Time elapsed: 0.229 sec
Running br.com.caelum.vraptor.http.iogi.MiscIogiSupportTest
Tests run: 2, Failures: 0, Errors: 0, Skipped: 0, Time elapsed: 0.007 sec
Running br.com.caelum.vraptor.http.ognl.ArrayAccessorTest
Tests run: 3, Failures: 0, Errors: 0, Skipped: 1, Time elapsed: 0.103 sec
Running br.com.caelum.vraptor.http.ognl.EmptyElementsRemovalTest
Tests run: 4, Failures: 0, Errors: 0, Skipped: 0, Time elapsed: 0.007 sec
Running br.com.caelum.vraptor.http.ognl.GenericNullHandlerTest
Tests run: 9, Failures: 0, Errors: 0, Skipped: 0, Time elapsed: 0.019 sec
Running br.com.caelum.vraptor.http.ognl.ListAccessorTest
Tests run: 3, Failures: 0, Errors: 0, Skipped: 0, Time elapsed: 0.081 sec
Running br.com.caelum.vraptor.http.ognl.ListNullHandlerTest
Tests run: 2, Failures: 0, Errors: 0, Skipped: 0, Time elapsed: 0.012 sec
Running br.com.caelum.vraptor.http.ognl.MiscOgnlSupportTest
Tests run: 2, Failures: 0, Errors: 0, Skipped: 0, Time elapsed: 0.085 sec
Running br.com.caelum.vraptor.http.ognl.OgnlGenericTypesSupportTest
Tests run: 3, Failures: 0, Errors: 0, Skipped: 0, Time elapsed: 0.035 sec
Running br.com.caelum.vraptor.http.ognl.OgnlParametersProviderTest
Tests run: 27, Failures: 0, Errors: 0, Skipped: 0, Time elapsed: 0.179 sec
Running br.com.caelum.vraptor.http.ognl.ReflectionBasedNullHandlerTest
Tests run: 7, Failures: 0, Errors: 0, Skipped: 0, Time elapsed: 0.039 sec
Running br.com.caelum.vraptor.http.ognl.VRaptorConvertersAdapterTest
Tests run: 3, Failures: 0, Errors: 0, Skipped: 0, Time elapsed: 0.017 sec
Running br.com.caelum.vraptor.http.ParanamerNameProviderTest
Tests run: 9, Failures: 0, Errors: 0, Skipped: 0, Time elapsed: 0.022 sec
Running br.com.caelum.vraptor.http.route.DefaultParametersControlTest
Tests run: 25, Failures: 0, Errors: 0, Skipped: 0, Time elapsed: 0.038 sec
Running br.com.caelum.vraptor.http.route.DefaultRouterTest
Tests run: 12, Failures: 0, Errors: 0, Skipped: 0, Time elapsed: 0.106 sec
Running br.com.caelum.vraptor.http.route.DefaultTypeFinderTest
Tests run: 2, Failures: 0, Errors: 0, Skipped: 0, Time elapsed: 0.005 sec
Running br.com.caelum.vraptor.http.route.FixedMethodStrategyTest
Tests run: 2, Failures: 0, Errors: 0, Skipped: 0, Time elapsed: 0.008 sec
Running br.com.caelum.vraptor.http.route.JavaEvaluatorTest
Tests run: 9, Failures: 0, Errors: 0, Skipped: 0, Time elapsed: 0.004 sec
Running br.com.caelum.vraptor.http.route.PathAnnotationRoutesParserTest
Tests run: 33, Failures: 0, Errors: 0, Skipped: 0, Time elapsed: 0.215 sec
Running br.com.caelum.vraptor.http.route.RouteBuilderTest
Tests run: 10, Failures: 0, Errors: 0, Skipped: 1, Time elapsed: 0.049 sec
Running br.com.caelum.vraptor.http.route.RulesTest
Tests run: 1, Failures: 0, Errors: 0, Skipped: 0, Time elapsed: 0.004 sec
Running br.com.caelum.vraptor.http.VRaptorRequestTest
Tests run: 7, Failures: 0, Errors: 0, Skipped: 0, Time elapsed: 0.012 sec
Running br.com.caelum.vraptor.http.WebXmlEncodingHandlerTest
Tests run: 2, Failures: 0, Errors: 0, Skipped: 0, Time elapsed: 0.035 sec
Running br.com.caelum.vraptor.interceptor.DefaultInterceptorRegistryTest
Tests run: 1, Failures: 0, Errors: 0, Skipped: 0, Time elapsed: 0.004 sec
Running br.com.caelum.vraptor.interceptor.DefaultTypeNameExtractorTest
Tests run: 4, Failures: 0, Errors: 0, Skipped: 0, Time elapsed: 0.003 sec
Running br.com.caelum.vraptor.interceptor.DeserializingInterceptorTest
17:54:23,756  WARN [DeserializingInterceptor] Request does not have Content-Type and parameters will be not deserialized
Tests run: 9, Failures: 0, Errors: 0, Skipped: 0, Time elapsed: 0.08 sec
Running br.com.caelum.vraptor.interceptor.download.ByteArrayDownloadTest
Tests run: 2, Failures: 0, Errors: 0, Skipped: 0, Time elapsed: 0.01 sec
Running br.com.caelum.vraptor.interceptor.download.FileDownloadTest
Tests run: 3, Failures: 0, Errors: 0, Skipped: 0, Time elapsed: 0.035 sec
Running br.com.caelum.vraptor.interceptor.download.InputStreamDownloadTest
Tests run: 2, Failures: 0, Errors: 0, Skipped: 0, Time elapsed: 0.001 sec
Running br.com.caelum.vraptor.interceptor.DownloadInterceptorTest
Tests run: 12, Failures: 0, Errors: 0, Skipped: 0, Time elapsed: 0.081 sec
Running br.com.caelum.vraptor.interceptor.ExceptionHandlerInterceptorTest
Tests run: 3, Failures: 0, Errors: 0, Skipped: 0, Time elapsed: 0.01 sec
Running br.com.caelum.vraptor.interceptor.ExecuteMethodInterceptorTest
Tests run: 9, Failures: 0, Errors: 0, Skipped: 0, Time elapsed: 0.045 sec
Running br.com.caelum.vraptor.interceptor.FlashInterceptorTest
Tests run: 7, Failures: 0, Errors: 0, Skipped: 0, Time elapsed: 0.021 sec
Running br.com.caelum.vraptor.interceptor.InstantiateInterceptorTest
Tests run: 3, Failures: 0, Errors: 0, Skipped: 0, Time elapsed: 0.029 sec
Running br.com.caelum.vraptor.interceptor.multipart.CommonsUploadMultipartInterceptorTest
17:54:24,145  WARN [CommonsUploadMultipartInterceptor] There was some problem parsing this multipart request, or someone is not sending a RFC1867 compatible multipart request.
org.apache.commons.fileupload.FileUploadException
	at br.com.caelum.vraptor.interceptor.multipart.CommonsUploadMultipartInterceptor.intercept(CommonsUploadMultipartInterceptor.java:103)
	at br.com.caelum.vraptor.interceptor.multipart.CommonsUploadMultipartInterceptorTest.doNothingWhenFileUploadExceptionOccurs(CommonsUploadMultipartInterceptorTest.java:235)
	at sun.reflect.NativeMethodAccessorImpl.invoke0(Native Method)
	at sun.reflect.NativeMethodAccessorImpl.invoke(NativeMethodAccessorImpl.java:62)
	at sun.reflect.DelegatingMethodAccessorImpl.invoke(DelegatingMethodAccessorImpl.java:43)
	at java.lang.reflect.Method.invoke(Method.java:497)
	at org.junit.runners.model.FrameworkMethod$1.runReflectiveCall(FrameworkMethod.java:45)
	at org.junit.internal.runners.model.ReflectiveCallable.run(ReflectiveCallable.java:15)
	at org.junit.runners.model.FrameworkMethod.invokeExplosively(FrameworkMethod.java:42)
	at org.junit.internal.runners.statements.InvokeMethod.evaluate(InvokeMethod.java:20)
	at org.junit.internal.runners.statements.RunBefores.evaluate(RunBefores.java:28)
	at org.junit.runners.ParentRunner.runLeaf(ParentRunner.java:263)
	at org.junit.runners.BlockJUnit4ClassRunner.runChild(BlockJUnit4ClassRunner.java:68)
	at org.junit.runners.BlockJUnit4ClassRunner.runChild(BlockJUnit4ClassRunner.java:47)
	at org.junit.runners.ParentRunner$3.run(ParentRunner.java:231)
	at org.junit.runners.ParentRunner$1.schedule(ParentRunner.java:60)
	at org.junit.runners.ParentRunner.runChildren(ParentRunner.java:229)
	at org.junit.runners.ParentRunner.access$000(ParentRunner.java:50)
	at org.junit.runners.ParentRunner$2.evaluate(ParentRunner.java:222)
	at org.junit.runners.ParentRunner.run(ParentRunner.java:300)
	at org.apache.maven.surefire.junit4.JUnit4Provider.execute(JUnit4Provider.java:252)
	at org.apache.maven.surefire.junit4.JUnit4Provider.executeTestSet(JUnit4Provider.java:141)
	at org.apache.maven.surefire.junit4.JUnit4Provider.invoke(JUnit4Provider.java:112)
	at sun.reflect.NativeMethodAccessorImpl.invoke0(Native Method)
	at sun.reflect.NativeMethodAccessorImpl.invoke(NativeMethodAccessorImpl.java:62)
	at sun.reflect.DelegatingMethodAccessorImpl.invoke(DelegatingMethodAccessorImpl.java:43)
	at java.lang.reflect.Method.invoke(Method.java:497)
	at org.apache.maven.surefire.util.ReflectionUtils.invokeMethodWithArray(ReflectionUtils.java:189)
	at org.apache.maven.surefire.booter.ProviderFactory$ProviderProxy.invoke(ProviderFactory.java:165)
	at org.apache.maven.surefire.booter.ProviderFactory.invokeProvider(ProviderFactory.java:85)
	at org.apache.maven.surefire.booter.ForkedBooter.runSuitesInProcess(ForkedBooter.java:115)
	at org.apache.maven.surefire.booter.ForkedBooter.main(ForkedBooter.java:75)
17:54:24,151  WARN [CommonsUploadMultipartInterceptor] The file size limit was exceeded.
org.apache.commons.fileupload.FileUploadBase$SizeLimitExceededException: 
	at br.com.caelum.vraptor.interceptor.multipart.CommonsUploadMultipartInterceptor.intercept(CommonsUploadMultipartInterceptor.java:103)
	at br.com.caelum.vraptor.interceptor.multipart.CommonsUploadMultipartInterceptorTest.shouldValidateWhenSizeLimitExceededExceptionOccurs(CommonsUploadMultipartInterceptorTest.java:244)
	at sun.reflect.NativeMethodAccessorImpl.invoke0(Native Method)
	at sun.reflect.NativeMethodAccessorImpl.invoke(NativeMethodAccessorImpl.java:62)
	at sun.reflect.DelegatingMethodAccessorImpl.invoke(DelegatingMethodAccessorImpl.java:43)
	at java.lang.reflect.Method.invoke(Method.java:497)
	at org.junit.runners.model.FrameworkMethod$1.runReflectiveCall(FrameworkMethod.java:45)
	at org.junit.internal.runners.model.ReflectiveCallable.run(ReflectiveCallable.java:15)
	at org.junit.runners.model.FrameworkMethod.invokeExplosively(FrameworkMethod.java:42)
	at org.junit.internal.runners.statements.InvokeMethod.evaluate(InvokeMethod.java:20)
	at org.junit.internal.runners.statements.RunBefores.evaluate(RunBefores.java:28)
	at org.junit.runners.ParentRunner.runLeaf(ParentRunner.java:263)
	at org.junit.runners.BlockJUnit4ClassRunner.runChild(BlockJUnit4ClassRunner.java:68)
	at org.junit.runners.BlockJUnit4ClassRunner.runChild(BlockJUnit4ClassRunner.java:47)
	at org.junit.runners.ParentRunner$3.run(ParentRunner.java:231)
	at org.junit.runners.ParentRunner$1.schedule(ParentRunner.java:60)
	at org.junit.runners.ParentRunner.runChildren(ParentRunner.java:229)
	at org.junit.runners.ParentRunner.access$000(ParentRunner.java:50)
	at org.junit.runners.ParentRunner$2.evaluate(ParentRunner.java:222)
	at org.junit.runners.ParentRunner.run(ParentRunner.java:300)
	at org.apache.maven.surefire.junit4.JUnit4Provider.execute(JUnit4Provider.java:252)
	at org.apache.maven.surefire.junit4.JUnit4Provider.executeTestSet(JUnit4Provider.java:141)
	at org.apache.maven.surefire.junit4.JUnit4Provider.invoke(JUnit4Provider.java:112)
	at sun.reflect.NativeMethodAccessorImpl.invoke0(Native Method)
	at sun.reflect.NativeMethodAccessorImpl.invoke(NativeMethodAccessorImpl.java:62)
	at sun.reflect.DelegatingMethodAccessorImpl.invoke(DelegatingMethodAccessorImpl.java:43)
	at java.lang.reflect.Method.invoke(Method.java:497)
	at org.apache.maven.surefire.util.ReflectionUtils.invokeMethodWithArray(ReflectionUtils.java:189)
	at org.apache.maven.surefire.booter.ProviderFactory$ProviderProxy.invoke(ProviderFactory.java:165)
	at org.apache.maven.surefire.booter.ProviderFactory.invokeProvider(ProviderFactory.java:85)
	at org.apache.maven.surefire.booter.ForkedBooter.runSuitesInProcess(ForkedBooter.java:115)
	at org.apache.maven.surefire.booter.ForkedBooter.main(ForkedBooter.java:75)
17:54:24,161  WARN [DefaultMultipartConfig] Unable to find temp directory, creating a dir inside the application
java.io.IOException
	at br.com.caelum.vraptor.interceptor.multipart.CommonsUploadMultipartInterceptor.intercept(CommonsUploadMultipartInterceptor.java:96)
	at br.com.caelum.vraptor.interceptor.multipart.CommonsUploadMultipartInterceptorTest.shouldCreateDirInsideAppIfTempDirAreNotAvailable(CommonsUploadMultipartInterceptorTest.java:263)
	at sun.reflect.NativeMethodAccessorImpl.invoke0(Native Method)
	at sun.reflect.NativeMethodAccessorImpl.invoke(NativeMethodAccessorImpl.java:62)
	at sun.reflect.DelegatingMethodAccessorImpl.invoke(DelegatingMethodAccessorImpl.java:43)
	at java.lang.reflect.Method.invoke(Method.java:497)
	at org.junit.runners.model.FrameworkMethod$1.runReflectiveCall(FrameworkMethod.java:45)
	at org.junit.internal.runners.model.ReflectiveCallable.run(ReflectiveCallable.java:15)
	at org.junit.runners.model.FrameworkMethod.invokeExplosively(FrameworkMethod.java:42)
	at org.junit.internal.runners.statements.InvokeMethod.evaluate(InvokeMethod.java:20)
	at org.junit.internal.runners.statements.RunBefores.evaluate(RunBefores.java:28)
	at org.junit.runners.ParentRunner.runLeaf(ParentRunner.java:263)
	at org.junit.runners.BlockJUnit4ClassRunner.runChild(BlockJUnit4ClassRunner.java:68)
	at org.junit.runners.BlockJUnit4ClassRunner.runChild(BlockJUnit4ClassRunner.java:47)
	at org.junit.runners.ParentRunner$3.run(ParentRunner.java:231)
	at org.junit.runners.ParentRunner$1.schedule(ParentRunner.java:60)
	at org.junit.runners.ParentRunner.runChildren(ParentRunner.java:229)
	at org.junit.runners.ParentRunner.access$000(ParentRunner.java:50)
	at org.junit.runners.ParentRunner$2.evaluate(ParentRunner.java:222)
	at org.junit.runners.ParentRunner.run(ParentRunner.java:300)
	at org.apache.maven.surefire.junit4.JUnit4Provider.execute(JUnit4Provider.java:252)
	at org.apache.maven.surefire.junit4.JUnit4Provider.executeTestSet(JUnit4Provider.java:141)
	at org.apache.maven.surefire.junit4.JUnit4Provider.invoke(JUnit4Provider.java:112)
	at sun.reflect.NativeMethodAccessorImpl.invoke0(Native Method)
	at sun.reflect.NativeMethodAccessorImpl.invoke(NativeMethodAccessorImpl.java:62)
	at sun.reflect.DelegatingMethodAccessorImpl.invoke(DelegatingMethodAccessorImpl.java:43)
	at java.lang.reflect.Method.invoke(Method.java:497)
	at org.apache.maven.surefire.util.ReflectionUtils.invokeMethodWithArray(ReflectionUtils.java:189)
	at org.apache.maven.surefire.booter.ProviderFactory$ProviderProxy.invoke(ProviderFactory.java:165)
	at org.apache.maven.surefire.booter.ProviderFactory.invokeProvider(ProviderFactory.java:85)
	at org.apache.maven.surefire.booter.ForkedBooter.runSuitesInProcess(ForkedBooter.java:115)
	at org.apache.maven.surefire.booter.ForkedBooter.main(ForkedBooter.java:75)
17:54:24,186  WARN [CommonsUploadMultipartInterceptor] There was some problem parsing this multipart request, or someone is not sending a RFC1867 compatible multipart request.
org.apache.commons.fileupload.FileUploadException
	at br.com.caelum.vraptor.interceptor.multipart.CommonsUploadMultipartInterceptor.intercept(CommonsUploadMultipartInterceptor.java:103)
	at br.com.caelum.vraptor.interceptor.multipart.CommonsUploadMultipartInterceptorTest.handleValidatorMessageWhenFileUploadExceptionOccurs(CommonsUploadMultipartInterceptorTest.java:297)
	at sun.reflect.NativeMethodAccessorImpl.invoke0(Native Method)
	at sun.reflect.NativeMethodAccessorImpl.invoke(NativeMethodAccessorImpl.java:62)
	at sun.reflect.DelegatingMethodAccessorImpl.invoke(DelegatingMethodAccessorImpl.java:43)
	at java.lang.reflect.Method.invoke(Method.java:497)
	at org.junit.runners.model.FrameworkMethod$1.runReflectiveCall(FrameworkMethod.java:45)
	at org.junit.internal.runners.model.ReflectiveCallable.run(ReflectiveCallable.java:15)
	at org.junit.runners.model.FrameworkMethod.invokeExplosively(FrameworkMethod.java:42)
	at org.junit.internal.runners.statements.InvokeMethod.evaluate(InvokeMethod.java:20)
	at org.junit.internal.runners.statements.RunBefores.evaluate(RunBefores.java:28)
	at org.junit.runners.ParentRunner.runLeaf(ParentRunner.java:263)
	at org.junit.runners.BlockJUnit4ClassRunner.runChild(BlockJUnit4ClassRunner.java:68)
	at org.junit.runners.BlockJUnit4ClassRunner.runChild(BlockJUnit4ClassRunner.java:47)
	at org.junit.runners.ParentRunner$3.run(ParentRunner.java:231)
	at org.junit.runners.ParentRunner$1.schedule(ParentRunner.java:60)
	at org.junit.runners.ParentRunner.runChildren(ParentRunner.java:229)
	at org.junit.runners.ParentRunner.access$000(ParentRunner.java:50)
	at org.junit.runners.ParentRunner$2.evaluate(ParentRunner.java:222)
	at org.junit.runners.ParentRunner.run(ParentRunner.java:300)
	at org.apache.maven.surefire.junit4.JUnit4Provider.execute(JUnit4Provider.java:252)
	at org.apache.maven.surefire.junit4.JUnit4Provider.executeTestSet(JUnit4Provider.java:141)
	at org.apache.maven.surefire.junit4.JUnit4Provider.invoke(JUnit4Provider.java:112)
	at sun.reflect.NativeMethodAccessorImpl.invoke0(Native Method)
	at sun.reflect.NativeMethodAccessorImpl.invoke(NativeMethodAccessorImpl.java:62)
	at sun.reflect.DelegatingMethodAccessorImpl.invoke(DelegatingMethodAccessorImpl.java:43)
	at java.lang.reflect.Method.invoke(Method.java:497)
	at org.apache.maven.surefire.util.ReflectionUtils.invokeMethodWithArray(ReflectionUtils.java:189)
	at org.apache.maven.surefire.booter.ProviderFactory$ProviderProxy.invoke(ProviderFactory.java:165)
	at org.apache.maven.surefire.booter.ProviderFactory.invokeProvider(ProviderFactory.java:85)
	at org.apache.maven.surefire.booter.ForkedBooter.runSuitesInProcess(ForkedBooter.java:115)
	at org.apache.maven.surefire.booter.ForkedBooter.main(ForkedBooter.java:75)
17:54:24,211  WARN [CommonsUploadMultipartInterceptor] Request have an invalid encoding. Ignoring it
17:54:24,216  WARN [CommonsUploadMultipartInterceptor] Request have an invalid encoding. Ignoring it
Tests run: 14, Failures: 0, Errors: 0, Skipped: 0, Time elapsed: 0.194 sec
Running br.com.caelum.vraptor.interceptor.multipart.DefaultUploadedFileTest
Tests run: 3, Failures: 0, Errors: 0, Skipped: 0, Time elapsed: 0.013 sec
Running br.com.caelum.vraptor.interceptor.multipart.NullMultipartInterceptorTest
Tests run: 2, Failures: 0, Errors: 0, Skipped: 0, Time elapsed: 0.001 sec
Running br.com.caelum.vraptor.interceptor.OutjectResultTest
Tests run: 4, Failures: 0, Errors: 0, Skipped: 0, Time elapsed: 0.006 sec
Running br.com.caelum.vraptor.interceptor.ParametersInstantiatorInterceptorTest
Tests run: 11, Failures: 0, Errors: 0, Skipped: 0, Time elapsed: 0.064 sec
Running br.com.caelum.vraptor.interceptor.ResourceLookupInterceptorTest
Tests run: 4, Failures: 0, Errors: 0, Skipped: 0, Time elapsed: 0.041 sec
Running br.com.caelum.vraptor.interceptor.TopologicalSortedInterceptorRegistryTest
Tests run: 7, Failures: 0, Errors: 0, Skipped: 0, Time elapsed: 0.027 sec
Running br.com.caelum.vraptor.ioc.AbstractComponentRegistryTest
Tests run: 2, Failures: 0, Errors: 0, Skipped: 0, Time elapsed: 0.008 sec
Running br.com.caelum.vraptor.ioc.ComponentFactoryIntrospectorTest
Tests run: 5, Failures: 0, Errors: 0, Skipped: 0, Time elapsed: 0.005 sec
Running br.com.caelum.vraptor.ioc.guice.GuiceProviderTest
Tests run: 25, Failures: 0, Errors: 25, Skipped: 0, Time elapsed: 3.118 sec <<< FAILURE!
shouldBeAbleToRegisterClasses(br.com.caelum.vraptor.ioc.guice.GuiceProviderTest)  Time elapsed: 1.112 sec  <<< ERROR!
com.google.inject.CreationException: Guice creation errors:

1) Binding points to itself.
  at br.com.caelum.vraptor.ioc.guice.GuiceComponentRegistry.deepRegister(GuiceComponentRegistry.java:63)

2) A binding to br.com.caelum.vraptor.ioc.fixture.ComponentFactoryInTheClasspath was already configured at br.com.caelum.vraptor.ioc.guice.GuiceComponentRegistry.bindToConstructor(GuiceComponentRegistry.java:75).
  at br.com.caelum.vraptor.ioc.guice.GuiceComponentRegistry.deepRegister(GuiceComponentRegistry.java:63)

3) A binding to br.com.caelum.vraptor.ioc.fixture.ResourceInTheClasspath was already configured at br.com.caelum.vraptor.ioc.guice.GuiceComponentRegistry.bindToConstructor(GuiceComponentRegistry.java:75).
  at br.com.caelum.vraptor.ioc.guice.GuiceComponentRegistry.deepRegister(GuiceComponentRegistry.java:63)

4) A binding to br.com.caelum.vraptor.ioc.fixture.CustomMethodNotAllowedHandler was already configured at br.com.caelum.vraptor.ioc.guice.GuiceComponentRegistry.bindToConstructor(GuiceComponentRegistry.java:75).
  at br.com.caelum.vraptor.ioc.guice.GuiceComponentRegistry.deepRegister(GuiceComponentRegistry.java:63)

5) A binding to br.com.caelum.vraptor.ioc.fixture.NoConstructor was already configured at br.com.caelum.vraptor.ioc.guice.GuiceComponentRegistry.bindToConstructor(GuiceComponentRegistry.java:75).
  at br.com.caelum.vraptor.ioc.guice.GuiceComponentRegistry.deepRegister(GuiceComponentRegistry.java:63)

6) A binding to br.com.caelum.vraptor.ioc.fixture.DependentOnSomethingFromComponentFactory was already configured at br.com.caelum.vraptor.ioc.guice.GuiceComponentRegistry.bindToConstructor(GuiceComponentRegistry.java:75).
  at br.com.caelum.vraptor.ioc.guice.GuiceComponentRegistry.deepRegister(GuiceComponentRegistry.java:63)

7) A binding to br.com.caelum.vraptor.ioc.fixture.CustomComponentWithLifecycleInTheClasspath was already configured at br.com.caelum.vraptor.ioc.guice.GuiceComponentRegistry.bindToConstructor(GuiceComponentRegistry.java:75).
  at br.com.caelum.vraptor.ioc.guice.GuiceComponentRegistry.deepRegister(GuiceComponentRegistry.java:63)

8) A binding to br.com.caelum.vraptor.ioc.fixture.InterceptorInTheClasspath was already configured at br.com.caelum.vraptor.ioc.guice.GuiceComponentRegistry.bindToConstructor(GuiceComponentRegistry.java:75).
  at br.com.caelum.vraptor.ioc.guice.GuiceComponentRegistry.deepRegister(GuiceComponentRegistry.java:63)

9) A binding to br.com.caelum.vraptor.ioc.fixture.CustomComponentInTheClasspath was already configured at br.com.caelum.vraptor.ioc.guice.GuiceComponentRegistry.bindToConstructor(GuiceComponentRegistry.java:75).
  at br.com.caelum.vraptor.ioc.guice.GuiceComponentRegistry.deepRegister(GuiceComponentRegistry.java:63)

10) A binding to br.com.caelum.vraptor.ioc.fixture.HasConstructor was already configured at br.com.caelum.vraptor.ioc.guice.GuiceComponentRegistry.bindToConstructor(GuiceComponentRegistry.java:75).
  at br.com.caelum.vraptor.ioc.guice.GuiceComponentRegistry.deepRegister(GuiceComponentRegistry.java:63)

11) A binding to br.com.caelum.vraptor.ioc.fixture.ConverterInTheClasspath was already configured at br.com.caelum.vraptor.ioc.guice.GuiceComponentRegistry.bindToConstructor(GuiceComponentRegistry.java:75).
  at br.com.caelum.vraptor.ioc.guice.GuiceComponentRegistry.deepRegister(GuiceComponentRegistry.java:63)

11 errors
	at com.google.inject.internal.Errors.throwCreationExceptionIfErrorsExist(Errors.java:435)
	at com.google.inject.internal.InternalInjectorCreator.initializeStatically(InternalInjectorCreator.java:154)
	at com.google.inject.internal.InternalInjectorCreator.build(InternalInjectorCreator.java:106)
	at com.google.inject.Guice.createInjector(Guice.java:95)
	at com.google.inject.Guice.createInjector(Guice.java:83)
	at br.com.caelum.vraptor.ioc.guice.GuiceProvider.start(GuiceProvider.java:97)
	at br.com.caelum.vraptor.ioc.GenericContainerTest.start(GenericContainerTest.java:288)
	at br.com.caelum.vraptor.ioc.GenericContainerTest.setup(GenericContainerTest.java:285)
	at sun.reflect.NativeMethodAccessorImpl.invoke0(Native Method)
	at sun.reflect.NativeMethodAccessorImpl.invoke(NativeMethodAccessorImpl.java:62)
	at sun.reflect.DelegatingMethodAccessorImpl.invoke(DelegatingMethodAccessorImpl.java:43)
	at java.lang.reflect.Method.invoke(Method.java:497)
	at org.junit.runners.model.FrameworkMethod$1.runReflectiveCall(FrameworkMethod.java:45)
	at org.junit.internal.runners.model.ReflectiveCallable.run(ReflectiveCallable.java:15)
	at org.junit.runners.model.FrameworkMethod.invokeExplosively(FrameworkMethod.java:42)
	at org.junit.internal.runners.statements.RunBefores.evaluate(RunBefores.java:27)
	at org.junit.internal.runners.statements.RunAfters.evaluate(RunAfters.java:30)
	at org.junit.runners.ParentRunner.runLeaf(ParentRunner.java:263)
	at org.junit.runners.BlockJUnit4ClassRunner.runChild(BlockJUnit4ClassRunner.java:68)
	at org.junit.runners.BlockJUnit4ClassRunner.runChild(BlockJUnit4ClassRunner.java:47)
	at org.junit.runners.ParentRunner$3.run(ParentRunner.java:231)
	at org.junit.runners.ParentRunner$1.schedule(ParentRunner.java:60)
	at org.junit.runners.ParentRunner.runChildren(ParentRunner.java:229)
	at org.junit.runners.ParentRunner.access$000(ParentRunner.java:50)
	at org.junit.runners.ParentRunner$2.evaluate(ParentRunner.java:222)
	at org.junit.runners.ParentRunner.run(ParentRunner.java:300)
	at org.apache.maven.surefire.junit4.JUnit4Provider.execute(JUnit4Provider.java:252)
	at org.apache.maven.surefire.junit4.JUnit4Provider.executeTestSet(JUnit4Provider.java:141)
	at org.apache.maven.surefire.junit4.JUnit4Provider.invoke(JUnit4Provider.java:112)
	at sun.reflect.NativeMethodAccessorImpl.invoke0(Native Method)
	at sun.reflect.NativeMethodAccessorImpl.invoke(NativeMethodAccessorImpl.java:62)
	at sun.reflect.DelegatingMethodAccessorImpl.invoke(DelegatingMethodAccessorImpl.java:43)
	at java.lang.reflect.Method.invoke(Method.java:497)
	at org.apache.maven.surefire.util.ReflectionUtils.invokeMethodWithArray(ReflectionUtils.java:189)
	at org.apache.maven.surefire.booter.ProviderFactory$ProviderProxy.invoke(ProviderFactory.java:165)
	at org.apache.maven.surefire.booter.ProviderFactory.invokeProvider(ProviderFactory.java:85)
	at org.apache.maven.surefire.booter.ForkedBooter.runSuitesInProcess(ForkedBooter.java:115)
	at org.apache.maven.surefire.booter.ForkedBooter.main(ForkedBooter.java:75)

shouldBeAbleToOverrideVRaptorsDefaultImplementation(br.com.caelum.vraptor.ioc.guice.GuiceProviderTest)  Time elapsed: 0.201 sec  <<< ERROR!
com.google.inject.CreationException: Guice creation errors:

1) Binding points to itself.
  at br.com.caelum.vraptor.ioc.guice.GuiceComponentRegistry.deepRegister(GuiceComponentRegistry.java:63)

2) A binding to br.com.caelum.vraptor.ioc.fixture.ComponentFactoryInTheClasspath was already configured at br.com.caelum.vraptor.ioc.guice.GuiceComponentRegistry.bindToConstructor(GuiceComponentRegistry.java:75).
  at br.com.caelum.vraptor.ioc.guice.GuiceComponentRegistry.deepRegister(GuiceComponentRegistry.java:63)

3) A binding to br.com.caelum.vraptor.ioc.fixture.ResourceInTheClasspath was already configured at br.com.caelum.vraptor.ioc.guice.GuiceComponentRegistry.bindToConstructor(GuiceComponentRegistry.java:75).
  at br.com.caelum.vraptor.ioc.guice.GuiceComponentRegistry.deepRegister(GuiceComponentRegistry.java:63)

4) A binding to br.com.caelum.vraptor.ioc.fixture.CustomMethodNotAllowedHandler was already configured at br.com.caelum.vraptor.ioc.guice.GuiceComponentRegistry.bindToConstructor(GuiceComponentRegistry.java:75).
  at br.com.caelum.vraptor.ioc.guice.GuiceComponentRegistry.deepRegister(GuiceComponentRegistry.java:63)

5) A binding to br.com.caelum.vraptor.ioc.fixture.NoConstructor was already configured at br.com.caelum.vraptor.ioc.guice.GuiceComponentRegistry.bindToConstructor(GuiceComponentRegistry.java:75).
  at br.com.caelum.vraptor.ioc.guice.GuiceComponentRegistry.deepRegister(GuiceComponentRegistry.java:63)

6) A binding to br.com.caelum.vraptor.ioc.fixture.DependentOnSomethingFromComponentFactory was already configured at br.com.caelum.vraptor.ioc.guice.GuiceComponentRegistry.bindToConstructor(GuiceComponentRegistry.java:75).
  at br.com.caelum.vraptor.ioc.guice.GuiceComponentRegistry.deepRegister(GuiceComponentRegistry.java:63)

7) A binding to br.com.caelum.vraptor.ioc.fixture.CustomComponentWithLifecycleInTheClasspath was already configured at br.com.caelum.vraptor.ioc.guice.GuiceComponentRegistry.bindToConstructor(GuiceComponentRegistry.java:75).
  at br.com.caelum.vraptor.ioc.guice.GuiceComponentRegistry.deepRegister(GuiceComponentRegistry.java:63)

8) A binding to br.com.caelum.vraptor.ioc.fixture.InterceptorInTheClasspath was already configured at br.com.caelum.vraptor.ioc.guice.GuiceComponentRegistry.bindToConstructor(GuiceComponentRegistry.java:75).
  at br.com.caelum.vraptor.ioc.guice.GuiceComponentRegistry.deepRegister(GuiceComponentRegistry.java:63)

9) A binding to br.com.caelum.vraptor.ioc.fixture.CustomComponentInTheClasspath was already configured at br.com.caelum.vraptor.ioc.guice.GuiceComponentRegistry.bindToConstructor(GuiceComponentRegistry.java:75).
  at br.com.caelum.vraptor.ioc.guice.GuiceComponentRegistry.deepRegister(GuiceComponentRegistry.java:63)

10) A binding to br.com.caelum.vraptor.ioc.fixture.HasConstructor was already configured at br.com.caelum.vraptor.ioc.guice.GuiceComponentRegistry.bindToConstructor(GuiceComponentRegistry.java:75).
  at br.com.caelum.vraptor.ioc.guice.GuiceComponentRegistry.deepRegister(GuiceComponentRegistry.java:63)

11) A binding to br.com.caelum.vraptor.ioc.fixture.ConverterInTheClasspath was already configured at br.com.caelum.vraptor.ioc.guice.GuiceComponentRegistry.bindToConstructor(GuiceComponentRegistry.java:75).
  at br.com.caelum.vraptor.ioc.guice.GuiceComponentRegistry.deepRegister(GuiceComponentRegistry.java:63)

11 errors
	at com.google.inject.internal.Errors.throwCreationExceptionIfErrorsExist(Errors.java:435)
	at com.google.inject.internal.InternalInjectorCreator.initializeStatically(InternalInjectorCreator.java:154)
	at com.google.inject.internal.InternalInjectorCreator.build(InternalInjectorCreator.java:106)
	at com.google.inject.Guice.createInjector(Guice.java:95)
	at com.google.inject.Guice.createInjector(Guice.java:83)
	at br.com.caelum.vraptor.ioc.guice.GuiceProvider.start(GuiceProvider.java:97)
	at br.com.caelum.vraptor.ioc.GenericContainerTest.start(GenericContainerTest.java:288)
	at br.com.caelum.vraptor.ioc.GenericContainerTest.setup(GenericContainerTest.java:285)
	at sun.reflect.NativeMethodAccessorImpl.invoke0(Native Method)
	at sun.reflect.NativeMethodAccessorImpl.invoke(NativeMethodAccessorImpl.java:62)
	at sun.reflect.DelegatingMethodAccessorImpl.invoke(DelegatingMethodAccessorImpl.java:43)
	at java.lang.reflect.Method.invoke(Method.java:497)
	at org.junit.runners.model.FrameworkMethod$1.runReflectiveCall(FrameworkMethod.java:45)
	at org.junit.internal.runners.model.ReflectiveCallable.run(ReflectiveCallable.java:15)
	at org.junit.runners.model.FrameworkMethod.invokeExplosively(FrameworkMethod.java:42)
	at org.junit.internal.runners.statements.RunBefores.evaluate(RunBefores.java:27)
	at org.junit.internal.runners.statements.RunAfters.evaluate(RunAfters.java:30)
	at org.junit.runners.ParentRunner.runLeaf(ParentRunner.java:263)
	at org.junit.runners.BlockJUnit4ClassRunner.runChild(BlockJUnit4ClassRunner.java:68)
	at org.junit.runners.BlockJUnit4ClassRunner.runChild(BlockJUnit4ClassRunner.java:47)
	at org.junit.runners.ParentRunner$3.run(ParentRunner.java:231)
	at org.junit.runners.ParentRunner$1.schedule(ParentRunner.java:60)
	at org.junit.runners.ParentRunner.runChildren(ParentRunner.java:229)
	at org.junit.runners.ParentRunner.access$000(ParentRunner.java:50)
	at org.junit.runners.ParentRunner$2.evaluate(ParentRunner.java:222)
	at org.junit.runners.ParentRunner.run(ParentRunner.java:300)
	at org.apache.maven.surefire.junit4.JUnit4Provider.execute(JUnit4Provider.java:252)
	at org.apache.maven.surefire.junit4.JUnit4Provider.executeTestSet(JUnit4Provider.java:141)
	at org.apache.maven.surefire.junit4.JUnit4Provider.invoke(JUnit4Provider.java:112)
	at sun.reflect.NativeMethodAccessorImpl.invoke0(Native Method)
	at sun.reflect.NativeMethodAccessorImpl.invoke(NativeMethodAccessorImpl.java:62)
	at sun.reflect.DelegatingMethodAccessorImpl.invoke(DelegatingMethodAccessorImpl.java:43)
	at java.lang.reflect.Method.invoke(Method.java:497)
	at org.apache.maven.surefire.util.ReflectionUtils.invokeMethodWithArray(ReflectionUtils.java:189)
	at org.apache.maven.surefire.booter.ProviderFactory$ProviderProxy.invoke(ProviderFactory.java:165)
	at org.apache.maven.surefire.booter.ProviderFactory.invokeProvider(ProviderFactory.java:85)
	at org.apache.maven.surefire.booter.ForkedBooter.runSuitesInProcess(ForkedBooter.java:115)
	at org.apache.maven.surefire.booter.ForkedBooter.main(ForkedBooter.java:75)

shouldBeAbleToRegisterClassesWithDependencies(br.com.caelum.vraptor.ioc.guice.GuiceProviderTest)  Time elapsed: 0.102 sec  <<< ERROR!
com.google.inject.CreationException: Guice creation errors:

1) Binding points to itself.
  at br.com.caelum.vraptor.ioc.guice.GuiceComponentRegistry.deepRegister(GuiceComponentRegistry.java:63)

2) A binding to br.com.caelum.vraptor.ioc.fixture.ComponentFactoryInTheClasspath was already configured at br.com.caelum.vraptor.ioc.guice.GuiceComponentRegistry.bindToConstructor(GuiceComponentRegistry.java:75).
  at br.com.caelum.vraptor.ioc.guice.GuiceComponentRegistry.deepRegister(GuiceComponentRegistry.java:63)

3) A binding to br.com.caelum.vraptor.ioc.fixture.ResourceInTheClasspath was already configured at br.com.caelum.vraptor.ioc.guice.GuiceComponentRegistry.bindToConstructor(GuiceComponentRegistry.java:75).
  at br.com.caelum.vraptor.ioc.guice.GuiceComponentRegistry.deepRegister(GuiceComponentRegistry.java:63)

4) A binding to br.com.caelum.vraptor.ioc.fixture.CustomMethodNotAllowedHandler was already configured at br.com.caelum.vraptor.ioc.guice.GuiceComponentRegistry.bindToConstructor(GuiceComponentRegistry.java:75).
  at br.com.caelum.vraptor.ioc.guice.GuiceComponentRegistry.deepRegister(GuiceComponentRegistry.java:63)

5) A binding to br.com.caelum.vraptor.ioc.fixture.NoConstructor was already configured at br.com.caelum.vraptor.ioc.guice.GuiceComponentRegistry.bindToConstructor(GuiceComponentRegistry.java:75).
  at br.com.caelum.vraptor.ioc.guice.GuiceComponentRegistry.deepRegister(GuiceComponentRegistry.java:63)

6) A binding to br.com.caelum.vraptor.ioc.fixture.DependentOnSomethingFromComponentFactory was already configured at br.com.caelum.vraptor.ioc.guice.GuiceComponentRegistry.bindToConstructor(GuiceComponentRegistry.java:75).
  at br.com.caelum.vraptor.ioc.guice.GuiceComponentRegistry.deepRegister(GuiceComponentRegistry.java:63)

7) A binding to br.com.caelum.vraptor.ioc.fixture.CustomComponentWithLifecycleInTheClasspath was already configured at br.com.caelum.vraptor.ioc.guice.GuiceComponentRegistry.bindToConstructor(GuiceComponentRegistry.java:75).
  at br.com.caelum.vraptor.ioc.guice.GuiceComponentRegistry.deepRegister(GuiceComponentRegistry.java:63)

8) A binding to br.com.caelum.vraptor.ioc.fixture.InterceptorInTheClasspath was already configured at br.com.caelum.vraptor.ioc.guice.GuiceComponentRegistry.bindToConstructor(GuiceComponentRegistry.java:75).
  at br.com.caelum.vraptor.ioc.guice.GuiceComponentRegistry.deepRegister(GuiceComponentRegistry.java:63)

9) A binding to br.com.caelum.vraptor.ioc.fixture.CustomComponentInTheClasspath was already configured at br.com.caelum.vraptor.ioc.guice.GuiceComponentRegistry.bindToConstructor(GuiceComponentRegistry.java:75).
  at br.com.caelum.vraptor.ioc.guice.GuiceComponentRegistry.deepRegister(GuiceComponentRegistry.java:63)

10) A binding to br.com.caelum.vraptor.ioc.fixture.HasConstructor was already configured at br.com.caelum.vraptor.ioc.guice.GuiceComponentRegistry.bindToConstructor(GuiceComponentRegistry.java:75).
  at br.com.caelum.vraptor.ioc.guice.GuiceComponentRegistry.deepRegister(GuiceComponentRegistry.java:63)

11) A binding to br.com.caelum.vraptor.ioc.fixture.ConverterInTheClasspath was already configured at br.com.caelum.vraptor.ioc.guice.GuiceComponentRegistry.bindToConstructor(GuiceComponentRegistry.java:75).
  at br.com.caelum.vraptor.ioc.guice.GuiceComponentRegistry.deepRegister(GuiceComponentRegistry.java:63)

11 errors
	at com.google.inject.internal.Errors.throwCreationExceptionIfErrorsExist(Errors.java:435)
	at com.google.inject.internal.InternalInjectorCreator.initializeStatically(InternalInjectorCreator.java:154)
	at com.google.inject.internal.InternalInjectorCreator.build(InternalInjectorCreator.java:106)
	at com.google.inject.Guice.createInjector(Guice.java:95)
	at com.google.inject.Guice.createInjector(Guice.java:83)
	at br.com.caelum.vraptor.ioc.guice.GuiceProvider.start(GuiceProvider.java:97)
	at br.com.caelum.vraptor.ioc.GenericContainerTest.start(GenericContainerTest.java:288)
	at br.com.caelum.vraptor.ioc.GenericContainerTest.setup(GenericContainerTest.java:285)
	at sun.reflect.NativeMethodAccessorImpl.invoke0(Native Method)
	at sun.reflect.NativeMethodAccessorImpl.invoke(NativeMethodAccessorImpl.java:62)
	at sun.reflect.DelegatingMethodAccessorImpl.invoke(DelegatingMethodAccessorImpl.java:43)
	at java.lang.reflect.Method.invoke(Method.java:497)
	at org.junit.runners.model.FrameworkMethod$1.runReflectiveCall(FrameworkMethod.java:45)
	at org.junit.internal.runners.model.ReflectiveCallable.run(ReflectiveCallable.java:15)
	at org.junit.runners.model.FrameworkMethod.invokeExplosively(FrameworkMethod.java:42)
	at org.junit.internal.runners.statements.RunBefores.evaluate(RunBefores.java:27)
	at org.junit.internal.runners.statements.RunAfters.evaluate(RunAfters.java:30)
	at org.junit.runners.ParentRunner.runLeaf(ParentRunner.java:263)
	at org.junit.runners.BlockJUnit4ClassRunner.runChild(BlockJUnit4ClassRunner.java:68)
	at org.junit.runners.BlockJUnit4ClassRunner.runChild(BlockJUnit4ClassRunner.java:47)
	at org.junit.runners.ParentRunner$3.run(ParentRunner.java:231)
	at org.junit.runners.ParentRunner$1.schedule(ParentRunner.java:60)
	at org.junit.runners.ParentRunner.runChildren(ParentRunner.java:229)
	at org.junit.runners.ParentRunner.access$000(ParentRunner.java:50)
	at org.junit.runners.ParentRunner$2.evaluate(ParentRunner.java:222)
	at org.junit.runners.ParentRunner.run(ParentRunner.java:300)
	at org.apache.maven.surefire.junit4.JUnit4Provider.execute(JUnit4Provider.java:252)
	at org.apache.maven.surefire.junit4.JUnit4Provider.executeTestSet(JUnit4Provider.java:141)
	at org.apache.maven.surefire.junit4.JUnit4Provider.invoke(JUnit4Provider.java:112)
	at sun.reflect.NativeMethodAccessorImpl.invoke0(Native Method)
	at sun.reflect.NativeMethodAccessorImpl.invoke(NativeMethodAccessorImpl.java:62)
	at sun.reflect.DelegatingMethodAccessorImpl.invoke(DelegatingMethodAccessorImpl.java:43)
	at java.lang.reflect.Method.invoke(Method.java:497)
	at org.apache.maven.surefire.util.ReflectionUtils.invokeMethodWithArray(ReflectionUtils.java:189)
	at org.apache.maven.surefire.booter.ProviderFactory$ProviderProxy.invoke(ProviderFactory.java:165)
	at org.apache.maven.surefire.booter.ProviderFactory.invokeProvider(ProviderFactory.java:85)
	at org.apache.maven.surefire.booter.ForkedBooter.runSuitesInProcess(ForkedBooter.java:115)
	at org.apache.maven.surefire.booter.ForkedBooter.main(ForkedBooter.java:75)

shouldBeAbleToReceiveListsOfSerializationsAsDependency(br.com.caelum.vraptor.ioc.guice.GuiceProviderTest)  Time elapsed: 0.084 sec  <<< ERROR!
com.google.inject.CreationException: Guice creation errors:

1) Binding points to itself.
  at br.com.caelum.vraptor.ioc.guice.GuiceComponentRegistry.deepRegister(GuiceComponentRegistry.java:63)

2) A binding to br.com.caelum.vraptor.ioc.fixture.ComponentFactoryInTheClasspath was already configured at br.com.caelum.vraptor.ioc.guice.GuiceComponentRegistry.bindToConstructor(GuiceComponentRegistry.java:75).
  at br.com.caelum.vraptor.ioc.guice.GuiceComponentRegistry.deepRegister(GuiceComponentRegistry.java:63)

3) A binding to br.com.caelum.vraptor.ioc.fixture.ResourceInTheClasspath was already configured at br.com.caelum.vraptor.ioc.guice.GuiceComponentRegistry.bindToConstructor(GuiceComponentRegistry.java:75).
  at br.com.caelum.vraptor.ioc.guice.GuiceComponentRegistry.deepRegister(GuiceComponentRegistry.java:63)

4) A binding to br.com.caelum.vraptor.ioc.fixture.CustomMethodNotAllowedHandler was already configured at br.com.caelum.vraptor.ioc.guice.GuiceComponentRegistry.bindToConstructor(GuiceComponentRegistry.java:75).
  at br.com.caelum.vraptor.ioc.guice.GuiceComponentRegistry.deepRegister(GuiceComponentRegistry.java:63)

5) A binding to br.com.caelum.vraptor.ioc.fixture.NoConstructor was already configured at br.com.caelum.vraptor.ioc.guice.GuiceComponentRegistry.bindToConstructor(GuiceComponentRegistry.java:75).
  at br.com.caelum.vraptor.ioc.guice.GuiceComponentRegistry.deepRegister(GuiceComponentRegistry.java:63)

6) A binding to br.com.caelum.vraptor.ioc.fixture.DependentOnSomethingFromComponentFactory was already configured at br.com.caelum.vraptor.ioc.guice.GuiceComponentRegistry.bindToConstructor(GuiceComponentRegistry.java:75).
  at br.com.caelum.vraptor.ioc.guice.GuiceComponentRegistry.deepRegister(GuiceComponentRegistry.java:63)

7) A binding to br.com.caelum.vraptor.ioc.fixture.CustomComponentWithLifecycleInTheClasspath was already configured at br.com.caelum.vraptor.ioc.guice.GuiceComponentRegistry.bindToConstructor(GuiceComponentRegistry.java:75).
  at br.com.caelum.vraptor.ioc.guice.GuiceComponentRegistry.deepRegister(GuiceComponentRegistry.java:63)

8) A binding to br.com.caelum.vraptor.ioc.fixture.InterceptorInTheClasspath was already configured at br.com.caelum.vraptor.ioc.guice.GuiceComponentRegistry.bindToConstructor(GuiceComponentRegistry.java:75).
  at br.com.caelum.vraptor.ioc.guice.GuiceComponentRegistry.deepRegister(GuiceComponentRegistry.java:63)

9) A binding to br.com.caelum.vraptor.ioc.fixture.CustomComponentInTheClasspath was already configured at br.com.caelum.vraptor.ioc.guice.GuiceComponentRegistry.bindToConstructor(GuiceComponentRegistry.java:75).
  at br.com.caelum.vraptor.ioc.guice.GuiceComponentRegistry.deepRegister(GuiceComponentRegistry.java:63)

10) A binding to br.com.caelum.vraptor.ioc.fixture.HasConstructor was already configured at br.com.caelum.vraptor.ioc.guice.GuiceComponentRegistry.bindToConstructor(GuiceComponentRegistry.java:75).
  at br.com.caelum.vraptor.ioc.guice.GuiceComponentRegistry.deepRegister(GuiceComponentRegistry.java:63)

11) A binding to br.com.caelum.vraptor.ioc.fixture.ConverterInTheClasspath was already configured at br.com.caelum.vraptor.ioc.guice.GuiceComponentRegistry.bindToConstructor(GuiceComponentRegistry.java:75).
  at br.com.caelum.vraptor.ioc.guice.GuiceComponentRegistry.deepRegister(GuiceComponentRegistry.java:63)

11 errors
	at com.google.inject.internal.Errors.throwCreationExceptionIfErrorsExist(Errors.java:435)
	at com.google.inject.internal.InternalInjectorCreator.initializeStatically(InternalInjectorCreator.java:154)
	at com.google.inject.internal.InternalInjectorCreator.build(InternalInjectorCreator.java:106)
	at com.google.inject.Guice.createInjector(Guice.java:95)
	at com.google.inject.Guice.createInjector(Guice.java:83)
	at br.com.caelum.vraptor.ioc.guice.GuiceProvider.start(GuiceProvider.java:97)
	at br.com.caelum.vraptor.ioc.GenericContainerTest.start(GenericContainerTest.java:288)
	at br.com.caelum.vraptor.ioc.GenericContainerTest.setup(GenericContainerTest.java:285)
	at sun.reflect.NativeMethodAccessorImpl.invoke0(Native Method)
	at sun.reflect.NativeMethodAccessorImpl.invoke(NativeMethodAccessorImpl.java:62)
	at sun.reflect.DelegatingMethodAccessorImpl.invoke(DelegatingMethodAccessorImpl.java:43)
	at java.lang.reflect.Method.invoke(Method.java:497)
	at org.junit.runners.model.FrameworkMethod$1.runReflectiveCall(FrameworkMethod.java:45)
	at org.junit.internal.runners.model.ReflectiveCallable.run(ReflectiveCallable.java:15)
	at org.junit.runners.model.FrameworkMethod.invokeExplosively(FrameworkMethod.java:42)
	at org.junit.internal.runners.statements.RunBefores.evaluate(RunBefores.java:27)
	at org.junit.internal.runners.statements.RunAfters.evaluate(RunAfters.java:30)
	at org.junit.runners.ParentRunner.runLeaf(ParentRunner.java:263)
	at org.junit.runners.BlockJUnit4ClassRunner.runChild(BlockJUnit4ClassRunner.java:68)
	at org.junit.runners.BlockJUnit4ClassRunner.runChild(BlockJUnit4ClassRunner.java:47)
	at org.junit.runners.ParentRunner$3.run(ParentRunner.java:231)
	at org.junit.runners.ParentRunner$1.schedule(ParentRunner.java:60)
	at org.junit.runners.ParentRunner.runChildren(ParentRunner.java:229)
	at org.junit.runners.ParentRunner.access$000(ParentRunner.java:50)
	at org.junit.runners.ParentRunner$2.evaluate(ParentRunner.java:222)
	at org.junit.runners.ParentRunner.run(ParentRunner.java:300)
	at org.apache.maven.surefire.junit4.JUnit4Provider.execute(JUnit4Provider.java:252)
	at org.apache.maven.surefire.junit4.JUnit4Provider.executeTestSet(JUnit4Provider.java:141)
	at org.apache.maven.surefire.junit4.JUnit4Provider.invoke(JUnit4Provider.java:112)
	at sun.reflect.NativeMethodAccessorImpl.invoke0(Native Method)
	at sun.reflect.NativeMethodAccessorImpl.invoke(NativeMethodAccessorImpl.java:62)
	at sun.reflect.DelegatingMethodAccessorImpl.invoke(DelegatingMethodAccessorImpl.java:43)
	at java.lang.reflect.Method.invoke(Method.java:497)
	at org.apache.maven.surefire.util.ReflectionUtils.invokeMethodWithArray(ReflectionUtils.java:189)
	at org.apache.maven.surefire.booter.ProviderFactory$ProviderProxy.invoke(ProviderFactory.java:165)
	at org.apache.maven.surefire.booter.ProviderFactory.invokeProvider(ProviderFactory.java:85)
	at org.apache.maven.surefire.booter.ForkedBooter.runSuitesInProcess(ForkedBooter.java:115)
	at org.apache.maven.surefire.booter.ForkedBooter.main(ForkedBooter.java:75)

canProvideAllApplicationScopedComponents(br.com.caelum.vraptor.ioc.guice.GuiceProviderTest)  Time elapsed: 0.097 sec  <<< ERROR!
com.google.inject.CreationException: Guice creation errors:

1) Binding points to itself.
  at br.com.caelum.vraptor.ioc.guice.GuiceComponentRegistry.deepRegister(GuiceComponentRegistry.java:63)

2) A binding to br.com.caelum.vraptor.ioc.fixture.ComponentFactoryInTheClasspath was already configured at br.com.caelum.vraptor.ioc.guice.GuiceComponentRegistry.bindToConstructor(GuiceComponentRegistry.java:75).
  at br.com.caelum.vraptor.ioc.guice.GuiceComponentRegistry.deepRegister(GuiceComponentRegistry.java:63)

3) A binding to br.com.caelum.vraptor.ioc.fixture.ResourceInTheClasspath was already configured at br.com.caelum.vraptor.ioc.guice.GuiceComponentRegistry.bindToConstructor(GuiceComponentRegistry.java:75).
  at br.com.caelum.vraptor.ioc.guice.GuiceComponentRegistry.deepRegister(GuiceComponentRegistry.java:63)

4) A binding to br.com.caelum.vraptor.ioc.fixture.CustomMethodNotAllowedHandler was already configured at br.com.caelum.vraptor.ioc.guice.GuiceComponentRegistry.bindToConstructor(GuiceComponentRegistry.java:75).
  at br.com.caelum.vraptor.ioc.guice.GuiceComponentRegistry.deepRegister(GuiceComponentRegistry.java:63)

5) A binding to br.com.caelum.vraptor.ioc.fixture.NoConstructor was already configured at br.com.caelum.vraptor.ioc.guice.GuiceComponentRegistry.bindToConstructor(GuiceComponentRegistry.java:75).
  at br.com.caelum.vraptor.ioc.guice.GuiceComponentRegistry.deepRegister(GuiceComponentRegistry.java:63)

6) A binding to br.com.caelum.vraptor.ioc.fixture.DependentOnSomethingFromComponentFactory was already configured at br.com.caelum.vraptor.ioc.guice.GuiceComponentRegistry.bindToConstructor(GuiceComponentRegistry.java:75).
  at br.com.caelum.vraptor.ioc.guice.GuiceComponentRegistry.deepRegister(GuiceComponentRegistry.java:63)

7) A binding to br.com.caelum.vraptor.ioc.fixture.CustomComponentWithLifecycleInTheClasspath was already configured at br.com.caelum.vraptor.ioc.guice.GuiceComponentRegistry.bindToConstructor(GuiceComponentRegistry.java:75).
  at br.com.caelum.vraptor.ioc.guice.GuiceComponentRegistry.deepRegister(GuiceComponentRegistry.java:63)

8) A binding to br.com.caelum.vraptor.ioc.fixture.InterceptorInTheClasspath was already configured at br.com.caelum.vraptor.ioc.guice.GuiceComponentRegistry.bindToConstructor(GuiceComponentRegistry.java:75).
  at br.com.caelum.vraptor.ioc.guice.GuiceComponentRegistry.deepRegister(GuiceComponentRegistry.java:63)

9) A binding to br.com.caelum.vraptor.ioc.fixture.CustomComponentInTheClasspath was already configured at br.com.caelum.vraptor.ioc.guice.GuiceComponentRegistry.bindToConstructor(GuiceComponentRegistry.java:75).
  at br.com.caelum.vraptor.ioc.guice.GuiceComponentRegistry.deepRegister(GuiceComponentRegistry.java:63)

10) A binding to br.com.caelum.vraptor.ioc.fixture.HasConstructor was already configured at br.com.caelum.vraptor.ioc.guice.GuiceComponentRegistry.bindToConstructor(GuiceComponentRegistry.java:75).
  at br.com.caelum.vraptor.ioc.guice.GuiceComponentRegistry.deepRegister(GuiceComponentRegistry.java:63)

11) A binding to br.com.caelum.vraptor.ioc.fixture.ConverterInTheClasspath was already configured at br.com.caelum.vraptor.ioc.guice.GuiceComponentRegistry.bindToConstructor(GuiceComponentRegistry.java:75).
  at br.com.caelum.vraptor.ioc.guice.GuiceComponentRegistry.deepRegister(GuiceComponentRegistry.java:63)

11 errors
	at com.google.inject.internal.Errors.throwCreationExceptionIfErrorsExist(Errors.java:435)
	at com.google.inject.internal.InternalInjectorCreator.initializeStatically(InternalInjectorCreator.java:154)
	at com.google.inject.internal.InternalInjectorCreator.build(InternalInjectorCreator.java:106)
	at com.google.inject.Guice.createInjector(Guice.java:95)
	at com.google.inject.Guice.createInjector(Guice.java:83)
	at br.com.caelum.vraptor.ioc.guice.GuiceProvider.start(GuiceProvider.java:97)
	at br.com.caelum.vraptor.ioc.GenericContainerTest.start(GenericContainerTest.java:288)
	at br.com.caelum.vraptor.ioc.GenericContainerTest.setup(GenericContainerTest.java:285)
	at sun.reflect.NativeMethodAccessorImpl.invoke0(Native Method)
	at sun.reflect.NativeMethodAccessorImpl.invoke(NativeMethodAccessorImpl.java:62)
	at sun.reflect.DelegatingMethodAccessorImpl.invoke(DelegatingMethodAccessorImpl.java:43)
	at java.lang.reflect.Method.invoke(Method.java:497)
	at org.junit.runners.model.FrameworkMethod$1.runReflectiveCall(FrameworkMethod.java:45)
	at org.junit.internal.runners.model.ReflectiveCallable.run(ReflectiveCallable.java:15)
	at org.junit.runners.model.FrameworkMethod.invokeExplosively(FrameworkMethod.java:42)
	at org.junit.internal.runners.statements.RunBefores.evaluate(RunBefores.java:27)
	at org.junit.internal.runners.statements.RunAfters.evaluate(RunAfters.java:30)
	at org.junit.runners.ParentRunner.runLeaf(ParentRunner.java:263)
	at org.junit.runners.BlockJUnit4ClassRunner.runChild(BlockJUnit4ClassRunner.java:68)
	at org.junit.runners.BlockJUnit4ClassRunner.runChild(BlockJUnit4ClassRunner.java:47)
	at org.junit.runners.ParentRunner$3.run(ParentRunner.java:231)
	at org.junit.runners.ParentRunner$1.schedule(ParentRunner.java:60)
	at org.junit.runners.ParentRunner.runChildren(ParentRunner.java:229)
	at org.junit.runners.ParentRunner.access$000(ParentRunner.java:50)
	at org.junit.runners.ParentRunner$2.evaluate(ParentRunner.java:222)
	at org.junit.runners.ParentRunner.run(ParentRunner.java:300)
	at org.apache.maven.surefire.junit4.JUnit4Provider.execute(JUnit4Provider.java:252)
	at org.apache.maven.surefire.junit4.JUnit4Provider.executeTestSet(JUnit4Provider.java:141)
	at org.apache.maven.surefire.junit4.JUnit4Provider.invoke(JUnit4Provider.java:112)
	at sun.reflect.NativeMethodAccessorImpl.invoke0(Native Method)
	at sun.reflect.NativeMethodAccessorImpl.invoke(NativeMethodAccessorImpl.java:62)
	at sun.reflect.DelegatingMethodAccessorImpl.invoke(DelegatingMethodAccessorImpl.java:43)
	at java.lang.reflect.Method.invoke(Method.java:497)
	at org.apache.maven.surefire.util.ReflectionUtils.invokeMethodWithArray(ReflectionUtils.java:189)
	at org.apache.maven.surefire.booter.ProviderFactory$ProviderProxy.invoke(ProviderFactory.java:165)
	at org.apache.maven.surefire.booter.ProviderFactory.invokeProvider(ProviderFactory.java:85)
	at org.apache.maven.surefire.booter.ForkedBooter.runSuitesInProcess(ForkedBooter.java:115)
	at org.apache.maven.surefire.booter.ForkedBooter.main(ForkedBooter.java:75)

canProvideAllPrototypeScopedComponents(br.com.caelum.vraptor.ioc.guice.GuiceProviderTest)  Time elapsed: 0.117 sec  <<< ERROR!
com.google.inject.CreationException: Guice creation errors:

1) Binding points to itself.
  at br.com.caelum.vraptor.ioc.guice.GuiceComponentRegistry.deepRegister(GuiceComponentRegistry.java:63)

2) A binding to br.com.caelum.vraptor.ioc.fixture.ComponentFactoryInTheClasspath was already configured at br.com.caelum.vraptor.ioc.guice.GuiceComponentRegistry.bindToConstructor(GuiceComponentRegistry.java:75).
  at br.com.caelum.vraptor.ioc.guice.GuiceComponentRegistry.deepRegister(GuiceComponentRegistry.java:63)

3) A binding to br.com.caelum.vraptor.ioc.fixture.ResourceInTheClasspath was already configured at br.com.caelum.vraptor.ioc.guice.GuiceComponentRegistry.bindToConstructor(GuiceComponentRegistry.java:75).
  at br.com.caelum.vraptor.ioc.guice.GuiceComponentRegistry.deepRegister(GuiceComponentRegistry.java:63)

4) A binding to br.com.caelum.vraptor.ioc.fixture.CustomMethodNotAllowedHandler was already configured at br.com.caelum.vraptor.ioc.guice.GuiceComponentRegistry.bindToConstructor(GuiceComponentRegistry.java:75).
  at br.com.caelum.vraptor.ioc.guice.GuiceComponentRegistry.deepRegister(GuiceComponentRegistry.java:63)

5) A binding to br.com.caelum.vraptor.ioc.fixture.NoConstructor was already configured at br.com.caelum.vraptor.ioc.guice.GuiceComponentRegistry.bindToConstructor(GuiceComponentRegistry.java:75).
  at br.com.caelum.vraptor.ioc.guice.GuiceComponentRegistry.deepRegister(GuiceComponentRegistry.java:63)

6) A binding to br.com.caelum.vraptor.ioc.fixture.DependentOnSomethingFromComponentFactory was already configured at br.com.caelum.vraptor.ioc.guice.GuiceComponentRegistry.bindToConstructor(GuiceComponentRegistry.java:75).
  at br.com.caelum.vraptor.ioc.guice.GuiceComponentRegistry.deepRegister(GuiceComponentRegistry.java:63)

7) A binding to br.com.caelum.vraptor.ioc.fixture.CustomComponentWithLifecycleInTheClasspath was already configured at br.com.caelum.vraptor.ioc.guice.GuiceComponentRegistry.bindToConstructor(GuiceComponentRegistry.java:75).
  at br.com.caelum.vraptor.ioc.guice.GuiceComponentRegistry.deepRegister(GuiceComponentRegistry.java:63)

8) A binding to br.com.caelum.vraptor.ioc.fixture.InterceptorInTheClasspath was already configured at br.com.caelum.vraptor.ioc.guice.GuiceComponentRegistry.bindToConstructor(GuiceComponentRegistry.java:75).
  at br.com.caelum.vraptor.ioc.guice.GuiceComponentRegistry.deepRegister(GuiceComponentRegistry.java:63)

9) A binding to br.com.caelum.vraptor.ioc.fixture.CustomComponentInTheClasspath was already configured at br.com.caelum.vraptor.ioc.guice.GuiceComponentRegistry.bindToConstructor(GuiceComponentRegistry.java:75).
  at br.com.caelum.vraptor.ioc.guice.GuiceComponentRegistry.deepRegister(GuiceComponentRegistry.java:63)

10) A binding to br.com.caelum.vraptor.ioc.fixture.HasConstructor was already configured at br.com.caelum.vraptor.ioc.guice.GuiceComponentRegistry.bindToConstructor(GuiceComponentRegistry.java:75).
  at br.com.caelum.vraptor.ioc.guice.GuiceComponentRegistry.deepRegister(GuiceComponentRegistry.java:63)

11) A binding to br.com.caelum.vraptor.ioc.fixture.ConverterInTheClasspath was already configured at br.com.caelum.vraptor.ioc.guice.GuiceComponentRegistry.bindToConstructor(GuiceComponentRegistry.java:75).
  at br.com.caelum.vraptor.ioc.guice.GuiceComponentRegistry.deepRegister(GuiceComponentRegistry.java:63)

11 errors
	at com.google.inject.internal.Errors.throwCreationExceptionIfErrorsExist(Errors.java:435)
	at com.google.inject.internal.InternalInjectorCreator.initializeStatically(InternalInjectorCreator.java:154)
	at com.google.inject.internal.InternalInjectorCreator.build(InternalInjectorCreator.java:106)
	at com.google.inject.Guice.createInjector(Guice.java:95)
	at com.google.inject.Guice.createInjector(Guice.java:83)
	at br.com.caelum.vraptor.ioc.guice.GuiceProvider.start(GuiceProvider.java:97)
	at br.com.caelum.vraptor.ioc.GenericContainerTest.start(GenericContainerTest.java:288)
	at br.com.caelum.vraptor.ioc.GenericContainerTest.setup(GenericContainerTest.java:285)
	at sun.reflect.NativeMethodAccessorImpl.invoke0(Native Method)
	at sun.reflect.NativeMethodAccessorImpl.invoke(NativeMethodAccessorImpl.java:62)
	at sun.reflect.DelegatingMethodAccessorImpl.invoke(DelegatingMethodAccessorImpl.java:43)
	at java.lang.reflect.Method.invoke(Method.java:497)
	at org.junit.runners.model.FrameworkMethod$1.runReflectiveCall(FrameworkMethod.java:45)
	at org.junit.internal.runners.model.ReflectiveCallable.run(ReflectiveCallable.java:15)
	at org.junit.runners.model.FrameworkMethod.invokeExplosively(FrameworkMethod.java:42)
	at org.junit.internal.runners.statements.RunBefores.evaluate(RunBefores.java:27)
	at org.junit.internal.runners.statements.RunAfters.evaluate(RunAfters.java:30)
	at org.junit.runners.ParentRunner.runLeaf(ParentRunner.java:263)
	at org.junit.runners.BlockJUnit4ClassRunner.runChild(BlockJUnit4ClassRunner.java:68)
	at org.junit.runners.BlockJUnit4ClassRunner.runChild(BlockJUnit4ClassRunner.java:47)
	at org.junit.runners.ParentRunner$3.run(ParentRunner.java:231)
	at org.junit.runners.ParentRunner$1.schedule(ParentRunner.java:60)
	at org.junit.runners.ParentRunner.runChildren(ParentRunner.java:229)
	at org.junit.runners.ParentRunner.access$000(ParentRunner.java:50)
	at org.junit.runners.ParentRunner$2.evaluate(ParentRunner.java:222)
	at org.junit.runners.ParentRunner.run(ParentRunner.java:300)
	at org.apache.maven.surefire.junit4.JUnit4Provider.execute(JUnit4Provider.java:252)
	at org.apache.maven.surefire.junit4.JUnit4Provider.executeTestSet(JUnit4Provider.java:141)
	at org.apache.maven.surefire.junit4.JUnit4Provider.invoke(JUnit4Provider.java:112)
	at sun.reflect.NativeMethodAccessorImpl.invoke0(Native Method)
	at sun.reflect.NativeMethodAccessorImpl.invoke(NativeMethodAccessorImpl.java:62)
	at sun.reflect.DelegatingMethodAccessorImpl.invoke(DelegatingMethodAccessorImpl.java:43)
	at java.lang.reflect.Method.invoke(Method.java:497)
	at org.apache.maven.surefire.util.ReflectionUtils.invokeMethodWithArray(ReflectionUtils.java:189)
	at org.apache.maven.surefire.booter.ProviderFactory$ProviderProxy.invoke(ProviderFactory.java:165)
	at org.apache.maven.surefire.booter.ProviderFactory.invokeProvider(ProviderFactory.java:85)
	at org.apache.maven.surefire.booter.ForkedBooter.runSuitesInProcess(ForkedBooter.java:115)
	at org.apache.maven.surefire.booter.ForkedBooter.main(ForkedBooter.java:75)

canProvideAllRequestScopedComponents(br.com.caelum.vraptor.ioc.guice.GuiceProviderTest)  Time elapsed: 0.084 sec  <<< ERROR!
com.google.inject.CreationException: Guice creation errors:

1) Binding points to itself.
  at br.com.caelum.vraptor.ioc.guice.GuiceComponentRegistry.deepRegister(GuiceComponentRegistry.java:63)

2) A binding to br.com.caelum.vraptor.ioc.fixture.ComponentFactoryInTheClasspath was already configured at br.com.caelum.vraptor.ioc.guice.GuiceComponentRegistry.bindToConstructor(GuiceComponentRegistry.java:75).
  at br.com.caelum.vraptor.ioc.guice.GuiceComponentRegistry.deepRegister(GuiceComponentRegistry.java:63)

3) A binding to br.com.caelum.vraptor.ioc.fixture.ResourceInTheClasspath was already configured at br.com.caelum.vraptor.ioc.guice.GuiceComponentRegistry.bindToConstructor(GuiceComponentRegistry.java:75).
  at br.com.caelum.vraptor.ioc.guice.GuiceComponentRegistry.deepRegister(GuiceComponentRegistry.java:63)

4) A binding to br.com.caelum.vraptor.ioc.fixture.CustomMethodNotAllowedHandler was already configured at br.com.caelum.vraptor.ioc.guice.GuiceComponentRegistry.bindToConstructor(GuiceComponentRegistry.java:75).
  at br.com.caelum.vraptor.ioc.guice.GuiceComponentRegistry.deepRegister(GuiceComponentRegistry.java:63)

5) A binding to br.com.caelum.vraptor.ioc.fixture.NoConstructor was already configured at br.com.caelum.vraptor.ioc.guice.GuiceComponentRegistry.bindToConstructor(GuiceComponentRegistry.java:75).
  at br.com.caelum.vraptor.ioc.guice.GuiceComponentRegistry.deepRegister(GuiceComponentRegistry.java:63)

6) A binding to br.com.caelum.vraptor.ioc.fixture.DependentOnSomethingFromComponentFactory was already configured at br.com.caelum.vraptor.ioc.guice.GuiceComponentRegistry.bindToConstructor(GuiceComponentRegistry.java:75).
  at br.com.caelum.vraptor.ioc.guice.GuiceComponentRegistry.deepRegister(GuiceComponentRegistry.java:63)

7) A binding to br.com.caelum.vraptor.ioc.fixture.CustomComponentWithLifecycleInTheClasspath was already configured at br.com.caelum.vraptor.ioc.guice.GuiceComponentRegistry.bindToConstructor(GuiceComponentRegistry.java:75).
  at br.com.caelum.vraptor.ioc.guice.GuiceComponentRegistry.deepRegister(GuiceComponentRegistry.java:63)

8) A binding to br.com.caelum.vraptor.ioc.fixture.InterceptorInTheClasspath was already configured at br.com.caelum.vraptor.ioc.guice.GuiceComponentRegistry.bindToConstructor(GuiceComponentRegistry.java:75).
  at br.com.caelum.vraptor.ioc.guice.GuiceComponentRegistry.deepRegister(GuiceComponentRegistry.java:63)

9) A binding to br.com.caelum.vraptor.ioc.fixture.CustomComponentInTheClasspath was already configured at br.com.caelum.vraptor.ioc.guice.GuiceComponentRegistry.bindToConstructor(GuiceComponentRegistry.java:75).
  at br.com.caelum.vraptor.ioc.guice.GuiceComponentRegistry.deepRegister(GuiceComponentRegistry.java:63)

10) A binding to br.com.caelum.vraptor.ioc.fixture.HasConstructor was already configured at br.com.caelum.vraptor.ioc.guice.GuiceComponentRegistry.bindToConstructor(GuiceComponentRegistry.java:75).
  at br.com.caelum.vraptor.ioc.guice.GuiceComponentRegistry.deepRegister(GuiceComponentRegistry.java:63)

11) A binding to br.com.caelum.vraptor.ioc.fixture.ConverterInTheClasspath was already configured at br.com.caelum.vraptor.ioc.guice.GuiceComponentRegistry.bindToConstructor(GuiceComponentRegistry.java:75).
  at br.com.caelum.vraptor.ioc.guice.GuiceComponentRegistry.deepRegister(GuiceComponentRegistry.java:63)

11 errors
	at com.google.inject.internal.Errors.throwCreationExceptionIfErrorsExist(Errors.java:435)
	at com.google.inject.internal.InternalInjectorCreator.initializeStatically(InternalInjectorCreator.java:154)
	at com.google.inject.internal.InternalInjectorCreator.build(InternalInjectorCreator.java:106)
	at com.google.inject.Guice.createInjector(Guice.java:95)
	at com.google.inject.Guice.createInjector(Guice.java:83)
	at br.com.caelum.vraptor.ioc.guice.GuiceProvider.start(GuiceProvider.java:97)
	at br.com.caelum.vraptor.ioc.GenericContainerTest.start(GenericContainerTest.java:288)
	at br.com.caelum.vraptor.ioc.GenericContainerTest.setup(GenericContainerTest.java:285)
	at sun.reflect.NativeMethodAccessorImpl.invoke0(Native Method)
	at sun.reflect.NativeMethodAccessorImpl.invoke(NativeMethodAccessorImpl.java:62)
	at sun.reflect.DelegatingMethodAccessorImpl.invoke(DelegatingMethodAccessorImpl.java:43)
	at java.lang.reflect.Method.invoke(Method.java:497)
	at org.junit.runners.model.FrameworkMethod$1.runReflectiveCall(FrameworkMethod.java:45)
	at org.junit.internal.runners.model.ReflectiveCallable.run(ReflectiveCallable.java:15)
	at org.junit.runners.model.FrameworkMethod.invokeExplosively(FrameworkMethod.java:42)
	at org.junit.internal.runners.statements.RunBefores.evaluate(RunBefores.java:27)
	at org.junit.internal.runners.statements.RunAfters.evaluate(RunAfters.java:30)
	at org.junit.runners.ParentRunner.runLeaf(ParentRunner.java:263)
	at org.junit.runners.BlockJUnit4ClassRunner.runChild(BlockJUnit4ClassRunner.java:68)
	at org.junit.runners.BlockJUnit4ClassRunner.runChild(BlockJUnit4ClassRunner.java:47)
	at org.junit.runners.ParentRunner$3.run(ParentRunner.java:231)
	at org.junit.runners.ParentRunner$1.schedule(ParentRunner.java:60)
	at org.junit.runners.ParentRunner.runChildren(ParentRunner.java:229)
	at org.junit.runners.ParentRunner.access$000(ParentRunner.java:50)
	at org.junit.runners.ParentRunner$2.evaluate(ParentRunner.java:222)
	at org.junit.runners.ParentRunner.run(ParentRunner.java:300)
	at org.apache.maven.surefire.junit4.JUnit4Provider.execute(JUnit4Provider.java:252)
	at org.apache.maven.surefire.junit4.JUnit4Provider.executeTestSet(JUnit4Provider.java:141)
	at org.apache.maven.surefire.junit4.JUnit4Provider.invoke(JUnit4Provider.java:112)
	at sun.reflect.NativeMethodAccessorImpl.invoke0(Native Method)
	at sun.reflect.NativeMethodAccessorImpl.invoke(NativeMethodAccessorImpl.java:62)
	at sun.reflect.DelegatingMethodAccessorImpl.invoke(DelegatingMethodAccessorImpl.java:43)
	at java.lang.reflect.Method.invoke(Method.java:497)
	at org.apache.maven.surefire.util.ReflectionUtils.invokeMethodWithArray(ReflectionUtils.java:189)
	at org.apache.maven.surefire.booter.ProviderFactory$ProviderProxy.invoke(ProviderFactory.java:165)
	at org.apache.maven.surefire.booter.ProviderFactory.invokeProvider(ProviderFactory.java:85)
	at org.apache.maven.surefire.booter.ForkedBooter.runSuitesInProcess(ForkedBooter.java:115)
	at org.apache.maven.surefire.booter.ForkedBooter.main(ForkedBooter.java:75)

processesCorrectlyAppBasedComponents(br.com.caelum.vraptor.ioc.guice.GuiceProviderTest)  Time elapsed: 0.083 sec  <<< ERROR!
com.google.inject.CreationException: Guice creation errors:

1) Binding points to itself.
  at br.com.caelum.vraptor.ioc.guice.GuiceComponentRegistry.deepRegister(GuiceComponentRegistry.java:63)

2) A binding to br.com.caelum.vraptor.ioc.fixture.ComponentFactoryInTheClasspath was already configured at br.com.caelum.vraptor.ioc.guice.GuiceComponentRegistry.bindToConstructor(GuiceComponentRegistry.java:75).
  at br.com.caelum.vraptor.ioc.guice.GuiceComponentRegistry.deepRegister(GuiceComponentRegistry.java:63)

3) A binding to br.com.caelum.vraptor.ioc.fixture.ResourceInTheClasspath was already configured at br.com.caelum.vraptor.ioc.guice.GuiceComponentRegistry.bindToConstructor(GuiceComponentRegistry.java:75).
  at br.com.caelum.vraptor.ioc.guice.GuiceComponentRegistry.deepRegister(GuiceComponentRegistry.java:63)

4) A binding to br.com.caelum.vraptor.ioc.fixture.CustomMethodNotAllowedHandler was already configured at br.com.caelum.vraptor.ioc.guice.GuiceComponentRegistry.bindToConstructor(GuiceComponentRegistry.java:75).
  at br.com.caelum.vraptor.ioc.guice.GuiceComponentRegistry.deepRegister(GuiceComponentRegistry.java:63)

5) A binding to br.com.caelum.vraptor.ioc.fixture.NoConstructor was already configured at br.com.caelum.vraptor.ioc.guice.GuiceComponentRegistry.bindToConstructor(GuiceComponentRegistry.java:75).
  at br.com.caelum.vraptor.ioc.guice.GuiceComponentRegistry.deepRegister(GuiceComponentRegistry.java:63)

6) A binding to br.com.caelum.vraptor.ioc.fixture.DependentOnSomethingFromComponentFactory was already configured at br.com.caelum.vraptor.ioc.guice.GuiceComponentRegistry.bindToConstructor(GuiceComponentRegistry.java:75).
  at br.com.caelum.vraptor.ioc.guice.GuiceComponentRegistry.deepRegister(GuiceComponentRegistry.java:63)

7) A binding to br.com.caelum.vraptor.ioc.fixture.CustomComponentWithLifecycleInTheClasspath was already configured at br.com.caelum.vraptor.ioc.guice.GuiceComponentRegistry.bindToConstructor(GuiceComponentRegistry.java:75).
  at br.com.caelum.vraptor.ioc.guice.GuiceComponentRegistry.deepRegister(GuiceComponentRegistry.java:63)

8) A binding to br.com.caelum.vraptor.ioc.fixture.InterceptorInTheClasspath was already configured at br.com.caelum.vraptor.ioc.guice.GuiceComponentRegistry.bindToConstructor(GuiceComponentRegistry.java:75).
  at br.com.caelum.vraptor.ioc.guice.GuiceComponentRegistry.deepRegister(GuiceComponentRegistry.java:63)

9) A binding to br.com.caelum.vraptor.ioc.fixture.CustomComponentInTheClasspath was already configured at br.com.caelum.vraptor.ioc.guice.GuiceComponentRegistry.bindToConstructor(GuiceComponentRegistry.java:75).
  at br.com.caelum.vraptor.ioc.guice.GuiceComponentRegistry.deepRegister(GuiceComponentRegistry.java:63)

10) A binding to br.com.caelum.vraptor.ioc.fixture.HasConstructor was already configured at br.com.caelum.vraptor.ioc.guice.GuiceComponentRegistry.bindToConstructor(GuiceComponentRegistry.java:75).
  at br.com.caelum.vraptor.ioc.guice.GuiceComponentRegistry.deepRegister(GuiceComponentRegistry.java:63)

11) A binding to br.com.caelum.vraptor.ioc.fixture.ConverterInTheClasspath was already configured at br.com.caelum.vraptor.ioc.guice.GuiceComponentRegistry.bindToConstructor(GuiceComponentRegistry.java:75).
  at br.com.caelum.vraptor.ioc.guice.GuiceComponentRegistry.deepRegister(GuiceComponentRegistry.java:63)

11 errors
	at com.google.inject.internal.Errors.throwCreationExceptionIfErrorsExist(Errors.java:435)
	at com.google.inject.internal.InternalInjectorCreator.initializeStatically(InternalInjectorCreator.java:154)
	at com.google.inject.internal.InternalInjectorCreator.build(InternalInjectorCreator.java:106)
	at com.google.inject.Guice.createInjector(Guice.java:95)
	at com.google.inject.Guice.createInjector(Guice.java:83)
	at br.com.caelum.vraptor.ioc.guice.GuiceProvider.start(GuiceProvider.java:97)
	at br.com.caelum.vraptor.ioc.GenericContainerTest.start(GenericContainerTest.java:288)
	at br.com.caelum.vraptor.ioc.GenericContainerTest.setup(GenericContainerTest.java:285)
	at sun.reflect.NativeMethodAccessorImpl.invoke0(Native Method)
	at sun.reflect.NativeMethodAccessorImpl.invoke(NativeMethodAccessorImpl.java:62)
	at sun.reflect.DelegatingMethodAccessorImpl.invoke(DelegatingMethodAccessorImpl.java:43)
	at java.lang.reflect.Method.invoke(Method.java:497)
	at org.junit.runners.model.FrameworkMethod$1.runReflectiveCall(FrameworkMethod.java:45)
	at org.junit.internal.runners.model.ReflectiveCallable.run(ReflectiveCallable.java:15)
	at org.junit.runners.model.FrameworkMethod.invokeExplosively(FrameworkMethod.java:42)
	at org.junit.internal.runners.statements.RunBefores.evaluate(RunBefores.java:27)
	at org.junit.internal.runners.statements.RunAfters.evaluate(RunAfters.java:30)
	at org.junit.runners.ParentRunner.runLeaf(ParentRunner.java:263)
	at org.junit.runners.BlockJUnit4ClassRunner.runChild(BlockJUnit4ClassRunner.java:68)
	at org.junit.runners.BlockJUnit4ClassRunner.runChild(BlockJUnit4ClassRunner.java:47)
	at org.junit.runners.ParentRunner$3.run(ParentRunner.java:231)
	at org.junit.runners.ParentRunner$1.schedule(ParentRunner.java:60)
	at org.junit.runners.ParentRunner.runChildren(ParentRunner.java:229)
	at org.junit.runners.ParentRunner.access$000(ParentRunner.java:50)
	at org.junit.runners.ParentRunner$2.evaluate(ParentRunner.java:222)
	at org.junit.runners.ParentRunner.run(ParentRunner.java:300)
	at org.apache.maven.surefire.junit4.JUnit4Provider.execute(JUnit4Provider.java:252)
	at org.apache.maven.surefire.junit4.JUnit4Provider.executeTestSet(JUnit4Provider.java:141)
	at org.apache.maven.surefire.junit4.JUnit4Provider.invoke(JUnit4Provider.java:112)
	at sun.reflect.NativeMethodAccessorImpl.invoke0(Native Method)
	at sun.reflect.NativeMethodAccessorImpl.invoke(NativeMethodAccessorImpl.java:62)
	at sun.reflect.DelegatingMethodAccessorImpl.invoke(DelegatingMethodAccessorImpl.java:43)
	at java.lang.reflect.Method.invoke(Method.java:497)
	at org.apache.maven.surefire.util.ReflectionUtils.invokeMethodWithArray(ReflectionUtils.java:189)
	at org.apache.maven.surefire.booter.ProviderFactory$ProviderProxy.invoke(ProviderFactory.java:165)
	at org.apache.maven.surefire.booter.ProviderFactory.invokeProvider(ProviderFactory.java:85)
	at org.apache.maven.surefire.booter.ForkedBooter.runSuitesInProcess(ForkedBooter.java:115)
	at org.apache.maven.surefire.booter.ForkedBooter.main(ForkedBooter.java:75)

canProvideJodaTimeConverters(br.com.caelum.vraptor.ioc.guice.GuiceProviderTest)  Time elapsed: 0.088 sec  <<< ERROR!
com.google.inject.CreationException: Guice creation errors:

1) Binding points to itself.
  at br.com.caelum.vraptor.ioc.guice.GuiceComponentRegistry.deepRegister(GuiceComponentRegistry.java:63)

2) A binding to br.com.caelum.vraptor.ioc.fixture.ComponentFactoryInTheClasspath was already configured at br.com.caelum.vraptor.ioc.guice.GuiceComponentRegistry.bindToConstructor(GuiceComponentRegistry.java:75).
  at br.com.caelum.vraptor.ioc.guice.GuiceComponentRegistry.deepRegister(GuiceComponentRegistry.java:63)

3) A binding to br.com.caelum.vraptor.ioc.fixture.ResourceInTheClasspath was already configured at br.com.caelum.vraptor.ioc.guice.GuiceComponentRegistry.bindToConstructor(GuiceComponentRegistry.java:75).
  at br.com.caelum.vraptor.ioc.guice.GuiceComponentRegistry.deepRegister(GuiceComponentRegistry.java:63)

4) A binding to br.com.caelum.vraptor.ioc.fixture.CustomMethodNotAllowedHandler was already configured at br.com.caelum.vraptor.ioc.guice.GuiceComponentRegistry.bindToConstructor(GuiceComponentRegistry.java:75).
  at br.com.caelum.vraptor.ioc.guice.GuiceComponentRegistry.deepRegister(GuiceComponentRegistry.java:63)

5) A binding to br.com.caelum.vraptor.ioc.fixture.NoConstructor was already configured at br.com.caelum.vraptor.ioc.guice.GuiceComponentRegistry.bindToConstructor(GuiceComponentRegistry.java:75).
  at br.com.caelum.vraptor.ioc.guice.GuiceComponentRegistry.deepRegister(GuiceComponentRegistry.java:63)

6) A binding to br.com.caelum.vraptor.ioc.fixture.DependentOnSomethingFromComponentFactory was already configured at br.com.caelum.vraptor.ioc.guice.GuiceComponentRegistry.bindToConstructor(GuiceComponentRegistry.java:75).
  at br.com.caelum.vraptor.ioc.guice.GuiceComponentRegistry.deepRegister(GuiceComponentRegistry.java:63)

7) A binding to br.com.caelum.vraptor.ioc.fixture.CustomComponentWithLifecycleInTheClasspath was already configured at br.com.caelum.vraptor.ioc.guice.GuiceComponentRegistry.bindToConstructor(GuiceComponentRegistry.java:75).
  at br.com.caelum.vraptor.ioc.guice.GuiceComponentRegistry.deepRegister(GuiceComponentRegistry.java:63)

8) A binding to br.com.caelum.vraptor.ioc.fixture.InterceptorInTheClasspath was already configured at br.com.caelum.vraptor.ioc.guice.GuiceComponentRegistry.bindToConstructor(GuiceComponentRegistry.java:75).
  at br.com.caelum.vraptor.ioc.guice.GuiceComponentRegistry.deepRegister(GuiceComponentRegistry.java:63)

9) A binding to br.com.caelum.vraptor.ioc.fixture.CustomComponentInTheClasspath was already configured at br.com.caelum.vraptor.ioc.guice.GuiceComponentRegistry.bindToConstructor(GuiceComponentRegistry.java:75).
  at br.com.caelum.vraptor.ioc.guice.GuiceComponentRegistry.deepRegister(GuiceComponentRegistry.java:63)

10) A binding to br.com.caelum.vraptor.ioc.fixture.HasConstructor was already configured at br.com.caelum.vraptor.ioc.guice.GuiceComponentRegistry.bindToConstructor(GuiceComponentRegistry.java:75).
  at br.com.caelum.vraptor.ioc.guice.GuiceComponentRegistry.deepRegister(GuiceComponentRegistry.java:63)

11) A binding to br.com.caelum.vraptor.ioc.fixture.ConverterInTheClasspath was already configured at br.com.caelum.vraptor.ioc.guice.GuiceComponentRegistry.bindToConstructor(GuiceComponentRegistry.java:75).
  at br.com.caelum.vraptor.ioc.guice.GuiceComponentRegistry.deepRegister(GuiceComponentRegistry.java:63)

11 errors
	at com.google.inject.internal.Errors.throwCreationExceptionIfErrorsExist(Errors.java:435)
	at com.google.inject.internal.InternalInjectorCreator.initializeStatically(InternalInjectorCreator.java:154)
	at com.google.inject.internal.InternalInjectorCreator.build(InternalInjectorCreator.java:106)
	at com.google.inject.Guice.createInjector(Guice.java:95)
	at com.google.inject.Guice.createInjector(Guice.java:83)
	at br.com.caelum.vraptor.ioc.guice.GuiceProvider.start(GuiceProvider.java:97)
	at br.com.caelum.vraptor.ioc.GenericContainerTest.start(GenericContainerTest.java:288)
	at br.com.caelum.vraptor.ioc.GenericContainerTest.setup(GenericContainerTest.java:285)
	at sun.reflect.NativeMethodAccessorImpl.invoke0(Native Method)
	at sun.reflect.NativeMethodAccessorImpl.invoke(NativeMethodAccessorImpl.java:62)
	at sun.reflect.DelegatingMethodAccessorImpl.invoke(DelegatingMethodAccessorImpl.java:43)
	at java.lang.reflect.Method.invoke(Method.java:497)
	at org.junit.runners.model.FrameworkMethod$1.runReflectiveCall(FrameworkMethod.java:45)
	at org.junit.internal.runners.model.ReflectiveCallable.run(ReflectiveCallable.java:15)
	at org.junit.runners.model.FrameworkMethod.invokeExplosively(FrameworkMethod.java:42)
	at org.junit.internal.runners.statements.RunBefores.evaluate(RunBefores.java:27)
	at org.junit.internal.runners.statements.RunAfters.evaluate(RunAfters.java:30)
	at org.junit.runners.ParentRunner.runLeaf(ParentRunner.java:263)
	at org.junit.runners.BlockJUnit4ClassRunner.runChild(BlockJUnit4ClassRunner.java:68)
	at org.junit.runners.BlockJUnit4ClassRunner.runChild(BlockJUnit4ClassRunner.java:47)
	at org.junit.runners.ParentRunner$3.run(ParentRunner.java:231)
	at org.junit.runners.ParentRunner$1.schedule(ParentRunner.java:60)
	at org.junit.runners.ParentRunner.runChildren(ParentRunner.java:229)
	at org.junit.runners.ParentRunner.access$000(ParentRunner.java:50)
	at org.junit.runners.ParentRunner$2.evaluate(ParentRunner.java:222)
	at org.junit.runners.ParentRunner.run(ParentRunner.java:300)
	at org.apache.maven.surefire.junit4.JUnit4Provider.execute(JUnit4Provider.java:252)
	at org.apache.maven.surefire.junit4.JUnit4Provider.executeTestSet(JUnit4Provider.java:141)
	at org.apache.maven.surefire.junit4.JUnit4Provider.invoke(JUnit4Provider.java:112)
	at sun.reflect.NativeMethodAccessorImpl.invoke0(Native Method)
	at sun.reflect.NativeMethodAccessorImpl.invoke(NativeMethodAccessorImpl.java:62)
	at sun.reflect.DelegatingMethodAccessorImpl.invoke(DelegatingMethodAccessorImpl.java:43)
	at java.lang.reflect.Method.invoke(Method.java:497)
	at org.apache.maven.surefire.util.ReflectionUtils.invokeMethodWithArray(ReflectionUtils.java:189)
	at org.apache.maven.surefire.booter.ProviderFactory$ProviderProxy.invoke(ProviderFactory.java:165)
	at org.apache.maven.surefire.booter.ProviderFactory.invokeProvider(ProviderFactory.java:85)
	at org.apache.maven.surefire.booter.ForkedBooter.runSuitesInProcess(ForkedBooter.java:115)
	at org.apache.maven.surefire.booter.ForkedBooter.main(ForkedBooter.java:75)

callsPredestroyExactlyOneTime(br.com.caelum.vraptor.ioc.guice.GuiceProviderTest)  Time elapsed: 0.086 sec  <<< ERROR!
com.google.inject.CreationException: Guice creation errors:

1) Binding points to itself.
  at br.com.caelum.vraptor.ioc.guice.GuiceComponentRegistry.deepRegister(GuiceComponentRegistry.java:63)

2) A binding to br.com.caelum.vraptor.ioc.fixture.ComponentFactoryInTheClasspath was already configured at br.com.caelum.vraptor.ioc.guice.GuiceComponentRegistry.bindToConstructor(GuiceComponentRegistry.java:75).
  at br.com.caelum.vraptor.ioc.guice.GuiceComponentRegistry.deepRegister(GuiceComponentRegistry.java:63)

3) A binding to br.com.caelum.vraptor.ioc.fixture.ResourceInTheClasspath was already configured at br.com.caelum.vraptor.ioc.guice.GuiceComponentRegistry.bindToConstructor(GuiceComponentRegistry.java:75).
  at br.com.caelum.vraptor.ioc.guice.GuiceComponentRegistry.deepRegister(GuiceComponentRegistry.java:63)

4) A binding to br.com.caelum.vraptor.ioc.fixture.CustomMethodNotAllowedHandler was already configured at br.com.caelum.vraptor.ioc.guice.GuiceComponentRegistry.bindToConstructor(GuiceComponentRegistry.java:75).
  at br.com.caelum.vraptor.ioc.guice.GuiceComponentRegistry.deepRegister(GuiceComponentRegistry.java:63)

5) A binding to br.com.caelum.vraptor.ioc.fixture.NoConstructor was already configured at br.com.caelum.vraptor.ioc.guice.GuiceComponentRegistry.bindToConstructor(GuiceComponentRegistry.java:75).
  at br.com.caelum.vraptor.ioc.guice.GuiceComponentRegistry.deepRegister(GuiceComponentRegistry.java:63)

6) A binding to br.com.caelum.vraptor.ioc.fixture.DependentOnSomethingFromComponentFactory was already configured at br.com.caelum.vraptor.ioc.guice.GuiceComponentRegistry.bindToConstructor(GuiceComponentRegistry.java:75).
  at br.com.caelum.vraptor.ioc.guice.GuiceComponentRegistry.deepRegister(GuiceComponentRegistry.java:63)

7) A binding to br.com.caelum.vraptor.ioc.fixture.CustomComponentWithLifecycleInTheClasspath was already configured at br.com.caelum.vraptor.ioc.guice.GuiceComponentRegistry.bindToConstructor(GuiceComponentRegistry.java:75).
  at br.com.caelum.vraptor.ioc.guice.GuiceComponentRegistry.deepRegister(GuiceComponentRegistry.java:63)

8) A binding to br.com.caelum.vraptor.ioc.fixture.InterceptorInTheClasspath was already configured at br.com.caelum.vraptor.ioc.guice.GuiceComponentRegistry.bindToConstructor(GuiceComponentRegistry.java:75).
  at br.com.caelum.vraptor.ioc.guice.GuiceComponentRegistry.deepRegister(GuiceComponentRegistry.java:63)

9) A binding to br.com.caelum.vraptor.ioc.fixture.CustomComponentInTheClasspath was already configured at br.com.caelum.vraptor.ioc.guice.GuiceComponentRegistry.bindToConstructor(GuiceComponentRegistry.java:75).
  at br.com.caelum.vraptor.ioc.guice.GuiceComponentRegistry.deepRegister(GuiceComponentRegistry.java:63)

10) A binding to br.com.caelum.vraptor.ioc.fixture.HasConstructor was already configured at br.com.caelum.vraptor.ioc.guice.GuiceComponentRegistry.bindToConstructor(GuiceComponentRegistry.java:75).
  at br.com.caelum.vraptor.ioc.guice.GuiceComponentRegistry.deepRegister(GuiceComponentRegistry.java:63)

11) A binding to br.com.caelum.vraptor.ioc.fixture.ConverterInTheClasspath was already configured at br.com.caelum.vraptor.ioc.guice.GuiceComponentRegistry.bindToConstructor(GuiceComponentRegistry.java:75).
  at br.com.caelum.vraptor.ioc.guice.GuiceComponentRegistry.deepRegister(GuiceComponentRegistry.java:63)

11 errors
	at com.google.inject.internal.Errors.throwCreationExceptionIfErrorsExist(Errors.java:435)
	at com.google.inject.internal.InternalInjectorCreator.initializeStatically(InternalInjectorCreator.java:154)
	at com.google.inject.internal.InternalInjectorCreator.build(InternalInjectorCreator.java:106)
	at com.google.inject.Guice.createInjector(Guice.java:95)
	at com.google.inject.Guice.createInjector(Guice.java:83)
	at br.com.caelum.vraptor.ioc.guice.GuiceProvider.start(GuiceProvider.java:97)
	at br.com.caelum.vraptor.ioc.GenericContainerTest.start(GenericContainerTest.java:288)
	at br.com.caelum.vraptor.ioc.GenericContainerTest.setup(GenericContainerTest.java:285)
	at sun.reflect.NativeMethodAccessorImpl.invoke0(Native Method)
	at sun.reflect.NativeMethodAccessorImpl.invoke(NativeMethodAccessorImpl.java:62)
	at sun.reflect.DelegatingMethodAccessorImpl.invoke(DelegatingMethodAccessorImpl.java:43)
	at java.lang.reflect.Method.invoke(Method.java:497)
	at org.junit.runners.model.FrameworkMethod$1.runReflectiveCall(FrameworkMethod.java:45)
	at org.junit.internal.runners.model.ReflectiveCallable.run(ReflectiveCallable.java:15)
	at org.junit.runners.model.FrameworkMethod.invokeExplosively(FrameworkMethod.java:42)
	at org.junit.internal.runners.statements.RunBefores.evaluate(RunBefores.java:27)
	at org.junit.internal.runners.statements.RunAfters.evaluate(RunAfters.java:30)
	at org.junit.runners.ParentRunner.runLeaf(ParentRunner.java:263)
	at org.junit.runners.BlockJUnit4ClassRunner.runChild(BlockJUnit4ClassRunner.java:68)
	at org.junit.runners.BlockJUnit4ClassRunner.runChild(BlockJUnit4ClassRunner.java:47)
	at org.junit.runners.ParentRunner$3.run(ParentRunner.java:231)
	at org.junit.runners.ParentRunner$1.schedule(ParentRunner.java:60)
	at org.junit.runners.ParentRunner.runChildren(ParentRunner.java:229)
	at org.junit.runners.ParentRunner.access$000(ParentRunner.java:50)
	at org.junit.runners.ParentRunner$2.evaluate(ParentRunner.java:222)
	at org.junit.runners.ParentRunner.run(ParentRunner.java:300)
	at org.apache.maven.surefire.junit4.JUnit4Provider.execute(JUnit4Provider.java:252)
	at org.apache.maven.surefire.junit4.JUnit4Provider.executeTestSet(JUnit4Provider.java:141)
	at org.apache.maven.surefire.junit4.JUnit4Provider.invoke(JUnit4Provider.java:112)
	at sun.reflect.NativeMethodAccessorImpl.invoke0(Native Method)
	at sun.reflect.NativeMethodAccessorImpl.invoke(NativeMethodAccessorImpl.java:62)
	at sun.reflect.DelegatingMethodAccessorImpl.invoke(DelegatingMethodAccessorImpl.java:43)
	at java.lang.reflect.Method.invoke(Method.java:497)
	at org.apache.maven.surefire.util.ReflectionUtils.invokeMethodWithArray(ReflectionUtils.java:189)
	at org.apache.maven.surefire.booter.ProviderFactory$ProviderProxy.invoke(ProviderFactory.java:165)
	at org.apache.maven.surefire.booter.ProviderFactory.invokeProvider(ProviderFactory.java:85)
	at org.apache.maven.surefire.booter.ForkedBooter.runSuitesInProcess(ForkedBooter.java:115)
	at org.apache.maven.surefire.booter.ForkedBooter.main(ForkedBooter.java:75)

setsAnAttributeOnRequestWithTheObjectTypeName(br.com.caelum.vraptor.ioc.guice.GuiceProviderTest)  Time elapsed: 0.098 sec  <<< ERROR!
com.google.inject.CreationException: Guice creation errors:

1) Binding points to itself.
  at br.com.caelum.vraptor.ioc.guice.GuiceComponentRegistry.deepRegister(GuiceComponentRegistry.java:63)

2) A binding to br.com.caelum.vraptor.ioc.fixture.ComponentFactoryInTheClasspath was already configured at br.com.caelum.vraptor.ioc.guice.GuiceComponentRegistry.bindToConstructor(GuiceComponentRegistry.java:75).
  at br.com.caelum.vraptor.ioc.guice.GuiceComponentRegistry.deepRegister(GuiceComponentRegistry.java:63)

3) A binding to br.com.caelum.vraptor.ioc.fixture.ResourceInTheClasspath was already configured at br.com.caelum.vraptor.ioc.guice.GuiceComponentRegistry.bindToConstructor(GuiceComponentRegistry.java:75).
  at br.com.caelum.vraptor.ioc.guice.GuiceComponentRegistry.deepRegister(GuiceComponentRegistry.java:63)

4) A binding to br.com.caelum.vraptor.ioc.fixture.CustomMethodNotAllowedHandler was already configured at br.com.caelum.vraptor.ioc.guice.GuiceComponentRegistry.bindToConstructor(GuiceComponentRegistry.java:75).
  at br.com.caelum.vraptor.ioc.guice.GuiceComponentRegistry.deepRegister(GuiceComponentRegistry.java:63)

5) A binding to br.com.caelum.vraptor.ioc.fixture.NoConstructor was already configured at br.com.caelum.vraptor.ioc.guice.GuiceComponentRegistry.bindToConstructor(GuiceComponentRegistry.java:75).
  at br.com.caelum.vraptor.ioc.guice.GuiceComponentRegistry.deepRegister(GuiceComponentRegistry.java:63)

6) A binding to br.com.caelum.vraptor.ioc.fixture.DependentOnSomethingFromComponentFactory was already configured at br.com.caelum.vraptor.ioc.guice.GuiceComponentRegistry.bindToConstructor(GuiceComponentRegistry.java:75).
  at br.com.caelum.vraptor.ioc.guice.GuiceComponentRegistry.deepRegister(GuiceComponentRegistry.java:63)

7) A binding to br.com.caelum.vraptor.ioc.fixture.CustomComponentWithLifecycleInTheClasspath was already configured at br.com.caelum.vraptor.ioc.guice.GuiceComponentRegistry.bindToConstructor(GuiceComponentRegistry.java:75).
  at br.com.caelum.vraptor.ioc.guice.GuiceComponentRegistry.deepRegister(GuiceComponentRegistry.java:63)

8) A binding to br.com.caelum.vraptor.ioc.fixture.InterceptorInTheClasspath was already configured at br.com.caelum.vraptor.ioc.guice.GuiceComponentRegistry.bindToConstructor(GuiceComponentRegistry.java:75).
  at br.com.caelum.vraptor.ioc.guice.GuiceComponentRegistry.deepRegister(GuiceComponentRegistry.java:63)

9) A binding to br.com.caelum.vraptor.ioc.fixture.CustomComponentInTheClasspath was already configured at br.com.caelum.vraptor.ioc.guice.GuiceComponentRegistry.bindToConstructor(GuiceComponentRegistry.java:75).
  at br.com.caelum.vraptor.ioc.guice.GuiceComponentRegistry.deepRegister(GuiceComponentRegistry.java:63)

10) A binding to br.com.caelum.vraptor.ioc.fixture.HasConstructor was already configured at br.com.caelum.vraptor.ioc.guice.GuiceComponentRegistry.bindToConstructor(GuiceComponentRegistry.java:75).
  at br.com.caelum.vraptor.ioc.guice.GuiceComponentRegistry.deepRegister(GuiceComponentRegistry.java:63)

11) A binding to br.com.caelum.vraptor.ioc.fixture.ConverterInTheClasspath was already configured at br.com.caelum.vraptor.ioc.guice.GuiceComponentRegistry.bindToConstructor(GuiceComponentRegistry.java:75).
  at br.com.caelum.vraptor.ioc.guice.GuiceComponentRegistry.deepRegister(GuiceComponentRegistry.java:63)

11 errors
	at com.google.inject.internal.Errors.throwCreationExceptionIfErrorsExist(Errors.java:435)
	at com.google.inject.internal.InternalInjectorCreator.initializeStatically(InternalInjectorCreator.java:154)
	at com.google.inject.internal.InternalInjectorCreator.build(InternalInjectorCreator.java:106)
	at com.google.inject.Guice.createInjector(Guice.java:95)
	at com.google.inject.Guice.createInjector(Guice.java:83)
	at br.com.caelum.vraptor.ioc.guice.GuiceProvider.start(GuiceProvider.java:97)
	at br.com.caelum.vraptor.ioc.GenericContainerTest.start(GenericContainerTest.java:288)
	at br.com.caelum.vraptor.ioc.GenericContainerTest.setup(GenericContainerTest.java:285)
	at sun.reflect.NativeMethodAccessorImpl.invoke0(Native Method)
	at sun.reflect.NativeMethodAccessorImpl.invoke(NativeMethodAccessorImpl.java:62)
	at sun.reflect.DelegatingMethodAccessorImpl.invoke(DelegatingMethodAccessorImpl.java:43)
	at java.lang.reflect.Method.invoke(Method.java:497)
	at org.junit.runners.model.FrameworkMethod$1.runReflectiveCall(FrameworkMethod.java:45)
	at org.junit.internal.runners.model.ReflectiveCallable.run(ReflectiveCallable.java:15)
	at org.junit.runners.model.FrameworkMethod.invokeExplosively(FrameworkMethod.java:42)
	at org.junit.internal.runners.statements.RunBefores.evaluate(RunBefores.java:27)
	at org.junit.internal.runners.statements.RunAfters.evaluate(RunAfters.java:30)
	at org.junit.runners.ParentRunner.runLeaf(ParentRunner.java:263)
	at org.junit.runners.BlockJUnit4ClassRunner.runChild(BlockJUnit4ClassRunner.java:68)
	at org.junit.runners.BlockJUnit4ClassRunner.runChild(BlockJUnit4ClassRunner.java:47)
	at org.junit.runners.ParentRunner$3.run(ParentRunner.java:231)
	at org.junit.runners.ParentRunner$1.schedule(ParentRunner.java:60)
	at org.junit.runners.ParentRunner.runChildren(ParentRunner.java:229)
	at org.junit.runners.ParentRunner.access$000(ParentRunner.java:50)
	at org.junit.runners.ParentRunner$2.evaluate(ParentRunner.java:222)
	at org.junit.runners.ParentRunner.run(ParentRunner.java:300)
	at org.apache.maven.surefire.junit4.JUnit4Provider.execute(JUnit4Provider.java:252)
	at org.apache.maven.surefire.junit4.JUnit4Provider.executeTestSet(JUnit4Provider.java:141)
	at org.apache.maven.surefire.junit4.JUnit4Provider.invoke(JUnit4Provider.java:112)
	at sun.reflect.NativeMethodAccessorImpl.invoke0(Native Method)
	at sun.reflect.NativeMethodAccessorImpl.invoke(NativeMethodAccessorImpl.java:62)
	at sun.reflect.DelegatingMethodAccessorImpl.invoke(DelegatingMethodAccessorImpl.java:43)
	at java.lang.reflect.Method.invoke(Method.java:497)
	at org.apache.maven.surefire.util.ReflectionUtils.invokeMethodWithArray(ReflectionUtils.java:189)
	at org.apache.maven.surefire.booter.ProviderFactory$ProviderProxy.invoke(ProviderFactory.java:165)
	at org.apache.maven.surefire.booter.ProviderFactory.invokeProvider(ProviderFactory.java:85)
	at org.apache.maven.surefire.booter.ForkedBooter.runSuitesInProcess(ForkedBooter.java:115)
	at org.apache.maven.surefire.booter.ForkedBooter.main(ForkedBooter.java:75)

setsAnAttributeOnSessionWithTheObjectTypeName(br.com.caelum.vraptor.ioc.guice.GuiceProviderTest)  Time elapsed: 0.119 sec  <<< ERROR!
com.google.inject.CreationException: Guice creation errors:

1) Binding points to itself.
  at br.com.caelum.vraptor.ioc.guice.GuiceComponentRegistry.deepRegister(GuiceComponentRegistry.java:63)

2) A binding to br.com.caelum.vraptor.ioc.fixture.ComponentFactoryInTheClasspath was already configured at br.com.caelum.vraptor.ioc.guice.GuiceComponentRegistry.bindToConstructor(GuiceComponentRegistry.java:75).
  at br.com.caelum.vraptor.ioc.guice.GuiceComponentRegistry.deepRegister(GuiceComponentRegistry.java:63)

3) A binding to br.com.caelum.vraptor.ioc.fixture.ResourceInTheClasspath was already configured at br.com.caelum.vraptor.ioc.guice.GuiceComponentRegistry.bindToConstructor(GuiceComponentRegistry.java:75).
  at br.com.caelum.vraptor.ioc.guice.GuiceComponentRegistry.deepRegister(GuiceComponentRegistry.java:63)

4) A binding to br.com.caelum.vraptor.ioc.fixture.CustomMethodNotAllowedHandler was already configured at br.com.caelum.vraptor.ioc.guice.GuiceComponentRegistry.bindToConstructor(GuiceComponentRegistry.java:75).
  at br.com.caelum.vraptor.ioc.guice.GuiceComponentRegistry.deepRegister(GuiceComponentRegistry.java:63)

5) A binding to br.com.caelum.vraptor.ioc.fixture.NoConstructor was already configured at br.com.caelum.vraptor.ioc.guice.GuiceComponentRegistry.bindToConstructor(GuiceComponentRegistry.java:75).
  at br.com.caelum.vraptor.ioc.guice.GuiceComponentRegistry.deepRegister(GuiceComponentRegistry.java:63)

6) A binding to br.com.caelum.vraptor.ioc.fixture.DependentOnSomethingFromComponentFactory was already configured at br.com.caelum.vraptor.ioc.guice.GuiceComponentRegistry.bindToConstructor(GuiceComponentRegistry.java:75).
  at br.com.caelum.vraptor.ioc.guice.GuiceComponentRegistry.deepRegister(GuiceComponentRegistry.java:63)

7) A binding to br.com.caelum.vraptor.ioc.fixture.CustomComponentWithLifecycleInTheClasspath was already configured at br.com.caelum.vraptor.ioc.guice.GuiceComponentRegistry.bindToConstructor(GuiceComponentRegistry.java:75).
  at br.com.caelum.vraptor.ioc.guice.GuiceComponentRegistry.deepRegister(GuiceComponentRegistry.java:63)

8) A binding to br.com.caelum.vraptor.ioc.fixture.InterceptorInTheClasspath was already configured at br.com.caelum.vraptor.ioc.guice.GuiceComponentRegistry.bindToConstructor(GuiceComponentRegistry.java:75).
  at br.com.caelum.vraptor.ioc.guice.GuiceComponentRegistry.deepRegister(GuiceComponentRegistry.java:63)

9) A binding to br.com.caelum.vraptor.ioc.fixture.CustomComponentInTheClasspath was already configured at br.com.caelum.vraptor.ioc.guice.GuiceComponentRegistry.bindToConstructor(GuiceComponentRegistry.java:75).
  at br.com.caelum.vraptor.ioc.guice.GuiceComponentRegistry.deepRegister(GuiceComponentRegistry.java:63)

10) A binding to br.com.caelum.vraptor.ioc.fixture.HasConstructor was already configured at br.com.caelum.vraptor.ioc.guice.GuiceComponentRegistry.bindToConstructor(GuiceComponentRegistry.java:75).
  at br.com.caelum.vraptor.ioc.guice.GuiceComponentRegistry.deepRegister(GuiceComponentRegistry.java:63)

11) A binding to br.com.caelum.vraptor.ioc.fixture.ConverterInTheClasspath was already configured at br.com.caelum.vraptor.ioc.guice.GuiceComponentRegistry.bindToConstructor(GuiceComponentRegistry.java:75).
  at br.com.caelum.vraptor.ioc.guice.GuiceComponentRegistry.deepRegister(GuiceComponentRegistry.java:63)

11 errors
	at com.google.inject.internal.Errors.throwCreationExceptionIfErrorsExist(Errors.java:435)
	at com.google.inject.internal.InternalInjectorCreator.initializeStatically(InternalInjectorCreator.java:154)
	at com.google.inject.internal.InternalInjectorCreator.build(InternalInjectorCreator.java:106)
	at com.google.inject.Guice.createInjector(Guice.java:95)
	at com.google.inject.Guice.createInjector(Guice.java:83)
	at br.com.caelum.vraptor.ioc.guice.GuiceProvider.start(GuiceProvider.java:97)
	at br.com.caelum.vraptor.ioc.GenericContainerTest.start(GenericContainerTest.java:288)
	at br.com.caelum.vraptor.ioc.GenericContainerTest.setup(GenericContainerTest.java:285)
	at sun.reflect.NativeMethodAccessorImpl.invoke0(Native Method)
	at sun.reflect.NativeMethodAccessorImpl.invoke(NativeMethodAccessorImpl.java:62)
	at sun.reflect.DelegatingMethodAccessorImpl.invoke(DelegatingMethodAccessorImpl.java:43)
	at java.lang.reflect.Method.invoke(Method.java:497)
	at org.junit.runners.model.FrameworkMethod$1.runReflectiveCall(FrameworkMethod.java:45)
	at org.junit.internal.runners.model.ReflectiveCallable.run(ReflectiveCallable.java:15)
	at org.junit.runners.model.FrameworkMethod.invokeExplosively(FrameworkMethod.java:42)
	at org.junit.internal.runners.statements.RunBefores.evaluate(RunBefores.java:27)
	at org.junit.internal.runners.statements.RunAfters.evaluate(RunAfters.java:30)
	at org.junit.runners.ParentRunner.runLeaf(ParentRunner.java:263)
	at org.junit.runners.BlockJUnit4ClassRunner.runChild(BlockJUnit4ClassRunner.java:68)
	at org.junit.runners.BlockJUnit4ClassRunner.runChild(BlockJUnit4ClassRunner.java:47)
	at org.junit.runners.ParentRunner$3.run(ParentRunner.java:231)
	at org.junit.runners.ParentRunner$1.schedule(ParentRunner.java:60)
	at org.junit.runners.ParentRunner.runChildren(ParentRunner.java:229)
	at org.junit.runners.ParentRunner.access$000(ParentRunner.java:50)
	at org.junit.runners.ParentRunner$2.evaluate(ParentRunner.java:222)
	at org.junit.runners.ParentRunner.run(ParentRunner.java:300)
	at org.apache.maven.surefire.junit4.JUnit4Provider.execute(JUnit4Provider.java:252)
	at org.apache.maven.surefire.junit4.JUnit4Provider.executeTestSet(JUnit4Provider.java:141)
	at org.apache.maven.surefire.junit4.JUnit4Provider.invoke(JUnit4Provider.java:112)
	at sun.reflect.NativeMethodAccessorImpl.invoke0(Native Method)
	at sun.reflect.NativeMethodAccessorImpl.invoke(NativeMethodAccessorImpl.java:62)
	at sun.reflect.DelegatingMethodAccessorImpl.invoke(DelegatingMethodAccessorImpl.java:43)
	at java.lang.reflect.Method.invoke(Method.java:497)
	at org.apache.maven.surefire.util.ReflectionUtils.invokeMethodWithArray(ReflectionUtils.java:189)
	at org.apache.maven.surefire.booter.ProviderFactory$ProviderProxy.invoke(ProviderFactory.java:165)
	at org.apache.maven.surefire.booter.ProviderFactory.invokeProvider(ProviderFactory.java:85)
	at org.apache.maven.surefire.booter.ForkedBooter.runSuitesInProcess(ForkedBooter.java:115)
	at org.apache.maven.surefire.booter.ForkedBooter.main(ForkedBooter.java:75)

processesCorrectlyRequestBasedComponents(br.com.caelum.vraptor.ioc.guice.GuiceProviderTest)  Time elapsed: 0.049 sec  <<< ERROR!
com.google.inject.CreationException: Guice creation errors:

1) Binding points to itself.
  at br.com.caelum.vraptor.ioc.guice.GuiceComponentRegistry.deepRegister(GuiceComponentRegistry.java:63)

2) A binding to br.com.caelum.vraptor.ioc.fixture.ComponentFactoryInTheClasspath was already configured at br.com.caelum.vraptor.ioc.guice.GuiceComponentRegistry.bindToConstructor(GuiceComponentRegistry.java:75).
  at br.com.caelum.vraptor.ioc.guice.GuiceComponentRegistry.deepRegister(GuiceComponentRegistry.java:63)

3) A binding to br.com.caelum.vraptor.ioc.fixture.ResourceInTheClasspath was already configured at br.com.caelum.vraptor.ioc.guice.GuiceComponentRegistry.bindToConstructor(GuiceComponentRegistry.java:75).
  at br.com.caelum.vraptor.ioc.guice.GuiceComponentRegistry.deepRegister(GuiceComponentRegistry.java:63)

4) A binding to br.com.caelum.vraptor.ioc.fixture.CustomMethodNotAllowedHandler was already configured at br.com.caelum.vraptor.ioc.guice.GuiceComponentRegistry.bindToConstructor(GuiceComponentRegistry.java:75).
  at br.com.caelum.vraptor.ioc.guice.GuiceComponentRegistry.deepRegister(GuiceComponentRegistry.java:63)

5) A binding to br.com.caelum.vraptor.ioc.fixture.NoConstructor was already configured at br.com.caelum.vraptor.ioc.guice.GuiceComponentRegistry.bindToConstructor(GuiceComponentRegistry.java:75).
  at br.com.caelum.vraptor.ioc.guice.GuiceComponentRegistry.deepRegister(GuiceComponentRegistry.java:63)

6) A binding to br.com.caelum.vraptor.ioc.fixture.DependentOnSomethingFromComponentFactory was already configured at br.com.caelum.vraptor.ioc.guice.GuiceComponentRegistry.bindToConstructor(GuiceComponentRegistry.java:75).
  at br.com.caelum.vraptor.ioc.guice.GuiceComponentRegistry.deepRegister(GuiceComponentRegistry.java:63)

7) A binding to br.com.caelum.vraptor.ioc.fixture.CustomComponentWithLifecycleInTheClasspath was already configured at br.com.caelum.vraptor.ioc.guice.GuiceComponentRegistry.bindToConstructor(GuiceComponentRegistry.java:75).
  at br.com.caelum.vraptor.ioc.guice.GuiceComponentRegistry.deepRegister(GuiceComponentRegistry.java:63)

8) A binding to br.com.caelum.vraptor.ioc.fixture.InterceptorInTheClasspath was already configured at br.com.caelum.vraptor.ioc.guice.GuiceComponentRegistry.bindToConstructor(GuiceComponentRegistry.java:75).
  at br.com.caelum.vraptor.ioc.guice.GuiceComponentRegistry.deepRegister(GuiceComponentRegistry.java:63)

9) A binding to br.com.caelum.vraptor.ioc.fixture.CustomComponentInTheClasspath was already configured at br.com.caelum.vraptor.ioc.guice.GuiceComponentRegistry.bindToConstructor(GuiceComponentRegistry.java:75).
  at br.com.caelum.vraptor.ioc.guice.GuiceComponentRegistry.deepRegister(GuiceComponentRegistry.java:63)

10) A binding to br.com.caelum.vraptor.ioc.fixture.HasConstructor was already configured at br.com.caelum.vraptor.ioc.guice.GuiceComponentRegistry.bindToConstructor(GuiceComponentRegistry.java:75).
  at br.com.caelum.vraptor.ioc.guice.GuiceComponentRegistry.deepRegister(GuiceComponentRegistry.java:63)

11) A binding to br.com.caelum.vraptor.ioc.fixture.ConverterInTheClasspath was already configured at br.com.caelum.vraptor.ioc.guice.GuiceComponentRegistry.bindToConstructor(GuiceComponentRegistry.java:75).
  at br.com.caelum.vraptor.ioc.guice.GuiceComponentRegistry.deepRegister(GuiceComponentRegistry.java:63)

11 errors
	at com.google.inject.internal.Errors.throwCreationExceptionIfErrorsExist(Errors.java:435)
	at com.google.inject.internal.InternalInjectorCreator.initializeStatically(InternalInjectorCreator.java:154)
	at com.google.inject.internal.InternalInjectorCreator.build(InternalInjectorCreator.java:106)
	at com.google.inject.Guice.createInjector(Guice.java:95)
	at com.google.inject.Guice.createInjector(Guice.java:83)
	at br.com.caelum.vraptor.ioc.guice.GuiceProvider.start(GuiceProvider.java:97)
	at br.com.caelum.vraptor.ioc.GenericContainerTest.start(GenericContainerTest.java:288)
	at br.com.caelum.vraptor.ioc.GenericContainerTest.setup(GenericContainerTest.java:285)
	at sun.reflect.NativeMethodAccessorImpl.invoke0(Native Method)
	at sun.reflect.NativeMethodAccessorImpl.invoke(NativeMethodAccessorImpl.java:62)
	at sun.reflect.DelegatingMethodAccessorImpl.invoke(DelegatingMethodAccessorImpl.java:43)
	at java.lang.reflect.Method.invoke(Method.java:497)
	at org.junit.runners.model.FrameworkMethod$1.runReflectiveCall(FrameworkMethod.java:45)
	at org.junit.internal.runners.model.ReflectiveCallable.run(ReflectiveCallable.java:15)
	at org.junit.runners.model.FrameworkMethod.invokeExplosively(FrameworkMethod.java:42)
	at org.junit.internal.runners.statements.RunBefores.evaluate(RunBefores.java:27)
	at org.junit.internal.runners.statements.RunAfters.evaluate(RunAfters.java:30)
	at org.junit.runners.ParentRunner.runLeaf(ParentRunner.java:263)
	at org.junit.runners.BlockJUnit4ClassRunner.runChild(BlockJUnit4ClassRunner.java:68)
	at org.junit.runners.BlockJUnit4ClassRunner.runChild(BlockJUnit4ClassRunner.java:47)
	at org.junit.runners.ParentRunner$3.run(ParentRunner.java:231)
	at org.junit.runners.ParentRunner$1.schedule(ParentRunner.java:60)
	at org.junit.runners.ParentRunner.runChildren(ParentRunner.java:229)
	at org.junit.runners.ParentRunner.access$000(ParentRunner.java:50)
	at org.junit.runners.ParentRunner$2.evaluate(ParentRunner.java:222)
	at org.junit.runners.ParentRunner.run(ParentRunner.java:300)
	at org.apache.maven.surefire.junit4.JUnit4Provider.execute(JUnit4Provider.java:252)
	at org.apache.maven.surefire.junit4.JUnit4Provider.executeTestSet(JUnit4Provider.java:141)
	at org.apache.maven.surefire.junit4.JUnit4Provider.invoke(JUnit4Provider.java:112)
	at sun.reflect.NativeMethodAccessorImpl.invoke0(Native Method)
	at sun.reflect.NativeMethodAccessorImpl.invoke(NativeMethodAccessorImpl.java:62)
	at sun.reflect.DelegatingMethodAccessorImpl.invoke(DelegatingMethodAccessorImpl.java:43)
	at java.lang.reflect.Method.invoke(Method.java:497)
	at org.apache.maven.surefire.util.ReflectionUtils.invokeMethodWithArray(ReflectionUtils.java:189)
	at org.apache.maven.surefire.booter.ProviderFactory$ProviderProxy.invoke(ProviderFactory.java:165)
	at org.apache.maven.surefire.booter.ProviderFactory.invokeProvider(ProviderFactory.java:85)
	at org.apache.maven.surefire.booter.ForkedBooter.runSuitesInProcess(ForkedBooter.java:115)
	at org.apache.maven.surefire.booter.ForkedBooter.main(ForkedBooter.java:75)

processesCorrectlyPrototypeBasedComponents(br.com.caelum.vraptor.ioc.guice.GuiceProviderTest)  Time elapsed: 0.048 sec  <<< ERROR!
com.google.inject.CreationException: Guice creation errors:

1) Binding points to itself.
  at br.com.caelum.vraptor.ioc.guice.GuiceComponentRegistry.deepRegister(GuiceComponentRegistry.java:63)

2) A binding to br.com.caelum.vraptor.ioc.fixture.ComponentFactoryInTheClasspath was already configured at br.com.caelum.vraptor.ioc.guice.GuiceComponentRegistry.bindToConstructor(GuiceComponentRegistry.java:75).
  at br.com.caelum.vraptor.ioc.guice.GuiceComponentRegistry.deepRegister(GuiceComponentRegistry.java:63)

3) A binding to br.com.caelum.vraptor.ioc.fixture.ResourceInTheClasspath was already configured at br.com.caelum.vraptor.ioc.guice.GuiceComponentRegistry.bindToConstructor(GuiceComponentRegistry.java:75).
  at br.com.caelum.vraptor.ioc.guice.GuiceComponentRegistry.deepRegister(GuiceComponentRegistry.java:63)

4) A binding to br.com.caelum.vraptor.ioc.fixture.CustomMethodNotAllowedHandler was already configured at br.com.caelum.vraptor.ioc.guice.GuiceComponentRegistry.bindToConstructor(GuiceComponentRegistry.java:75).
  at br.com.caelum.vraptor.ioc.guice.GuiceComponentRegistry.deepRegister(GuiceComponentRegistry.java:63)

5) A binding to br.com.caelum.vraptor.ioc.fixture.NoConstructor was already configured at br.com.caelum.vraptor.ioc.guice.GuiceComponentRegistry.bindToConstructor(GuiceComponentRegistry.java:75).
  at br.com.caelum.vraptor.ioc.guice.GuiceComponentRegistry.deepRegister(GuiceComponentRegistry.java:63)

6) A binding to br.com.caelum.vraptor.ioc.fixture.DependentOnSomethingFromComponentFactory was already configured at br.com.caelum.vraptor.ioc.guice.GuiceComponentRegistry.bindToConstructor(GuiceComponentRegistry.java:75).
  at br.com.caelum.vraptor.ioc.guice.GuiceComponentRegistry.deepRegister(GuiceComponentRegistry.java:63)

7) A binding to br.com.caelum.vraptor.ioc.fixture.CustomComponentWithLifecycleInTheClasspath was already configured at br.com.caelum.vraptor.ioc.guice.GuiceComponentRegistry.bindToConstructor(GuiceComponentRegistry.java:75).
  at br.com.caelum.vraptor.ioc.guice.GuiceComponentRegistry.deepRegister(GuiceComponentRegistry.java:63)

8) A binding to br.com.caelum.vraptor.ioc.fixture.InterceptorInTheClasspath was already configured at br.com.caelum.vraptor.ioc.guice.GuiceComponentRegistry.bindToConstructor(GuiceComponentRegistry.java:75).
  at br.com.caelum.vraptor.ioc.guice.GuiceComponentRegistry.deepRegister(GuiceComponentRegistry.java:63)

9) A binding to br.com.caelum.vraptor.ioc.fixture.CustomComponentInTheClasspath was already configured at br.com.caelum.vraptor.ioc.guice.GuiceComponentRegistry.bindToConstructor(GuiceComponentRegistry.java:75).
  at br.com.caelum.vraptor.ioc.guice.GuiceComponentRegistry.deepRegister(GuiceComponentRegistry.java:63)

10) A binding to br.com.caelum.vraptor.ioc.fixture.HasConstructor was already configured at br.com.caelum.vraptor.ioc.guice.GuiceComponentRegistry.bindToConstructor(GuiceComponentRegistry.java:75).
  at br.com.caelum.vraptor.ioc.guice.GuiceComponentRegistry.deepRegister(GuiceComponentRegistry.java:63)

11) A binding to br.com.caelum.vraptor.ioc.fixture.ConverterInTheClasspath was already configured at br.com.caelum.vraptor.ioc.guice.GuiceComponentRegistry.bindToConstructor(GuiceComponentRegistry.java:75).
  at br.com.caelum.vraptor.ioc.guice.GuiceComponentRegistry.deepRegister(GuiceComponentRegistry.java:63)

11 errors
	at com.google.inject.internal.Errors.throwCreationExceptionIfErrorsExist(Errors.java:435)
	at com.google.inject.internal.InternalInjectorCreator.initializeStatically(InternalInjectorCreator.java:154)
	at com.google.inject.internal.InternalInjectorCreator.build(InternalInjectorCreator.java:106)
	at com.google.inject.Guice.createInjector(Guice.java:95)
	at com.google.inject.Guice.createInjector(Guice.java:83)
	at br.com.caelum.vraptor.ioc.guice.GuiceProvider.start(GuiceProvider.java:97)
	at br.com.caelum.vraptor.ioc.GenericContainerTest.start(GenericContainerTest.java:288)
	at br.com.caelum.vraptor.ioc.GenericContainerTest.setup(GenericContainerTest.java:285)
	at sun.reflect.NativeMethodAccessorImpl.invoke0(Native Method)
	at sun.reflect.NativeMethodAccessorImpl.invoke(NativeMethodAccessorImpl.java:62)
	at sun.reflect.DelegatingMethodAccessorImpl.invoke(DelegatingMethodAccessorImpl.java:43)
	at java.lang.reflect.Method.invoke(Method.java:497)
	at org.junit.runners.model.FrameworkMethod$1.runReflectiveCall(FrameworkMethod.java:45)
	at org.junit.internal.runners.model.ReflectiveCallable.run(ReflectiveCallable.java:15)
	at org.junit.runners.model.FrameworkMethod.invokeExplosively(FrameworkMethod.java:42)
	at org.junit.internal.runners.statements.RunBefores.evaluate(RunBefores.java:27)
	at org.junit.internal.runners.statements.RunAfters.evaluate(RunAfters.java:30)
	at org.junit.runners.ParentRunner.runLeaf(ParentRunner.java:263)
	at org.junit.runners.BlockJUnit4ClassRunner.runChild(BlockJUnit4ClassRunner.java:68)
	at org.junit.runners.BlockJUnit4ClassRunner.runChild(BlockJUnit4ClassRunner.java:47)
	at org.junit.runners.ParentRunner$3.run(ParentRunner.java:231)
	at org.junit.runners.ParentRunner$1.schedule(ParentRunner.java:60)
	at org.junit.runners.ParentRunner.runChildren(ParentRunner.java:229)
	at org.junit.runners.ParentRunner.access$000(ParentRunner.java:50)
	at org.junit.runners.ParentRunner$2.evaluate(ParentRunner.java:222)
	at org.junit.runners.ParentRunner.run(ParentRunner.java:300)
	at org.apache.maven.surefire.junit4.JUnit4Provider.execute(JUnit4Provider.java:252)
	at org.apache.maven.surefire.junit4.JUnit4Provider.executeTestSet(JUnit4Provider.java:141)
	at org.apache.maven.surefire.junit4.JUnit4Provider.invoke(JUnit4Provider.java:112)
	at sun.reflect.NativeMethodAccessorImpl.invoke0(Native Method)
	at sun.reflect.NativeMethodAccessorImpl.invoke(NativeMethodAccessorImpl.java:62)
	at sun.reflect.DelegatingMethodAccessorImpl.invoke(DelegatingMethodAccessorImpl.java:43)
	at java.lang.reflect.Method.invoke(Method.java:497)
	at org.apache.maven.surefire.util.ReflectionUtils.invokeMethodWithArray(ReflectionUtils.java:189)
	at org.apache.maven.surefire.booter.ProviderFactory$ProviderProxy.invoke(ProviderFactory.java:165)
	at org.apache.maven.surefire.booter.ProviderFactory.invokeProvider(ProviderFactory.java:85)
	at org.apache.maven.surefire.booter.ForkedBooter.runSuitesInProcess(ForkedBooter.java:115)
	at org.apache.maven.surefire.booter.ForkedBooter.main(ForkedBooter.java:75)

supportsComponentFactoriesForCustomInstantiation(br.com.caelum.vraptor.ioc.guice.GuiceProviderTest)  Time elapsed: 0.055 sec  <<< ERROR!
com.google.inject.CreationException: Guice creation errors:

1) Binding points to itself.
  at br.com.caelum.vraptor.ioc.guice.GuiceComponentRegistry.deepRegister(GuiceComponentRegistry.java:63)

2) A binding to br.com.caelum.vraptor.ioc.fixture.ComponentFactoryInTheClasspath was already configured at br.com.caelum.vraptor.ioc.guice.GuiceComponentRegistry.bindToConstructor(GuiceComponentRegistry.java:75).
  at br.com.caelum.vraptor.ioc.guice.GuiceComponentRegistry.deepRegister(GuiceComponentRegistry.java:63)

3) A binding to br.com.caelum.vraptor.ioc.fixture.ResourceInTheClasspath was already configured at br.com.caelum.vraptor.ioc.guice.GuiceComponentRegistry.bindToConstructor(GuiceComponentRegistry.java:75).
  at br.com.caelum.vraptor.ioc.guice.GuiceComponentRegistry.deepRegister(GuiceComponentRegistry.java:63)

4) A binding to br.com.caelum.vraptor.ioc.fixture.CustomMethodNotAllowedHandler was already configured at br.com.caelum.vraptor.ioc.guice.GuiceComponentRegistry.bindToConstructor(GuiceComponentRegistry.java:75).
  at br.com.caelum.vraptor.ioc.guice.GuiceComponentRegistry.deepRegister(GuiceComponentRegistry.java:63)

5) A binding to br.com.caelum.vraptor.ioc.fixture.NoConstructor was already configured at br.com.caelum.vraptor.ioc.guice.GuiceComponentRegistry.bindToConstructor(GuiceComponentRegistry.java:75).
  at br.com.caelum.vraptor.ioc.guice.GuiceComponentRegistry.deepRegister(GuiceComponentRegistry.java:63)

6) A binding to br.com.caelum.vraptor.ioc.fixture.DependentOnSomethingFromComponentFactory was already configured at br.com.caelum.vraptor.ioc.guice.GuiceComponentRegistry.bindToConstructor(GuiceComponentRegistry.java:75).
  at br.com.caelum.vraptor.ioc.guice.GuiceComponentRegistry.deepRegister(GuiceComponentRegistry.java:63)

7) A binding to br.com.caelum.vraptor.ioc.fixture.CustomComponentWithLifecycleInTheClasspath was already configured at br.com.caelum.vraptor.ioc.guice.GuiceComponentRegistry.bindToConstructor(GuiceComponentRegistry.java:75).
  at br.com.caelum.vraptor.ioc.guice.GuiceComponentRegistry.deepRegister(GuiceComponentRegistry.java:63)

8) A binding to br.com.caelum.vraptor.ioc.fixture.InterceptorInTheClasspath was already configured at br.com.caelum.vraptor.ioc.guice.GuiceComponentRegistry.bindToConstructor(GuiceComponentRegistry.java:75).
  at br.com.caelum.vraptor.ioc.guice.GuiceComponentRegistry.deepRegister(GuiceComponentRegistry.java:63)

9) A binding to br.com.caelum.vraptor.ioc.fixture.CustomComponentInTheClasspath was already configured at br.com.caelum.vraptor.ioc.guice.GuiceComponentRegistry.bindToConstructor(GuiceComponentRegistry.java:75).
  at br.com.caelum.vraptor.ioc.guice.GuiceComponentRegistry.deepRegister(GuiceComponentRegistry.java:63)

10) A binding to br.com.caelum.vraptor.ioc.fixture.HasConstructor was already configured at br.com.caelum.vraptor.ioc.guice.GuiceComponentRegistry.bindToConstructor(GuiceComponentRegistry.java:75).
  at br.com.caelum.vraptor.ioc.guice.GuiceComponentRegistry.deepRegister(GuiceComponentRegistry.java:63)

11) A binding to br.com.caelum.vraptor.ioc.fixture.ConverterInTheClasspath was already configured at br.com.caelum.vraptor.ioc.guice.GuiceComponentRegistry.bindToConstructor(GuiceComponentRegistry.java:75).
  at br.com.caelum.vraptor.ioc.guice.GuiceComponentRegistry.deepRegister(GuiceComponentRegistry.java:63)

11 errors
	at com.google.inject.internal.Errors.throwCreationExceptionIfErrorsExist(Errors.java:435)
	at com.google.inject.internal.InternalInjectorCreator.initializeStatically(InternalInjectorCreator.java:154)
	at com.google.inject.internal.InternalInjectorCreator.build(InternalInjectorCreator.java:106)
	at com.google.inject.Guice.createInjector(Guice.java:95)
	at com.google.inject.Guice.createInjector(Guice.java:83)
	at br.com.caelum.vraptor.ioc.guice.GuiceProvider.start(GuiceProvider.java:97)
	at br.com.caelum.vraptor.ioc.GenericContainerTest.start(GenericContainerTest.java:288)
	at br.com.caelum.vraptor.ioc.GenericContainerTest.setup(GenericContainerTest.java:285)
	at sun.reflect.NativeMethodAccessorImpl.invoke0(Native Method)
	at sun.reflect.NativeMethodAccessorImpl.invoke(NativeMethodAccessorImpl.java:62)
	at sun.reflect.DelegatingMethodAccessorImpl.invoke(DelegatingMethodAccessorImpl.java:43)
	at java.lang.reflect.Method.invoke(Method.java:497)
	at org.junit.runners.model.FrameworkMethod$1.runReflectiveCall(FrameworkMethod.java:45)
	at org.junit.internal.runners.model.ReflectiveCallable.run(ReflectiveCallable.java:15)
	at org.junit.runners.model.FrameworkMethod.invokeExplosively(FrameworkMethod.java:42)
	at org.junit.internal.runners.statements.RunBefores.evaluate(RunBefores.java:27)
	at org.junit.internal.runners.statements.RunAfters.evaluate(RunAfters.java:30)
	at org.junit.runners.ParentRunner.runLeaf(ParentRunner.java:263)
	at org.junit.runners.BlockJUnit4ClassRunner.runChild(BlockJUnit4ClassRunner.java:68)
	at org.junit.runners.BlockJUnit4ClassRunner.runChild(BlockJUnit4ClassRunner.java:47)
	at org.junit.runners.ParentRunner$3.run(ParentRunner.java:231)
	at org.junit.runners.ParentRunner$1.schedule(ParentRunner.java:60)
	at org.junit.runners.ParentRunner.runChildren(ParentRunner.java:229)
	at org.junit.runners.ParentRunner.access$000(ParentRunner.java:50)
	at org.junit.runners.ParentRunner$2.evaluate(ParentRunner.java:222)
	at org.junit.runners.ParentRunner.run(ParentRunner.java:300)
	at org.apache.maven.surefire.junit4.JUnit4Provider.execute(JUnit4Provider.java:252)
	at org.apache.maven.surefire.junit4.JUnit4Provider.executeTestSet(JUnit4Provider.java:141)
	at org.apache.maven.surefire.junit4.JUnit4Provider.invoke(JUnit4Provider.java:112)
	at sun.reflect.NativeMethodAccessorImpl.invoke0(Native Method)
	at sun.reflect.NativeMethodAccessorImpl.invoke(NativeMethodAccessorImpl.java:62)
	at sun.reflect.DelegatingMethodAccessorImpl.invoke(DelegatingMethodAccessorImpl.java:43)
	at java.lang.reflect.Method.invoke(Method.java:497)
	at org.apache.maven.surefire.util.ReflectionUtils.invokeMethodWithArray(ReflectionUtils.java:189)
	at org.apache.maven.surefire.booter.ProviderFactory$ProviderProxy.invoke(ProviderFactory.java:165)
	at org.apache.maven.surefire.booter.ProviderFactory.invokeProvider(ProviderFactory.java:85)
	at org.apache.maven.surefire.booter.ForkedBooter.runSuitesInProcess(ForkedBooter.java:115)
	at org.apache.maven.surefire.booter.ForkedBooter.main(ForkedBooter.java:75)

shouldDisposeAfterRequest(br.com.caelum.vraptor.ioc.guice.GuiceProviderTest)  Time elapsed: 0.071 sec  <<< ERROR!
com.google.inject.CreationException: Guice creation errors:

1) Binding points to itself.
  at br.com.caelum.vraptor.ioc.guice.GuiceComponentRegistry.deepRegister(GuiceComponentRegistry.java:63)

2) A binding to br.com.caelum.vraptor.ioc.fixture.ComponentFactoryInTheClasspath was already configured at br.com.caelum.vraptor.ioc.guice.GuiceComponentRegistry.bindToConstructor(GuiceComponentRegistry.java:75).
  at br.com.caelum.vraptor.ioc.guice.GuiceComponentRegistry.deepRegister(GuiceComponentRegistry.java:63)

3) A binding to br.com.caelum.vraptor.ioc.fixture.ResourceInTheClasspath was already configured at br.com.caelum.vraptor.ioc.guice.GuiceComponentRegistry.bindToConstructor(GuiceComponentRegistry.java:75).
  at br.com.caelum.vraptor.ioc.guice.GuiceComponentRegistry.deepRegister(GuiceComponentRegistry.java:63)

4) A binding to br.com.caelum.vraptor.ioc.fixture.CustomMethodNotAllowedHandler was already configured at br.com.caelum.vraptor.ioc.guice.GuiceComponentRegistry.bindToConstructor(GuiceComponentRegistry.java:75).
  at br.com.caelum.vraptor.ioc.guice.GuiceComponentRegistry.deepRegister(GuiceComponentRegistry.java:63)

5) A binding to br.com.caelum.vraptor.ioc.fixture.NoConstructor was already configured at br.com.caelum.vraptor.ioc.guice.GuiceComponentRegistry.bindToConstructor(GuiceComponentRegistry.java:75).
  at br.com.caelum.vraptor.ioc.guice.GuiceComponentRegistry.deepRegister(GuiceComponentRegistry.java:63)

6) A binding to br.com.caelum.vraptor.ioc.fixture.DependentOnSomethingFromComponentFactory was already configured at br.com.caelum.vraptor.ioc.guice.GuiceComponentRegistry.bindToConstructor(GuiceComponentRegistry.java:75).
  at br.com.caelum.vraptor.ioc.guice.GuiceComponentRegistry.deepRegister(GuiceComponentRegistry.java:63)

7) A binding to br.com.caelum.vraptor.ioc.fixture.CustomComponentWithLifecycleInTheClasspath was already configured at br.com.caelum.vraptor.ioc.guice.GuiceComponentRegistry.bindToConstructor(GuiceComponentRegistry.java:75).
  at br.com.caelum.vraptor.ioc.guice.GuiceComponentRegistry.deepRegister(GuiceComponentRegistry.java:63)

8) A binding to br.com.caelum.vraptor.ioc.fixture.InterceptorInTheClasspath was already configured at br.com.caelum.vraptor.ioc.guice.GuiceComponentRegistry.bindToConstructor(GuiceComponentRegistry.java:75).
  at br.com.caelum.vraptor.ioc.guice.GuiceComponentRegistry.deepRegister(GuiceComponentRegistry.java:63)

9) A binding to br.com.caelum.vraptor.ioc.fixture.CustomComponentInTheClasspath was already configured at br.com.caelum.vraptor.ioc.guice.GuiceComponentRegistry.bindToConstructor(GuiceComponentRegistry.java:75).
  at br.com.caelum.vraptor.ioc.guice.GuiceComponentRegistry.deepRegister(GuiceComponentRegistry.java:63)

10) A binding to br.com.caelum.vraptor.ioc.fixture.HasConstructor was already configured at br.com.caelum.vraptor.ioc.guice.GuiceComponentRegistry.bindToConstructor(GuiceComponentRegistry.java:75).
  at br.com.caelum.vraptor.ioc.guice.GuiceComponentRegistry.deepRegister(GuiceComponentRegistry.java:63)

11) A binding to br.com.caelum.vraptor.ioc.fixture.ConverterInTheClasspath was already configured at br.com.caelum.vraptor.ioc.guice.GuiceComponentRegistry.bindToConstructor(GuiceComponentRegistry.java:75).
  at br.com.caelum.vraptor.ioc.guice.GuiceComponentRegistry.deepRegister(GuiceComponentRegistry.java:63)

11 errors
	at com.google.inject.internal.Errors.throwCreationExceptionIfErrorsExist(Errors.java:435)
	at com.google.inject.internal.InternalInjectorCreator.initializeStatically(InternalInjectorCreator.java:154)
	at com.google.inject.internal.InternalInjectorCreator.build(InternalInjectorCreator.java:106)
	at com.google.inject.Guice.createInjector(Guice.java:95)
	at com.google.inject.Guice.createInjector(Guice.java:83)
	at br.com.caelum.vraptor.ioc.guice.GuiceProvider.start(GuiceProvider.java:97)
	at br.com.caelum.vraptor.ioc.GenericContainerTest.start(GenericContainerTest.java:288)
	at br.com.caelum.vraptor.ioc.GenericContainerTest.setup(GenericContainerTest.java:285)
	at sun.reflect.NativeMethodAccessorImpl.invoke0(Native Method)
	at sun.reflect.NativeMethodAccessorImpl.invoke(NativeMethodAccessorImpl.java:62)
	at sun.reflect.DelegatingMethodAccessorImpl.invoke(DelegatingMethodAccessorImpl.java:43)
	at java.lang.reflect.Method.invoke(Method.java:497)
	at org.junit.runners.model.FrameworkMethod$1.runReflectiveCall(FrameworkMethod.java:45)
	at org.junit.internal.runners.model.ReflectiveCallable.run(ReflectiveCallable.java:15)
	at org.junit.runners.model.FrameworkMethod.invokeExplosively(FrameworkMethod.java:42)
	at org.junit.internal.runners.statements.RunBefores.evaluate(RunBefores.java:27)
	at org.junit.internal.runners.statements.RunAfters.evaluate(RunAfters.java:30)
	at org.junit.runners.ParentRunner.runLeaf(ParentRunner.java:263)
	at org.junit.runners.BlockJUnit4ClassRunner.runChild(BlockJUnit4ClassRunner.java:68)
	at org.junit.runners.BlockJUnit4ClassRunner.runChild(BlockJUnit4ClassRunner.java:47)
	at org.junit.runners.ParentRunner$3.run(ParentRunner.java:231)
	at org.junit.runners.ParentRunner$1.schedule(ParentRunner.java:60)
	at org.junit.runners.ParentRunner.runChildren(ParentRunner.java:229)
	at org.junit.runners.ParentRunner.access$000(ParentRunner.java:50)
	at org.junit.runners.ParentRunner$2.evaluate(ParentRunner.java:222)
	at org.junit.runners.ParentRunner.run(ParentRunner.java:300)
	at org.apache.maven.surefire.junit4.JUnit4Provider.execute(JUnit4Provider.java:252)
	at org.apache.maven.surefire.junit4.JUnit4Provider.executeTestSet(JUnit4Provider.java:141)
	at org.apache.maven.surefire.junit4.JUnit4Provider.invoke(JUnit4Provider.java:112)
	at sun.reflect.NativeMethodAccessorImpl.invoke0(Native Method)
	at sun.reflect.NativeMethodAccessorImpl.invoke(NativeMethodAccessorImpl.java:62)
	at sun.reflect.DelegatingMethodAccessorImpl.invoke(DelegatingMethodAccessorImpl.java:43)
	at java.lang.reflect.Method.invoke(Method.java:497)
	at org.apache.maven.surefire.util.ReflectionUtils.invokeMethodWithArray(ReflectionUtils.java:189)
	at org.apache.maven.surefire.booter.ProviderFactory$ProviderProxy.invoke(ProviderFactory.java:165)
	at org.apache.maven.surefire.booter.ProviderFactory.invokeProvider(ProviderFactory.java:85)
	at org.apache.maven.surefire.booter.ForkedBooter.runSuitesInProcess(ForkedBooter.java:115)
	at org.apache.maven.surefire.booter.ForkedBooter.main(ForkedBooter.java:75)

shouldStartBeforeRequestExecution(br.com.caelum.vraptor.ioc.guice.GuiceProviderTest)  Time elapsed: 0.081 sec  <<< ERROR!
com.google.inject.CreationException: Guice creation errors:

1) Binding points to itself.
  at br.com.caelum.vraptor.ioc.guice.GuiceComponentRegistry.deepRegister(GuiceComponentRegistry.java:63)

2) A binding to br.com.caelum.vraptor.ioc.fixture.ComponentFactoryInTheClasspath was already configured at br.com.caelum.vraptor.ioc.guice.GuiceComponentRegistry.bindToConstructor(GuiceComponentRegistry.java:75).
  at br.com.caelum.vraptor.ioc.guice.GuiceComponentRegistry.deepRegister(GuiceComponentRegistry.java:63)

3) A binding to br.com.caelum.vraptor.ioc.fixture.ResourceInTheClasspath was already configured at br.com.caelum.vraptor.ioc.guice.GuiceComponentRegistry.bindToConstructor(GuiceComponentRegistry.java:75).
  at br.com.caelum.vraptor.ioc.guice.GuiceComponentRegistry.deepRegister(GuiceComponentRegistry.java:63)

4) A binding to br.com.caelum.vraptor.ioc.fixture.CustomMethodNotAllowedHandler was already configured at br.com.caelum.vraptor.ioc.guice.GuiceComponentRegistry.bindToConstructor(GuiceComponentRegistry.java:75).
  at br.com.caelum.vraptor.ioc.guice.GuiceComponentRegistry.deepRegister(GuiceComponentRegistry.java:63)

5) A binding to br.com.caelum.vraptor.ioc.fixture.NoConstructor was already configured at br.com.caelum.vraptor.ioc.guice.GuiceComponentRegistry.bindToConstructor(GuiceComponentRegistry.java:75).
  at br.com.caelum.vraptor.ioc.guice.GuiceComponentRegistry.deepRegister(GuiceComponentRegistry.java:63)

6) A binding to br.com.caelum.vraptor.ioc.fixture.DependentOnSomethingFromComponentFactory was already configured at br.com.caelum.vraptor.ioc.guice.GuiceComponentRegistry.bindToConstructor(GuiceComponentRegistry.java:75).
  at br.com.caelum.vraptor.ioc.guice.GuiceComponentRegistry.deepRegister(GuiceComponentRegistry.java:63)

7) A binding to br.com.caelum.vraptor.ioc.fixture.CustomComponentWithLifecycleInTheClasspath was already configured at br.com.caelum.vraptor.ioc.guice.GuiceComponentRegistry.bindToConstructor(GuiceComponentRegistry.java:75).
  at br.com.caelum.vraptor.ioc.guice.GuiceComponentRegistry.deepRegister(GuiceComponentRegistry.java:63)

8) A binding to br.com.caelum.vraptor.ioc.fixture.InterceptorInTheClasspath was already configured at br.com.caelum.vraptor.ioc.guice.GuiceComponentRegistry.bindToConstructor(GuiceComponentRegistry.java:75).
  at br.com.caelum.vraptor.ioc.guice.GuiceComponentRegistry.deepRegister(GuiceComponentRegistry.java:63)

9) A binding to br.com.caelum.vraptor.ioc.fixture.CustomComponentInTheClasspath was already configured at br.com.caelum.vraptor.ioc.guice.GuiceComponentRegistry.bindToConstructor(GuiceComponentRegistry.java:75).
  at br.com.caelum.vraptor.ioc.guice.GuiceComponentRegistry.deepRegister(GuiceComponentRegistry.java:63)

10) A binding to br.com.caelum.vraptor.ioc.fixture.HasConstructor was already configured at br.com.caelum.vraptor.ioc.guice.GuiceComponentRegistry.bindToConstructor(GuiceComponentRegistry.java:75).
  at br.com.caelum.vraptor.ioc.guice.GuiceComponentRegistry.deepRegister(GuiceComponentRegistry.java:63)

11) A binding to br.com.caelum.vraptor.ioc.fixture.ConverterInTheClasspath was already configured at br.com.caelum.vraptor.ioc.guice.GuiceComponentRegistry.bindToConstructor(GuiceComponentRegistry.java:75).
  at br.com.caelum.vraptor.ioc.guice.GuiceComponentRegistry.deepRegister(GuiceComponentRegistry.java:63)

11 errors
	at com.google.inject.internal.Errors.throwCreationExceptionIfErrorsExist(Errors.java:435)
	at com.google.inject.internal.InternalInjectorCreator.initializeStatically(InternalInjectorCreator.java:154)
	at com.google.inject.internal.InternalInjectorCreator.build(InternalInjectorCreator.java:106)
	at com.google.inject.Guice.createInjector(Guice.java:95)
	at com.google.inject.Guice.createInjector(Guice.java:83)
	at br.com.caelum.vraptor.ioc.guice.GuiceProvider.start(GuiceProvider.java:97)
	at br.com.caelum.vraptor.ioc.GenericContainerTest.start(GenericContainerTest.java:288)
	at br.com.caelum.vraptor.ioc.GenericContainerTest.setup(GenericContainerTest.java:285)
	at sun.reflect.GeneratedMethodAccessor14.invoke(Unknown Source)
	at sun.reflect.DelegatingMethodAccessorImpl.invoke(DelegatingMethodAccessorImpl.java:43)
	at java.lang.reflect.Method.invoke(Method.java:497)
	at org.junit.runners.model.FrameworkMethod$1.runReflectiveCall(FrameworkMethod.java:45)
	at org.junit.internal.runners.model.ReflectiveCallable.run(ReflectiveCallable.java:15)
	at org.junit.runners.model.FrameworkMethod.invokeExplosively(FrameworkMethod.java:42)
	at org.junit.internal.runners.statements.RunBefores.evaluate(RunBefores.java:27)
	at org.junit.internal.runners.statements.RunAfters.evaluate(RunAfters.java:30)
	at org.junit.runners.ParentRunner.runLeaf(ParentRunner.java:263)
	at org.junit.runners.BlockJUnit4ClassRunner.runChild(BlockJUnit4ClassRunner.java:68)
	at org.junit.runners.BlockJUnit4ClassRunner.runChild(BlockJUnit4ClassRunner.java:47)
	at org.junit.runners.ParentRunner$3.run(ParentRunner.java:231)
	at org.junit.runners.ParentRunner$1.schedule(ParentRunner.java:60)
	at org.junit.runners.ParentRunner.runChildren(ParentRunner.java:229)
	at org.junit.runners.ParentRunner.access$000(ParentRunner.java:50)
	at org.junit.runners.ParentRunner$2.evaluate(ParentRunner.java:222)
	at org.junit.runners.ParentRunner.run(ParentRunner.java:300)
	at org.apache.maven.surefire.junit4.JUnit4Provider.execute(JUnit4Provider.java:252)
	at org.apache.maven.surefire.junit4.JUnit4Provider.executeTestSet(JUnit4Provider.java:141)
	at org.apache.maven.surefire.junit4.JUnit4Provider.invoke(JUnit4Provider.java:112)
	at sun.reflect.NativeMethodAccessorImpl.invoke0(Native Method)
	at sun.reflect.NativeMethodAccessorImpl.invoke(NativeMethodAccessorImpl.java:62)
	at sun.reflect.DelegatingMethodAccessorImpl.invoke(DelegatingMethodAccessorImpl.java:43)
	at java.lang.reflect.Method.invoke(Method.java:497)
	at org.apache.maven.surefire.util.ReflectionUtils.invokeMethodWithArray(ReflectionUtils.java:189)
	at org.apache.maven.surefire.booter.ProviderFactory$ProviderProxy.invoke(ProviderFactory.java:165)
	at org.apache.maven.surefire.booter.ProviderFactory.invokeProvider(ProviderFactory.java:85)
	at org.apache.maven.surefire.booter.ForkedBooter.runSuitesInProcess(ForkedBooter.java:115)
	at org.apache.maven.surefire.booter.ForkedBooter.main(ForkedBooter.java:75)

canProvideComponentsInTheClasspath(br.com.caelum.vraptor.ioc.guice.GuiceProviderTest)  Time elapsed: 0.077 sec  <<< ERROR!
com.google.inject.CreationException: Guice creation errors:

1) Binding points to itself.
  at br.com.caelum.vraptor.ioc.guice.GuiceComponentRegistry.deepRegister(GuiceComponentRegistry.java:63)

2) A binding to br.com.caelum.vraptor.ioc.fixture.ComponentFactoryInTheClasspath was already configured at br.com.caelum.vraptor.ioc.guice.GuiceComponentRegistry.bindToConstructor(GuiceComponentRegistry.java:75).
  at br.com.caelum.vraptor.ioc.guice.GuiceComponentRegistry.deepRegister(GuiceComponentRegistry.java:63)

3) A binding to br.com.caelum.vraptor.ioc.fixture.ResourceInTheClasspath was already configured at br.com.caelum.vraptor.ioc.guice.GuiceComponentRegistry.bindToConstructor(GuiceComponentRegistry.java:75).
  at br.com.caelum.vraptor.ioc.guice.GuiceComponentRegistry.deepRegister(GuiceComponentRegistry.java:63)

4) A binding to br.com.caelum.vraptor.ioc.fixture.CustomMethodNotAllowedHandler was already configured at br.com.caelum.vraptor.ioc.guice.GuiceComponentRegistry.bindToConstructor(GuiceComponentRegistry.java:75).
  at br.com.caelum.vraptor.ioc.guice.GuiceComponentRegistry.deepRegister(GuiceComponentRegistry.java:63)

5) A binding to br.com.caelum.vraptor.ioc.fixture.NoConstructor was already configured at br.com.caelum.vraptor.ioc.guice.GuiceComponentRegistry.bindToConstructor(GuiceComponentRegistry.java:75).
  at br.com.caelum.vraptor.ioc.guice.GuiceComponentRegistry.deepRegister(GuiceComponentRegistry.java:63)

6) A binding to br.com.caelum.vraptor.ioc.fixture.DependentOnSomethingFromComponentFactory was already configured at br.com.caelum.vraptor.ioc.guice.GuiceComponentRegistry.bindToConstructor(GuiceComponentRegistry.java:75).
  at br.com.caelum.vraptor.ioc.guice.GuiceComponentRegistry.deepRegister(GuiceComponentRegistry.java:63)

7) A binding to br.com.caelum.vraptor.ioc.fixture.CustomComponentWithLifecycleInTheClasspath was already configured at br.com.caelum.vraptor.ioc.guice.GuiceComponentRegistry.bindToConstructor(GuiceComponentRegistry.java:75).
  at br.com.caelum.vraptor.ioc.guice.GuiceComponentRegistry.deepRegister(GuiceComponentRegistry.java:63)

8) A binding to br.com.caelum.vraptor.ioc.fixture.InterceptorInTheClasspath was already configured at br.com.caelum.vraptor.ioc.guice.GuiceComponentRegistry.bindToConstructor(GuiceComponentRegistry.java:75).
  at br.com.caelum.vraptor.ioc.guice.GuiceComponentRegistry.deepRegister(GuiceComponentRegistry.java:63)

9) A binding to br.com.caelum.vraptor.ioc.fixture.CustomComponentInTheClasspath was already configured at br.com.caelum.vraptor.ioc.guice.GuiceComponentRegistry.bindToConstructor(GuiceComponentRegistry.java:75).
  at br.com.caelum.vraptor.ioc.guice.GuiceComponentRegistry.deepRegister(GuiceComponentRegistry.java:63)

10) A binding to br.com.caelum.vraptor.ioc.fixture.HasConstructor was already configured at br.com.caelum.vraptor.ioc.guice.GuiceComponentRegistry.bindToConstructor(GuiceComponentRegistry.java:75).
  at br.com.caelum.vraptor.ioc.guice.GuiceComponentRegistry.deepRegister(GuiceComponentRegistry.java:63)

11) A binding to br.com.caelum.vraptor.ioc.fixture.ConverterInTheClasspath was already configured at br.com.caelum.vraptor.ioc.guice.GuiceComponentRegistry.bindToConstructor(GuiceComponentRegistry.java:75).
  at br.com.caelum.vraptor.ioc.guice.GuiceComponentRegistry.deepRegister(GuiceComponentRegistry.java:63)

11 errors
	at com.google.inject.internal.Errors.throwCreationExceptionIfErrorsExist(Errors.java:435)
	at com.google.inject.internal.InternalInjectorCreator.initializeStatically(InternalInjectorCreator.java:154)
	at com.google.inject.internal.InternalInjectorCreator.build(InternalInjectorCreator.java:106)
	at com.google.inject.Guice.createInjector(Guice.java:95)
	at com.google.inject.Guice.createInjector(Guice.java:83)
	at br.com.caelum.vraptor.ioc.guice.GuiceProvider.start(GuiceProvider.java:97)
	at br.com.caelum.vraptor.ioc.GenericContainerTest.start(GenericContainerTest.java:288)
	at br.com.caelum.vraptor.ioc.GenericContainerTest.setup(GenericContainerTest.java:285)
	at sun.reflect.GeneratedMethodAccessor14.invoke(Unknown Source)
	at sun.reflect.DelegatingMethodAccessorImpl.invoke(DelegatingMethodAccessorImpl.java:43)
	at java.lang.reflect.Method.invoke(Method.java:497)
	at org.junit.runners.model.FrameworkMethod$1.runReflectiveCall(FrameworkMethod.java:45)
	at org.junit.internal.runners.model.ReflectiveCallable.run(ReflectiveCallable.java:15)
	at org.junit.runners.model.FrameworkMethod.invokeExplosively(FrameworkMethod.java:42)
	at org.junit.internal.runners.statements.RunBefores.evaluate(RunBefores.java:27)
	at org.junit.internal.runners.statements.RunAfters.evaluate(RunAfters.java:30)
	at org.junit.runners.ParentRunner.runLeaf(ParentRunner.java:263)
	at org.junit.runners.BlockJUnit4ClassRunner.runChild(BlockJUnit4ClassRunner.java:68)
	at org.junit.runners.BlockJUnit4ClassRunner.runChild(BlockJUnit4ClassRunner.java:47)
	at org.junit.runners.ParentRunner$3.run(ParentRunner.java:231)
	at org.junit.runners.ParentRunner$1.schedule(ParentRunner.java:60)
	at org.junit.runners.ParentRunner.runChildren(ParentRunner.java:229)
	at org.junit.runners.ParentRunner.access$000(ParentRunner.java:50)
	at org.junit.runners.ParentRunner$2.evaluate(ParentRunner.java:222)
	at org.junit.runners.ParentRunner.run(ParentRunner.java:300)
	at org.apache.maven.surefire.junit4.JUnit4Provider.execute(JUnit4Provider.java:252)
	at org.apache.maven.surefire.junit4.JUnit4Provider.executeTestSet(JUnit4Provider.java:141)
	at org.apache.maven.surefire.junit4.JUnit4Provider.invoke(JUnit4Provider.java:112)
	at sun.reflect.NativeMethodAccessorImpl.invoke0(Native Method)
	at sun.reflect.NativeMethodAccessorImpl.invoke(NativeMethodAccessorImpl.java:62)
	at sun.reflect.DelegatingMethodAccessorImpl.invoke(DelegatingMethodAccessorImpl.java:43)
	at java.lang.reflect.Method.invoke(Method.java:497)
	at org.apache.maven.surefire.util.ReflectionUtils.invokeMethodWithArray(ReflectionUtils.java:189)
	at org.apache.maven.surefire.booter.ProviderFactory$ProviderProxy.invoke(ProviderFactory.java:165)
	at org.apache.maven.surefire.booter.ProviderFactory.invokeProvider(ProviderFactory.java:85)
	at org.apache.maven.surefire.booter.ForkedBooter.runSuitesInProcess(ForkedBooter.java:115)
	at org.apache.maven.surefire.booter.ForkedBooter.main(ForkedBooter.java:75)

shoudRegisterResourcesInRouter(br.com.caelum.vraptor.ioc.guice.GuiceProviderTest)  Time elapsed: 0.06 sec  <<< ERROR!
com.google.inject.CreationException: Guice creation errors:

1) Binding points to itself.
  at br.com.caelum.vraptor.ioc.guice.GuiceComponentRegistry.deepRegister(GuiceComponentRegistry.java:63)

2) A binding to br.com.caelum.vraptor.ioc.fixture.ComponentFactoryInTheClasspath was already configured at br.com.caelum.vraptor.ioc.guice.GuiceComponentRegistry.bindToConstructor(GuiceComponentRegistry.java:75).
  at br.com.caelum.vraptor.ioc.guice.GuiceComponentRegistry.deepRegister(GuiceComponentRegistry.java:63)

3) A binding to br.com.caelum.vraptor.ioc.fixture.ResourceInTheClasspath was already configured at br.com.caelum.vraptor.ioc.guice.GuiceComponentRegistry.bindToConstructor(GuiceComponentRegistry.java:75).
  at br.com.caelum.vraptor.ioc.guice.GuiceComponentRegistry.deepRegister(GuiceComponentRegistry.java:63)

4) A binding to br.com.caelum.vraptor.ioc.fixture.CustomMethodNotAllowedHandler was already configured at br.com.caelum.vraptor.ioc.guice.GuiceComponentRegistry.bindToConstructor(GuiceComponentRegistry.java:75).
  at br.com.caelum.vraptor.ioc.guice.GuiceComponentRegistry.deepRegister(GuiceComponentRegistry.java:63)

5) A binding to br.com.caelum.vraptor.ioc.fixture.NoConstructor was already configured at br.com.caelum.vraptor.ioc.guice.GuiceComponentRegistry.bindToConstructor(GuiceComponentRegistry.java:75).
  at br.com.caelum.vraptor.ioc.guice.GuiceComponentRegistry.deepRegister(GuiceComponentRegistry.java:63)

6) A binding to br.com.caelum.vraptor.ioc.fixture.DependentOnSomethingFromComponentFactory was already configured at br.com.caelum.vraptor.ioc.guice.GuiceComponentRegistry.bindToConstructor(GuiceComponentRegistry.java:75).
  at br.com.caelum.vraptor.ioc.guice.GuiceComponentRegistry.deepRegister(GuiceComponentRegistry.java:63)

7) A binding to br.com.caelum.vraptor.ioc.fixture.CustomComponentWithLifecycleInTheClasspath was already configured at br.com.caelum.vraptor.ioc.guice.GuiceComponentRegistry.bindToConstructor(GuiceComponentRegistry.java:75).
  at br.com.caelum.vraptor.ioc.guice.GuiceComponentRegistry.deepRegister(GuiceComponentRegistry.java:63)

8) A binding to br.com.caelum.vraptor.ioc.fixture.InterceptorInTheClasspath was already configured at br.com.caelum.vraptor.ioc.guice.GuiceComponentRegistry.bindToConstructor(GuiceComponentRegistry.java:75).
  at br.com.caelum.vraptor.ioc.guice.GuiceComponentRegistry.deepRegister(GuiceComponentRegistry.java:63)

9) A binding to br.com.caelum.vraptor.ioc.fixture.CustomComponentInTheClasspath was already configured at br.com.caelum.vraptor.ioc.guice.GuiceComponentRegistry.bindToConstructor(GuiceComponentRegistry.java:75).
  at br.com.caelum.vraptor.ioc.guice.GuiceComponentRegistry.deepRegister(GuiceComponentRegistry.java:63)

10) A binding to br.com.caelum.vraptor.ioc.fixture.HasConstructor was already configured at br.com.caelum.vraptor.ioc.guice.GuiceComponentRegistry.bindToConstructor(GuiceComponentRegistry.java:75).
  at br.com.caelum.vraptor.ioc.guice.GuiceComponentRegistry.deepRegister(GuiceComponentRegistry.java:63)

11) A binding to br.com.caelum.vraptor.ioc.fixture.ConverterInTheClasspath was already configured at br.com.caelum.vraptor.ioc.guice.GuiceComponentRegistry.bindToConstructor(GuiceComponentRegistry.java:75).
  at br.com.caelum.vraptor.ioc.guice.GuiceComponentRegistry.deepRegister(GuiceComponentRegistry.java:63)

11 errors
	at com.google.inject.internal.Errors.throwCreationExceptionIfErrorsExist(Errors.java:435)
	at com.google.inject.internal.InternalInjectorCreator.initializeStatically(InternalInjectorCreator.java:154)
	at com.google.inject.internal.InternalInjectorCreator.build(InternalInjectorCreator.java:106)
	at com.google.inject.Guice.createInjector(Guice.java:95)
	at com.google.inject.Guice.createInjector(Guice.java:83)
	at br.com.caelum.vraptor.ioc.guice.GuiceProvider.start(GuiceProvider.java:97)
	at br.com.caelum.vraptor.ioc.GenericContainerTest.start(GenericContainerTest.java:288)
	at br.com.caelum.vraptor.ioc.GenericContainerTest.setup(GenericContainerTest.java:285)
	at sun.reflect.GeneratedMethodAccessor14.invoke(Unknown Source)
	at sun.reflect.DelegatingMethodAccessorImpl.invoke(DelegatingMethodAccessorImpl.java:43)
	at java.lang.reflect.Method.invoke(Method.java:497)
	at org.junit.runners.model.FrameworkMethod$1.runReflectiveCall(FrameworkMethod.java:45)
	at org.junit.internal.runners.model.ReflectiveCallable.run(ReflectiveCallable.java:15)
	at org.junit.runners.model.FrameworkMethod.invokeExplosively(FrameworkMethod.java:42)
	at org.junit.internal.runners.statements.RunBefores.evaluate(RunBefores.java:27)
	at org.junit.internal.runners.statements.RunAfters.evaluate(RunAfters.java:30)
	at org.junit.runners.ParentRunner.runLeaf(ParentRunner.java:263)
	at org.junit.runners.BlockJUnit4ClassRunner.runChild(BlockJUnit4ClassRunner.java:68)
	at org.junit.runners.BlockJUnit4ClassRunner.runChild(BlockJUnit4ClassRunner.java:47)
	at org.junit.runners.ParentRunner$3.run(ParentRunner.java:231)
	at org.junit.runners.ParentRunner$1.schedule(ParentRunner.java:60)
	at org.junit.runners.ParentRunner.runChildren(ParentRunner.java:229)
	at org.junit.runners.ParentRunner.access$000(ParentRunner.java:50)
	at org.junit.runners.ParentRunner$2.evaluate(ParentRunner.java:222)
	at org.junit.runners.ParentRunner.run(ParentRunner.java:300)
	at org.apache.maven.surefire.junit4.JUnit4Provider.execute(JUnit4Provider.java:252)
	at org.apache.maven.surefire.junit4.JUnit4Provider.executeTestSet(JUnit4Provider.java:141)
	at org.apache.maven.surefire.junit4.JUnit4Provider.invoke(JUnit4Provider.java:112)
	at sun.reflect.NativeMethodAccessorImpl.invoke0(Native Method)
	at sun.reflect.NativeMethodAccessorImpl.invoke(NativeMethodAccessorImpl.java:62)
	at sun.reflect.DelegatingMethodAccessorImpl.invoke(DelegatingMethodAccessorImpl.java:43)
	at java.lang.reflect.Method.invoke(Method.java:497)
	at org.apache.maven.surefire.util.ReflectionUtils.invokeMethodWithArray(ReflectionUtils.java:189)
	at org.apache.maven.surefire.booter.ProviderFactory$ProviderProxy.invoke(ProviderFactory.java:165)
	at org.apache.maven.surefire.booter.ProviderFactory.invokeProvider(ProviderFactory.java:85)
	at org.apache.maven.surefire.booter.ForkedBooter.runSuitesInProcess(ForkedBooter.java:115)
	at org.apache.maven.surefire.booter.ForkedBooter.main(ForkedBooter.java:75)

shoudUseComponentFactoriesInTheClasspath(br.com.caelum.vraptor.ioc.guice.GuiceProviderTest)  Time elapsed: 0.07 sec  <<< ERROR!
com.google.inject.CreationException: Guice creation errors:

1) Binding points to itself.
  at br.com.caelum.vraptor.ioc.guice.GuiceComponentRegistry.deepRegister(GuiceComponentRegistry.java:63)

2) A binding to br.com.caelum.vraptor.ioc.fixture.ComponentFactoryInTheClasspath was already configured at br.com.caelum.vraptor.ioc.guice.GuiceComponentRegistry.bindToConstructor(GuiceComponentRegistry.java:75).
  at br.com.caelum.vraptor.ioc.guice.GuiceComponentRegistry.deepRegister(GuiceComponentRegistry.java:63)

3) A binding to br.com.caelum.vraptor.ioc.fixture.ResourceInTheClasspath was already configured at br.com.caelum.vraptor.ioc.guice.GuiceComponentRegistry.bindToConstructor(GuiceComponentRegistry.java:75).
  at br.com.caelum.vraptor.ioc.guice.GuiceComponentRegistry.deepRegister(GuiceComponentRegistry.java:63)

4) A binding to br.com.caelum.vraptor.ioc.fixture.CustomMethodNotAllowedHandler was already configured at br.com.caelum.vraptor.ioc.guice.GuiceComponentRegistry.bindToConstructor(GuiceComponentRegistry.java:75).
  at br.com.caelum.vraptor.ioc.guice.GuiceComponentRegistry.deepRegister(GuiceComponentRegistry.java:63)

5) A binding to br.com.caelum.vraptor.ioc.fixture.NoConstructor was already configured at br.com.caelum.vraptor.ioc.guice.GuiceComponentRegistry.bindToConstructor(GuiceComponentRegistry.java:75).
  at br.com.caelum.vraptor.ioc.guice.GuiceComponentRegistry.deepRegister(GuiceComponentRegistry.java:63)

6) A binding to br.com.caelum.vraptor.ioc.fixture.DependentOnSomethingFromComponentFactory was already configured at br.com.caelum.vraptor.ioc.guice.GuiceComponentRegistry.bindToConstructor(GuiceComponentRegistry.java:75).
  at br.com.caelum.vraptor.ioc.guice.GuiceComponentRegistry.deepRegister(GuiceComponentRegistry.java:63)

7) A binding to br.com.caelum.vraptor.ioc.fixture.CustomComponentWithLifecycleInTheClasspath was already configured at br.com.caelum.vraptor.ioc.guice.GuiceComponentRegistry.bindToConstructor(GuiceComponentRegistry.java:75).
  at br.com.caelum.vraptor.ioc.guice.GuiceComponentRegistry.deepRegister(GuiceComponentRegistry.java:63)

8) A binding to br.com.caelum.vraptor.ioc.fixture.InterceptorInTheClasspath was already configured at br.com.caelum.vraptor.ioc.guice.GuiceComponentRegistry.bindToConstructor(GuiceComponentRegistry.java:75).
  at br.com.caelum.vraptor.ioc.guice.GuiceComponentRegistry.deepRegister(GuiceComponentRegistry.java:63)

9) A binding to br.com.caelum.vraptor.ioc.fixture.CustomComponentInTheClasspath was already configured at br.com.caelum.vraptor.ioc.guice.GuiceComponentRegistry.bindToConstructor(GuiceComponentRegistry.java:75).
  at br.com.caelum.vraptor.ioc.guice.GuiceComponentRegistry.deepRegister(GuiceComponentRegistry.java:63)

10) A binding to br.com.caelum.vraptor.ioc.fixture.HasConstructor was already configured at br.com.caelum.vraptor.ioc.guice.GuiceComponentRegistry.bindToConstructor(GuiceComponentRegistry.java:75).
  at br.com.caelum.vraptor.ioc.guice.GuiceComponentRegistry.deepRegister(GuiceComponentRegistry.java:63)

11) A binding to br.com.caelum.vraptor.ioc.fixture.ConverterInTheClasspath was already configured at br.com.caelum.vraptor.ioc.guice.GuiceComponentRegistry.bindToConstructor(GuiceComponentRegistry.java:75).
  at br.com.caelum.vraptor.ioc.guice.GuiceComponentRegistry.deepRegister(GuiceComponentRegistry.java:63)

11 errors
	at com.google.inject.internal.Errors.throwCreationExceptionIfErrorsExist(Errors.java:435)
	at com.google.inject.internal.InternalInjectorCreator.initializeStatically(InternalInjectorCreator.java:154)
	at com.google.inject.internal.InternalInjectorCreator.build(InternalInjectorCreator.java:106)
	at com.google.inject.Guice.createInjector(Guice.java:95)
	at com.google.inject.Guice.createInjector(Guice.java:83)
	at br.com.caelum.vraptor.ioc.guice.GuiceProvider.start(GuiceProvider.java:97)
	at br.com.caelum.vraptor.ioc.GenericContainerTest.start(GenericContainerTest.java:288)
	at br.com.caelum.vraptor.ioc.GenericContainerTest.setup(GenericContainerTest.java:285)
	at sun.reflect.GeneratedMethodAccessor14.invoke(Unknown Source)
	at sun.reflect.DelegatingMethodAccessorImpl.invoke(DelegatingMethodAccessorImpl.java:43)
	at java.lang.reflect.Method.invoke(Method.java:497)
	at org.junit.runners.model.FrameworkMethod$1.runReflectiveCall(FrameworkMethod.java:45)
	at org.junit.internal.runners.model.ReflectiveCallable.run(ReflectiveCallable.java:15)
	at org.junit.runners.model.FrameworkMethod.invokeExplosively(FrameworkMethod.java:42)
	at org.junit.internal.runners.statements.RunBefores.evaluate(RunBefores.java:27)
	at org.junit.internal.runners.statements.RunAfters.evaluate(RunAfters.java:30)
	at org.junit.runners.ParentRunner.runLeaf(ParentRunner.java:263)
	at org.junit.runners.BlockJUnit4ClassRunner.runChild(BlockJUnit4ClassRunner.java:68)
	at org.junit.runners.BlockJUnit4ClassRunner.runChild(BlockJUnit4ClassRunner.java:47)
	at org.junit.runners.ParentRunner$3.run(ParentRunner.java:231)
	at org.junit.runners.ParentRunner$1.schedule(ParentRunner.java:60)
	at org.junit.runners.ParentRunner.runChildren(ParentRunner.java:229)
	at org.junit.runners.ParentRunner.access$000(ParentRunner.java:50)
	at org.junit.runners.ParentRunner$2.evaluate(ParentRunner.java:222)
	at org.junit.runners.ParentRunner.run(ParentRunner.java:300)
	at org.apache.maven.surefire.junit4.JUnit4Provider.execute(JUnit4Provider.java:252)
	at org.apache.maven.surefire.junit4.JUnit4Provider.executeTestSet(JUnit4Provider.java:141)
	at org.apache.maven.surefire.junit4.JUnit4Provider.invoke(JUnit4Provider.java:112)
	at sun.reflect.NativeMethodAccessorImpl.invoke0(Native Method)
	at sun.reflect.NativeMethodAccessorImpl.invoke(NativeMethodAccessorImpl.java:62)
	at sun.reflect.DelegatingMethodAccessorImpl.invoke(DelegatingMethodAccessorImpl.java:43)
	at java.lang.reflect.Method.invoke(Method.java:497)
	at org.apache.maven.surefire.util.ReflectionUtils.invokeMethodWithArray(ReflectionUtils.java:189)
	at org.apache.maven.surefire.booter.ProviderFactory$ProviderProxy.invoke(ProviderFactory.java:165)
	at org.apache.maven.surefire.booter.ProviderFactory.invokeProvider(ProviderFactory.java:85)
	at org.apache.maven.surefire.booter.ForkedBooter.runSuitesInProcess(ForkedBooter.java:115)
	at org.apache.maven.surefire.booter.ForkedBooter.main(ForkedBooter.java:75)

shoudRegisterConvertersInConverters(br.com.caelum.vraptor.ioc.guice.GuiceProviderTest)  Time elapsed: 0.071 sec  <<< ERROR!
com.google.inject.CreationException: Guice creation errors:

1) Binding points to itself.
  at br.com.caelum.vraptor.ioc.guice.GuiceComponentRegistry.deepRegister(GuiceComponentRegistry.java:63)

2) A binding to br.com.caelum.vraptor.ioc.fixture.ComponentFactoryInTheClasspath was already configured at br.com.caelum.vraptor.ioc.guice.GuiceComponentRegistry.bindToConstructor(GuiceComponentRegistry.java:75).
  at br.com.caelum.vraptor.ioc.guice.GuiceComponentRegistry.deepRegister(GuiceComponentRegistry.java:63)

3) A binding to br.com.caelum.vraptor.ioc.fixture.ResourceInTheClasspath was already configured at br.com.caelum.vraptor.ioc.guice.GuiceComponentRegistry.bindToConstructor(GuiceComponentRegistry.java:75).
  at br.com.caelum.vraptor.ioc.guice.GuiceComponentRegistry.deepRegister(GuiceComponentRegistry.java:63)

4) A binding to br.com.caelum.vraptor.ioc.fixture.CustomMethodNotAllowedHandler was already configured at br.com.caelum.vraptor.ioc.guice.GuiceComponentRegistry.bindToConstructor(GuiceComponentRegistry.java:75).
  at br.com.caelum.vraptor.ioc.guice.GuiceComponentRegistry.deepRegister(GuiceComponentRegistry.java:63)

5) A binding to br.com.caelum.vraptor.ioc.fixture.NoConstructor was already configured at br.com.caelum.vraptor.ioc.guice.GuiceComponentRegistry.bindToConstructor(GuiceComponentRegistry.java:75).
  at br.com.caelum.vraptor.ioc.guice.GuiceComponentRegistry.deepRegister(GuiceComponentRegistry.java:63)

6) A binding to br.com.caelum.vraptor.ioc.fixture.DependentOnSomethingFromComponentFactory was already configured at br.com.caelum.vraptor.ioc.guice.GuiceComponentRegistry.bindToConstructor(GuiceComponentRegistry.java:75).
  at br.com.caelum.vraptor.ioc.guice.GuiceComponentRegistry.deepRegister(GuiceComponentRegistry.java:63)

7) A binding to br.com.caelum.vraptor.ioc.fixture.CustomComponentWithLifecycleInTheClasspath was already configured at br.com.caelum.vraptor.ioc.guice.GuiceComponentRegistry.bindToConstructor(GuiceComponentRegistry.java:75).
  at br.com.caelum.vraptor.ioc.guice.GuiceComponentRegistry.deepRegister(GuiceComponentRegistry.java:63)

8) A binding to br.com.caelum.vraptor.ioc.fixture.InterceptorInTheClasspath was already configured at br.com.caelum.vraptor.ioc.guice.GuiceComponentRegistry.bindToConstructor(GuiceComponentRegistry.java:75).
  at br.com.caelum.vraptor.ioc.guice.GuiceComponentRegistry.deepRegister(GuiceComponentRegistry.java:63)

9) A binding to br.com.caelum.vraptor.ioc.fixture.CustomComponentInTheClasspath was already configured at br.com.caelum.vraptor.ioc.guice.GuiceComponentRegistry.bindToConstructor(GuiceComponentRegistry.java:75).
  at br.com.caelum.vraptor.ioc.guice.GuiceComponentRegistry.deepRegister(GuiceComponentRegistry.java:63)

10) A binding to br.com.caelum.vraptor.ioc.fixture.HasConstructor was already configured at br.com.caelum.vraptor.ioc.guice.GuiceComponentRegistry.bindToConstructor(GuiceComponentRegistry.java:75).
  at br.com.caelum.vraptor.ioc.guice.GuiceComponentRegistry.deepRegister(GuiceComponentRegistry.java:63)

11) A binding to br.com.caelum.vraptor.ioc.fixture.ConverterInTheClasspath was already configured at br.com.caelum.vraptor.ioc.guice.GuiceComponentRegistry.bindToConstructor(GuiceComponentRegistry.java:75).
  at br.com.caelum.vraptor.ioc.guice.GuiceComponentRegistry.deepRegister(GuiceComponentRegistry.java:63)

11 errors
	at com.google.inject.internal.Errors.throwCreationExceptionIfErrorsExist(Errors.java:435)
	at com.google.inject.internal.InternalInjectorCreator.initializeStatically(InternalInjectorCreator.java:154)
	at com.google.inject.internal.InternalInjectorCreator.build(InternalInjectorCreator.java:106)
	at com.google.inject.Guice.createInjector(Guice.java:95)
	at com.google.inject.Guice.createInjector(Guice.java:83)
	at br.com.caelum.vraptor.ioc.guice.GuiceProvider.start(GuiceProvider.java:97)
	at br.com.caelum.vraptor.ioc.GenericContainerTest.start(GenericContainerTest.java:288)
	at br.com.caelum.vraptor.ioc.GenericContainerTest.setup(GenericContainerTest.java:285)
	at sun.reflect.GeneratedMethodAccessor14.invoke(Unknown Source)
	at sun.reflect.DelegatingMethodAccessorImpl.invoke(DelegatingMethodAccessorImpl.java:43)
	at java.lang.reflect.Method.invoke(Method.java:497)
	at org.junit.runners.model.FrameworkMethod$1.runReflectiveCall(FrameworkMethod.java:45)
	at org.junit.internal.runners.model.ReflectiveCallable.run(ReflectiveCallable.java:15)
	at org.junit.runners.model.FrameworkMethod.invokeExplosively(FrameworkMethod.java:42)
	at org.junit.internal.runners.statements.RunBefores.evaluate(RunBefores.java:27)
	at org.junit.internal.runners.statements.RunAfters.evaluate(RunAfters.java:30)
	at org.junit.runners.ParentRunner.runLeaf(ParentRunner.java:263)
	at org.junit.runners.BlockJUnit4ClassRunner.runChild(BlockJUnit4ClassRunner.java:68)
	at org.junit.runners.BlockJUnit4ClassRunner.runChild(BlockJUnit4ClassRunner.java:47)
	at org.junit.runners.ParentRunner$3.run(ParentRunner.java:231)
	at org.junit.runners.ParentRunner$1.schedule(ParentRunner.java:60)
	at org.junit.runners.ParentRunner.runChildren(ParentRunner.java:229)
	at org.junit.runners.ParentRunner.access$000(ParentRunner.java:50)
	at org.junit.runners.ParentRunner$2.evaluate(ParentRunner.java:222)
	at org.junit.runners.ParentRunner.run(ParentRunner.java:300)
	at org.apache.maven.surefire.junit4.JUnit4Provider.execute(JUnit4Provider.java:252)
	at org.apache.maven.surefire.junit4.JUnit4Provider.executeTestSet(JUnit4Provider.java:141)
	at org.apache.maven.surefire.junit4.JUnit4Provider.invoke(JUnit4Provider.java:112)
	at sun.reflect.NativeMethodAccessorImpl.invoke0(Native Method)
	at sun.reflect.NativeMethodAccessorImpl.invoke(NativeMethodAccessorImpl.java:62)
	at sun.reflect.DelegatingMethodAccessorImpl.invoke(DelegatingMethodAccessorImpl.java:43)
	at java.lang.reflect.Method.invoke(Method.java:497)
	at org.apache.maven.surefire.util.ReflectionUtils.invokeMethodWithArray(ReflectionUtils.java:189)
	at org.apache.maven.surefire.booter.ProviderFactory$ProviderProxy.invoke(ProviderFactory.java:165)
	at org.apache.maven.surefire.booter.ProviderFactory.invokeProvider(ProviderFactory.java:85)
	at org.apache.maven.surefire.booter.ForkedBooter.runSuitesInProcess(ForkedBooter.java:115)
	at org.apache.maven.surefire.booter.ForkedBooter.main(ForkedBooter.java:75)

shouldReturnAllDefaultDeserializers(br.com.caelum.vraptor.ioc.guice.GuiceProviderTest)  Time elapsed: 0.043 sec  <<< ERROR!
com.google.inject.CreationException: Guice creation errors:

1) Binding points to itself.
  at br.com.caelum.vraptor.ioc.guice.GuiceComponentRegistry.deepRegister(GuiceComponentRegistry.java:63)

2) A binding to br.com.caelum.vraptor.ioc.fixture.ComponentFactoryInTheClasspath was already configured at br.com.caelum.vraptor.ioc.guice.GuiceComponentRegistry.bindToConstructor(GuiceComponentRegistry.java:75).
  at br.com.caelum.vraptor.ioc.guice.GuiceComponentRegistry.deepRegister(GuiceComponentRegistry.java:63)

3) A binding to br.com.caelum.vraptor.ioc.fixture.ResourceInTheClasspath was already configured at br.com.caelum.vraptor.ioc.guice.GuiceComponentRegistry.bindToConstructor(GuiceComponentRegistry.java:75).
  at br.com.caelum.vraptor.ioc.guice.GuiceComponentRegistry.deepRegister(GuiceComponentRegistry.java:63)

4) A binding to br.com.caelum.vraptor.ioc.fixture.CustomMethodNotAllowedHandler was already configured at br.com.caelum.vraptor.ioc.guice.GuiceComponentRegistry.bindToConstructor(GuiceComponentRegistry.java:75).
  at br.com.caelum.vraptor.ioc.guice.GuiceComponentRegistry.deepRegister(GuiceComponentRegistry.java:63)

5) A binding to br.com.caelum.vraptor.ioc.fixture.NoConstructor was already configured at br.com.caelum.vraptor.ioc.guice.GuiceComponentRegistry.bindToConstructor(GuiceComponentRegistry.java:75).
  at br.com.caelum.vraptor.ioc.guice.GuiceComponentRegistry.deepRegister(GuiceComponentRegistry.java:63)

6) A binding to br.com.caelum.vraptor.ioc.fixture.DependentOnSomethingFromComponentFactory was already configured at br.com.caelum.vraptor.ioc.guice.GuiceComponentRegistry.bindToConstructor(GuiceComponentRegistry.java:75).
  at br.com.caelum.vraptor.ioc.guice.GuiceComponentRegistry.deepRegister(GuiceComponentRegistry.java:63)

7) A binding to br.com.caelum.vraptor.ioc.fixture.CustomComponentWithLifecycleInTheClasspath was already configured at br.com.caelum.vraptor.ioc.guice.GuiceComponentRegistry.bindToConstructor(GuiceComponentRegistry.java:75).
  at br.com.caelum.vraptor.ioc.guice.GuiceComponentRegistry.deepRegister(GuiceComponentRegistry.java:63)

8) A binding to br.com.caelum.vraptor.ioc.fixture.InterceptorInTheClasspath was already configured at br.com.caelum.vraptor.ioc.guice.GuiceComponentRegistry.bindToConstructor(GuiceComponentRegistry.java:75).
  at br.com.caelum.vraptor.ioc.guice.GuiceComponentRegistry.deepRegister(GuiceComponentRegistry.java:63)

9) A binding to br.com.caelum.vraptor.ioc.fixture.CustomComponentInTheClasspath was already configured at br.com.caelum.vraptor.ioc.guice.GuiceComponentRegistry.bindToConstructor(GuiceComponentRegistry.java:75).
  at br.com.caelum.vraptor.ioc.guice.GuiceComponentRegistry.deepRegister(GuiceComponentRegistry.java:63)

10) A binding to br.com.caelum.vraptor.ioc.fixture.HasConstructor was already configured at br.com.caelum.vraptor.ioc.guice.GuiceComponentRegistry.bindToConstructor(GuiceComponentRegistry.java:75).
  at br.com.caelum.vraptor.ioc.guice.GuiceComponentRegistry.deepRegister(GuiceComponentRegistry.java:63)

11) A binding to br.com.caelum.vraptor.ioc.fixture.ConverterInTheClasspath was already configured at br.com.caelum.vraptor.ioc.guice.GuiceComponentRegistry.bindToConstructor(GuiceComponentRegistry.java:75).
  at br.com.caelum.vraptor.ioc.guice.GuiceComponentRegistry.deepRegister(GuiceComponentRegistry.java:63)

11 errors
	at com.google.inject.internal.Errors.throwCreationExceptionIfErrorsExist(Errors.java:435)
	at com.google.inject.internal.InternalInjectorCreator.initializeStatically(InternalInjectorCreator.java:154)
	at com.google.inject.internal.InternalInjectorCreator.build(InternalInjectorCreator.java:106)
	at com.google.inject.Guice.createInjector(Guice.java:95)
	at com.google.inject.Guice.createInjector(Guice.java:83)
	at br.com.caelum.vraptor.ioc.guice.GuiceProvider.start(GuiceProvider.java:97)
	at br.com.caelum.vraptor.ioc.GenericContainerTest.start(GenericContainerTest.java:288)
	at br.com.caelum.vraptor.ioc.GenericContainerTest.setup(GenericContainerTest.java:285)
	at sun.reflect.GeneratedMethodAccessor14.invoke(Unknown Source)
	at sun.reflect.DelegatingMethodAccessorImpl.invoke(DelegatingMethodAccessorImpl.java:43)
	at java.lang.reflect.Method.invoke(Method.java:497)
	at org.junit.runners.model.FrameworkMethod$1.runReflectiveCall(FrameworkMethod.java:45)
	at org.junit.internal.runners.model.ReflectiveCallable.run(ReflectiveCallable.java:15)
	at org.junit.runners.model.FrameworkMethod.invokeExplosively(FrameworkMethod.java:42)
	at org.junit.internal.runners.statements.RunBefores.evaluate(RunBefores.java:27)
	at org.junit.internal.runners.statements.RunAfters.evaluate(RunAfters.java:30)
	at org.junit.runners.ParentRunner.runLeaf(ParentRunner.java:263)
	at org.junit.runners.BlockJUnit4ClassRunner.runChild(BlockJUnit4ClassRunner.java:68)
	at org.junit.runners.BlockJUnit4ClassRunner.runChild(BlockJUnit4ClassRunner.java:47)
	at org.junit.runners.ParentRunner$3.run(ParentRunner.java:231)
	at org.junit.runners.ParentRunner$1.schedule(ParentRunner.java:60)
	at org.junit.runners.ParentRunner.runChildren(ParentRunner.java:229)
	at org.junit.runners.ParentRunner.access$000(ParentRunner.java:50)
	at org.junit.runners.ParentRunner$2.evaluate(ParentRunner.java:222)
	at org.junit.runners.ParentRunner.run(ParentRunner.java:300)
	at org.apache.maven.surefire.junit4.JUnit4Provider.execute(JUnit4Provider.java:252)
	at org.apache.maven.surefire.junit4.JUnit4Provider.executeTestSet(JUnit4Provider.java:141)
	at org.apache.maven.surefire.junit4.JUnit4Provider.invoke(JUnit4Provider.java:112)
	at sun.reflect.NativeMethodAccessorImpl.invoke0(Native Method)
	at sun.reflect.NativeMethodAccessorImpl.invoke(NativeMethodAccessorImpl.java:62)
	at sun.reflect.DelegatingMethodAccessorImpl.invoke(DelegatingMethodAccessorImpl.java:43)
	at java.lang.reflect.Method.invoke(Method.java:497)
	at org.apache.maven.surefire.util.ReflectionUtils.invokeMethodWithArray(ReflectionUtils.java:189)
	at org.apache.maven.surefire.booter.ProviderFactory$ProviderProxy.invoke(ProviderFactory.java:165)
	at org.apache.maven.surefire.booter.ProviderFactory.invokeProvider(ProviderFactory.java:85)
	at org.apache.maven.surefire.booter.ForkedBooter.runSuitesInProcess(ForkedBooter.java:115)
	at org.apache.maven.surefire.booter.ForkedBooter.main(ForkedBooter.java:75)

shoudRegisterInterceptorsInInterceptorRegistry(br.com.caelum.vraptor.ioc.guice.GuiceProviderTest)  Time elapsed: 0.082 sec  <<< ERROR!
com.google.inject.CreationException: Guice creation errors:

1) Binding points to itself.
  at br.com.caelum.vraptor.ioc.guice.GuiceComponentRegistry.deepRegister(GuiceComponentRegistry.java:63)

2) A binding to br.com.caelum.vraptor.ioc.fixture.ComponentFactoryInTheClasspath was already configured at br.com.caelum.vraptor.ioc.guice.GuiceComponentRegistry.bindToConstructor(GuiceComponentRegistry.java:75).
  at br.com.caelum.vraptor.ioc.guice.GuiceComponentRegistry.deepRegister(GuiceComponentRegistry.java:63)

3) A binding to br.com.caelum.vraptor.ioc.fixture.ResourceInTheClasspath was already configured at br.com.caelum.vraptor.ioc.guice.GuiceComponentRegistry.bindToConstructor(GuiceComponentRegistry.java:75).
  at br.com.caelum.vraptor.ioc.guice.GuiceComponentRegistry.deepRegister(GuiceComponentRegistry.java:63)

4) A binding to br.com.caelum.vraptor.ioc.fixture.CustomMethodNotAllowedHandler was already configured at br.com.caelum.vraptor.ioc.guice.GuiceComponentRegistry.bindToConstructor(GuiceComponentRegistry.java:75).
  at br.com.caelum.vraptor.ioc.guice.GuiceComponentRegistry.deepRegister(GuiceComponentRegistry.java:63)

5) A binding to br.com.caelum.vraptor.ioc.fixture.NoConstructor was already configured at br.com.caelum.vraptor.ioc.guice.GuiceComponentRegistry.bindToConstructor(GuiceComponentRegistry.java:75).
  at br.com.caelum.vraptor.ioc.guice.GuiceComponentRegistry.deepRegister(GuiceComponentRegistry.java:63)

6) A binding to br.com.caelum.vraptor.ioc.fixture.DependentOnSomethingFromComponentFactory was already configured at br.com.caelum.vraptor.ioc.guice.GuiceComponentRegistry.bindToConstructor(GuiceComponentRegistry.java:75).
  at br.com.caelum.vraptor.ioc.guice.GuiceComponentRegistry.deepRegister(GuiceComponentRegistry.java:63)

7) A binding to br.com.caelum.vraptor.ioc.fixture.CustomComponentWithLifecycleInTheClasspath was already configured at br.com.caelum.vraptor.ioc.guice.GuiceComponentRegistry.bindToConstructor(GuiceComponentRegistry.java:75).
  at br.com.caelum.vraptor.ioc.guice.GuiceComponentRegistry.deepRegister(GuiceComponentRegistry.java:63)

8) A binding to br.com.caelum.vraptor.ioc.fixture.InterceptorInTheClasspath was already configured at br.com.caelum.vraptor.ioc.guice.GuiceComponentRegistry.bindToConstructor(GuiceComponentRegistry.java:75).
  at br.com.caelum.vraptor.ioc.guice.GuiceComponentRegistry.deepRegister(GuiceComponentRegistry.java:63)

9) A binding to br.com.caelum.vraptor.ioc.fixture.CustomComponentInTheClasspath was already configured at br.com.caelum.vraptor.ioc.guice.GuiceComponentRegistry.bindToConstructor(GuiceComponentRegistry.java:75).
  at br.com.caelum.vraptor.ioc.guice.GuiceComponentRegistry.deepRegister(GuiceComponentRegistry.java:63)

10) A binding to br.com.caelum.vraptor.ioc.fixture.HasConstructor was already configured at br.com.caelum.vraptor.ioc.guice.GuiceComponentRegistry.bindToConstructor(GuiceComponentRegistry.java:75).
  at br.com.caelum.vraptor.ioc.guice.GuiceComponentRegistry.deepRegister(GuiceComponentRegistry.java:63)

11) A binding to br.com.caelum.vraptor.ioc.fixture.ConverterInTheClasspath was already configured at br.com.caelum.vraptor.ioc.guice.GuiceComponentRegistry.bindToConstructor(GuiceComponentRegistry.java:75).
  at br.com.caelum.vraptor.ioc.guice.GuiceComponentRegistry.deepRegister(GuiceComponentRegistry.java:63)

11 errors
	at com.google.inject.internal.Errors.throwCreationExceptionIfErrorsExist(Errors.java:435)
	at com.google.inject.internal.InternalInjectorCreator.initializeStatically(InternalInjectorCreator.java:154)
	at com.google.inject.internal.InternalInjectorCreator.build(InternalInjectorCreator.java:106)
	at com.google.inject.Guice.createInjector(Guice.java:95)
	at com.google.inject.Guice.createInjector(Guice.java:83)
	at br.com.caelum.vraptor.ioc.guice.GuiceProvider.start(GuiceProvider.java:97)
	at br.com.caelum.vraptor.ioc.GenericContainerTest.start(GenericContainerTest.java:288)
	at br.com.caelum.vraptor.ioc.GenericContainerTest.setup(GenericContainerTest.java:285)
	at sun.reflect.GeneratedMethodAccessor14.invoke(Unknown Source)
	at sun.reflect.DelegatingMethodAccessorImpl.invoke(DelegatingMethodAccessorImpl.java:43)
	at java.lang.reflect.Method.invoke(Method.java:497)
	at org.junit.runners.model.FrameworkMethod$1.runReflectiveCall(FrameworkMethod.java:45)
	at org.junit.internal.runners.model.ReflectiveCallable.run(ReflectiveCallable.java:15)
	at org.junit.runners.model.FrameworkMethod.invokeExplosively(FrameworkMethod.java:42)
	at org.junit.internal.runners.statements.RunBefores.evaluate(RunBefores.java:27)
	at org.junit.internal.runners.statements.RunAfters.evaluate(RunAfters.java:30)
	at org.junit.runners.ParentRunner.runLeaf(ParentRunner.java:263)
	at org.junit.runners.BlockJUnit4ClassRunner.runChild(BlockJUnit4ClassRunner.java:68)
	at org.junit.runners.BlockJUnit4ClassRunner.runChild(BlockJUnit4ClassRunner.java:47)
	at org.junit.runners.ParentRunner$3.run(ParentRunner.java:231)
	at org.junit.runners.ParentRunner$1.schedule(ParentRunner.java:60)
	at org.junit.runners.ParentRunner.runChildren(ParentRunner.java:229)
	at org.junit.runners.ParentRunner.access$000(ParentRunner.java:50)
	at org.junit.runners.ParentRunner$2.evaluate(ParentRunner.java:222)
	at org.junit.runners.ParentRunner.run(ParentRunner.java:300)
	at org.apache.maven.surefire.junit4.JUnit4Provider.execute(JUnit4Provider.java:252)
	at org.apache.maven.surefire.junit4.JUnit4Provider.executeTestSet(JUnit4Provider.java:141)
	at org.apache.maven.surefire.junit4.JUnit4Provider.invoke(JUnit4Provider.java:112)
	at sun.reflect.NativeMethodAccessorImpl.invoke0(Native Method)
	at sun.reflect.NativeMethodAccessorImpl.invoke(NativeMethodAccessorImpl.java:62)
	at sun.reflect.DelegatingMethodAccessorImpl.invoke(DelegatingMethodAccessorImpl.java:43)
	at java.lang.reflect.Method.invoke(Method.java:497)
	at org.apache.maven.surefire.util.ReflectionUtils.invokeMethodWithArray(ReflectionUtils.java:189)
	at org.apache.maven.surefire.booter.ProviderFactory$ProviderProxy.invoke(ProviderFactory.java:165)
	at org.apache.maven.surefire.booter.ProviderFactory.invokeProvider(ProviderFactory.java:85)
	at org.apache.maven.surefire.booter.ForkedBooter.runSuitesInProcess(ForkedBooter.java:115)
	at org.apache.maven.surefire.booter.ForkedBooter.main(ForkedBooter.java:75)

shoudCallPredestroyExactlyOneTimeForComponentsScannedFromTheClasspath(br.com.caelum.vraptor.ioc.guice.GuiceProviderTest)  Time elapsed: 0.044 sec  <<< ERROR!
com.google.inject.CreationException: Guice creation errors:

1) Binding points to itself.
  at br.com.caelum.vraptor.ioc.guice.GuiceComponentRegistry.deepRegister(GuiceComponentRegistry.java:63)

2) A binding to br.com.caelum.vraptor.ioc.fixture.ComponentFactoryInTheClasspath was already configured at br.com.caelum.vraptor.ioc.guice.GuiceComponentRegistry.bindToConstructor(GuiceComponentRegistry.java:75).
  at br.com.caelum.vraptor.ioc.guice.GuiceComponentRegistry.deepRegister(GuiceComponentRegistry.java:63)

3) A binding to br.com.caelum.vraptor.ioc.fixture.ResourceInTheClasspath was already configured at br.com.caelum.vraptor.ioc.guice.GuiceComponentRegistry.bindToConstructor(GuiceComponentRegistry.java:75).
  at br.com.caelum.vraptor.ioc.guice.GuiceComponentRegistry.deepRegister(GuiceComponentRegistry.java:63)

4) A binding to br.com.caelum.vraptor.ioc.fixture.CustomMethodNotAllowedHandler was already configured at br.com.caelum.vraptor.ioc.guice.GuiceComponentRegistry.bindToConstructor(GuiceComponentRegistry.java:75).
  at br.com.caelum.vraptor.ioc.guice.GuiceComponentRegistry.deepRegister(GuiceComponentRegistry.java:63)

5) A binding to br.com.caelum.vraptor.ioc.fixture.NoConstructor was already configured at br.com.caelum.vraptor.ioc.guice.GuiceComponentRegistry.bindToConstructor(GuiceComponentRegistry.java:75).
  at br.com.caelum.vraptor.ioc.guice.GuiceComponentRegistry.deepRegister(GuiceComponentRegistry.java:63)

6) A binding to br.com.caelum.vraptor.ioc.fixture.DependentOnSomethingFromComponentFactory was already configured at br.com.caelum.vraptor.ioc.guice.GuiceComponentRegistry.bindToConstructor(GuiceComponentRegistry.java:75).
  at br.com.caelum.vraptor.ioc.guice.GuiceComponentRegistry.deepRegister(GuiceComponentRegistry.java:63)

7) A binding to br.com.caelum.vraptor.ioc.fixture.CustomComponentWithLifecycleInTheClasspath was already configured at br.com.caelum.vraptor.ioc.guice.GuiceComponentRegistry.bindToConstructor(GuiceComponentRegistry.java:75).
  at br.com.caelum.vraptor.ioc.guice.GuiceComponentRegistry.deepRegister(GuiceComponentRegistry.java:63)

8) A binding to br.com.caelum.vraptor.ioc.fixture.InterceptorInTheClasspath was already configured at br.com.caelum.vraptor.ioc.guice.GuiceComponentRegistry.bindToConstructor(GuiceComponentRegistry.java:75).
  at br.com.caelum.vraptor.ioc.guice.GuiceComponentRegistry.deepRegister(GuiceComponentRegistry.java:63)

9) A binding to br.com.caelum.vraptor.ioc.fixture.CustomComponentInTheClasspath was already configured at br.com.caelum.vraptor.ioc.guice.GuiceComponentRegistry.bindToConstructor(GuiceComponentRegistry.java:75).
  at br.com.caelum.vraptor.ioc.guice.GuiceComponentRegistry.deepRegister(GuiceComponentRegistry.java:63)

10) A binding to br.com.caelum.vraptor.ioc.fixture.HasConstructor was already configured at br.com.caelum.vraptor.ioc.guice.GuiceComponentRegistry.bindToConstructor(GuiceComponentRegistry.java:75).
  at br.com.caelum.vraptor.ioc.guice.GuiceComponentRegistry.deepRegister(GuiceComponentRegistry.java:63)

11) A binding to br.com.caelum.vraptor.ioc.fixture.ConverterInTheClasspath was already configured at br.com.caelum.vraptor.ioc.guice.GuiceComponentRegistry.bindToConstructor(GuiceComponentRegistry.java:75).
  at br.com.caelum.vraptor.ioc.guice.GuiceComponentRegistry.deepRegister(GuiceComponentRegistry.java:63)

11 errors
	at com.google.inject.internal.Errors.throwCreationExceptionIfErrorsExist(Errors.java:435)
	at com.google.inject.internal.InternalInjectorCreator.initializeStatically(InternalInjectorCreator.java:154)
	at com.google.inject.internal.InternalInjectorCreator.build(InternalInjectorCreator.java:106)
	at com.google.inject.Guice.createInjector(Guice.java:95)
	at com.google.inject.Guice.createInjector(Guice.java:83)
	at br.com.caelum.vraptor.ioc.guice.GuiceProvider.start(GuiceProvider.java:97)
	at br.com.caelum.vraptor.ioc.GenericContainerTest.start(GenericContainerTest.java:288)
	at br.com.caelum.vraptor.ioc.GenericContainerTest.setup(GenericContainerTest.java:285)
	at sun.reflect.GeneratedMethodAccessor14.invoke(Unknown Source)
	at sun.reflect.DelegatingMethodAccessorImpl.invoke(DelegatingMethodAccessorImpl.java:43)
	at java.lang.reflect.Method.invoke(Method.java:497)
	at org.junit.runners.model.FrameworkMethod$1.runReflectiveCall(FrameworkMethod.java:45)
	at org.junit.internal.runners.model.ReflectiveCallable.run(ReflectiveCallable.java:15)
	at org.junit.runners.model.FrameworkMethod.invokeExplosively(FrameworkMethod.java:42)
	at org.junit.internal.runners.statements.RunBefores.evaluate(RunBefores.java:27)
	at org.junit.internal.runners.statements.RunAfters.evaluate(RunAfters.java:30)
	at org.junit.runners.ParentRunner.runLeaf(ParentRunner.java:263)
	at org.junit.runners.BlockJUnit4ClassRunner.runChild(BlockJUnit4ClassRunner.java:68)
	at org.junit.runners.BlockJUnit4ClassRunner.runChild(BlockJUnit4ClassRunner.java:47)
	at org.junit.runners.ParentRunner$3.run(ParentRunner.java:231)
	at org.junit.runners.ParentRunner$1.schedule(ParentRunner.java:60)
	at org.junit.runners.ParentRunner.runChildren(ParentRunner.java:229)
	at org.junit.runners.ParentRunner.access$000(ParentRunner.java:50)
	at org.junit.runners.ParentRunner$2.evaluate(ParentRunner.java:222)
	at org.junit.runners.ParentRunner.run(ParentRunner.java:300)
	at org.apache.maven.surefire.junit4.JUnit4Provider.execute(JUnit4Provider.java:252)
	at org.apache.maven.surefire.junit4.JUnit4Provider.executeTestSet(JUnit4Provider.java:141)
	at org.apache.maven.surefire.junit4.JUnit4Provider.invoke(JUnit4Provider.java:112)
	at sun.reflect.NativeMethodAccessorImpl.invoke0(Native Method)
	at sun.reflect.NativeMethodAccessorImpl.invoke(NativeMethodAccessorImpl.java:62)
	at sun.reflect.DelegatingMethodAccessorImpl.invoke(DelegatingMethodAccessorImpl.java:43)
	at java.lang.reflect.Method.invoke(Method.java:497)
	at org.apache.maven.surefire.util.ReflectionUtils.invokeMethodWithArray(ReflectionUtils.java:189)
	at org.apache.maven.surefire.booter.ProviderFactory$ProviderProxy.invoke(ProviderFactory.java:165)
	at org.apache.maven.surefire.booter.ProviderFactory.invokeProvider(ProviderFactory.java:85)
	at org.apache.maven.surefire.booter.ForkedBooter.runSuitesInProcess(ForkedBooter.java:115)
	at org.apache.maven.surefire.booter.ForkedBooter.main(ForkedBooter.java:75)

shoudCallPredestroyExactlyOneTimeForComponentFactoriesScannedFromTheClasspath(br.com.caelum.vraptor.ioc.guice.GuiceProviderTest)  Time elapsed: 0.085 sec  <<< ERROR!
com.google.inject.CreationException: Guice creation errors:

1) Binding points to itself.
  at br.com.caelum.vraptor.ioc.guice.GuiceComponentRegistry.deepRegister(GuiceComponentRegistry.java:63)

2) A binding to br.com.caelum.vraptor.ioc.fixture.ComponentFactoryInTheClasspath was already configured at br.com.caelum.vraptor.ioc.guice.GuiceComponentRegistry.bindToConstructor(GuiceComponentRegistry.java:75).
  at br.com.caelum.vraptor.ioc.guice.GuiceComponentRegistry.deepRegister(GuiceComponentRegistry.java:63)

3) A binding to br.com.caelum.vraptor.ioc.fixture.ResourceInTheClasspath was already configured at br.com.caelum.vraptor.ioc.guice.GuiceComponentRegistry.bindToConstructor(GuiceComponentRegistry.java:75).
  at br.com.caelum.vraptor.ioc.guice.GuiceComponentRegistry.deepRegister(GuiceComponentRegistry.java:63)

4) A binding to br.com.caelum.vraptor.ioc.fixture.CustomMethodNotAllowedHandler was already configured at br.com.caelum.vraptor.ioc.guice.GuiceComponentRegistry.bindToConstructor(GuiceComponentRegistry.java:75).
  at br.com.caelum.vraptor.ioc.guice.GuiceComponentRegistry.deepRegister(GuiceComponentRegistry.java:63)

5) A binding to br.com.caelum.vraptor.ioc.fixture.NoConstructor was already configured at br.com.caelum.vraptor.ioc.guice.GuiceComponentRegistry.bindToConstructor(GuiceComponentRegistry.java:75).
  at br.com.caelum.vraptor.ioc.guice.GuiceComponentRegistry.deepRegister(GuiceComponentRegistry.java:63)

6) A binding to br.com.caelum.vraptor.ioc.fixture.DependentOnSomethingFromComponentFactory was already configured at br.com.caelum.vraptor.ioc.guice.GuiceComponentRegistry.bindToConstructor(GuiceComponentRegistry.java:75).
  at br.com.caelum.vraptor.ioc.guice.GuiceComponentRegistry.deepRegister(GuiceComponentRegistry.java:63)

7) A binding to br.com.caelum.vraptor.ioc.fixture.CustomComponentWithLifecycleInTheClasspath was already configured at br.com.caelum.vraptor.ioc.guice.GuiceComponentRegistry.bindToConstructor(GuiceComponentRegistry.java:75).
  at br.com.caelum.vraptor.ioc.guice.GuiceComponentRegistry.deepRegister(GuiceComponentRegistry.java:63)

8) A binding to br.com.caelum.vraptor.ioc.fixture.InterceptorInTheClasspath was already configured at br.com.caelum.vraptor.ioc.guice.GuiceComponentRegistry.bindToConstructor(GuiceComponentRegistry.java:75).
  at br.com.caelum.vraptor.ioc.guice.GuiceComponentRegistry.deepRegister(GuiceComponentRegistry.java:63)

9) A binding to br.com.caelum.vraptor.ioc.fixture.CustomComponentInTheClasspath was already configured at br.com.caelum.vraptor.ioc.guice.GuiceComponentRegistry.bindToConstructor(GuiceComponentRegistry.java:75).
  at br.com.caelum.vraptor.ioc.guice.GuiceComponentRegistry.deepRegister(GuiceComponentRegistry.java:63)

10) A binding to br.com.caelum.vraptor.ioc.fixture.HasConstructor was already configured at br.com.caelum.vraptor.ioc.guice.GuiceComponentRegistry.bindToConstructor(GuiceComponentRegistry.java:75).
  at br.com.caelum.vraptor.ioc.guice.GuiceComponentRegistry.deepRegister(GuiceComponentRegistry.java:63)

11) A binding to br.com.caelum.vraptor.ioc.fixture.ConverterInTheClasspath was already configured at br.com.caelum.vraptor.ioc.guice.GuiceComponentRegistry.bindToConstructor(GuiceComponentRegistry.java:75).
  at br.com.caelum.vraptor.ioc.guice.GuiceComponentRegistry.deepRegister(GuiceComponentRegistry.java:63)

11 errors
	at com.google.inject.internal.Errors.throwCreationExceptionIfErrorsExist(Errors.java:435)
	at com.google.inject.internal.InternalInjectorCreator.initializeStatically(InternalInjectorCreator.java:154)
	at com.google.inject.internal.InternalInjectorCreator.build(InternalInjectorCreator.java:106)
	at com.google.inject.Guice.createInjector(Guice.java:95)
	at com.google.inject.Guice.createInjector(Guice.java:83)
	at br.com.caelum.vraptor.ioc.guice.GuiceProvider.start(GuiceProvider.java:97)
	at br.com.caelum.vraptor.ioc.GenericContainerTest.start(GenericContainerTest.java:288)
	at br.com.caelum.vraptor.ioc.GenericContainerTest.setup(GenericContainerTest.java:285)
	at sun.reflect.GeneratedMethodAccessor14.invoke(Unknown Source)
	at sun.reflect.DelegatingMethodAccessorImpl.invoke(DelegatingMethodAccessorImpl.java:43)
	at java.lang.reflect.Method.invoke(Method.java:497)
	at org.junit.runners.model.FrameworkMethod$1.runReflectiveCall(FrameworkMethod.java:45)
	at org.junit.internal.runners.model.ReflectiveCallable.run(ReflectiveCallable.java:15)
	at org.junit.runners.model.FrameworkMethod.invokeExplosively(FrameworkMethod.java:42)
	at org.junit.internal.runners.statements.RunBefores.evaluate(RunBefores.java:27)
	at org.junit.internal.runners.statements.RunAfters.evaluate(RunAfters.java:30)
	at org.junit.runners.ParentRunner.runLeaf(ParentRunner.java:263)
	at org.junit.runners.BlockJUnit4ClassRunner.runChild(BlockJUnit4ClassRunner.java:68)
	at org.junit.runners.BlockJUnit4ClassRunner.runChild(BlockJUnit4ClassRunner.java:47)
	at org.junit.runners.ParentRunner$3.run(ParentRunner.java:231)
	at org.junit.runners.ParentRunner$1.schedule(ParentRunner.java:60)
	at org.junit.runners.ParentRunner.runChildren(ParentRunner.java:229)
	at org.junit.runners.ParentRunner.access$000(ParentRunner.java:50)
	at org.junit.runners.ParentRunner$2.evaluate(ParentRunner.java:222)
	at org.junit.runners.ParentRunner.run(ParentRunner.java:300)
	at org.apache.maven.surefire.junit4.JUnit4Provider.execute(JUnit4Provider.java:252)
	at org.apache.maven.surefire.junit4.JUnit4Provider.executeTestSet(JUnit4Provider.java:141)
	at org.apache.maven.surefire.junit4.JUnit4Provider.invoke(JUnit4Provider.java:112)
	at sun.reflect.NativeMethodAccessorImpl.invoke0(Native Method)
	at sun.reflect.NativeMethodAccessorImpl.invoke(NativeMethodAccessorImpl.java:62)
	at sun.reflect.DelegatingMethodAccessorImpl.invoke(DelegatingMethodAccessorImpl.java:43)
	at java.lang.reflect.Method.invoke(Method.java:497)
	at org.apache.maven.surefire.util.ReflectionUtils.invokeMethodWithArray(ReflectionUtils.java:189)
	at org.apache.maven.surefire.booter.ProviderFactory$ProviderProxy.invoke(ProviderFactory.java:165)
	at org.apache.maven.surefire.booter.ProviderFactory.invokeProvider(ProviderFactory.java:85)
	at org.apache.maven.surefire.booter.ForkedBooter.runSuitesInProcess(ForkedBooter.java:115)
	at org.apache.maven.surefire.booter.ForkedBooter.main(ForkedBooter.java:75)

Running br.com.caelum.vraptor.ioc.guice.SessionCustomScopeTest
Tests run: 3, Failures: 0, Errors: 0, Skipped: 0, Time elapsed: 0.013 sec
Running br.com.caelum.vraptor.ioc.InterceptorStereotypeHandlerTest
Tests run: 1, Failures: 0, Errors: 0, Skipped: 0, Time elapsed: 0.003 sec
Running br.com.caelum.vraptor.ioc.pico.CustomPicoProviderTest
log4j:WARN No appenders could be found for logger (org.jboss.logging).
log4j:WARN Please initialize the log4j system properly.
log4j:WARN See http://logging.apache.org/log4j/1.2/faq.html#noconfig for more info.
17:54:28,761  WARN [PicoComponentRegistry] VRaptor was already initialized, the contexts were created but you are registering a component.This is nasty. The original component might already be in use.Avoid doing it: br.com.caelum.vraptor.ioc.GenericContainerTest$MyAppComponent
17:54:28,805  WARN [PicoComponentRegistry] VRaptor was already initialized, the contexts were created but you are registering a component.This is nasty. The original component might already be in use.Avoid doing it: br.com.caelum.vraptor.ioc.GenericContainerTest$MyAppComponentWithLifecycle
Tests run: 25, Failures: 0, Errors: 0, Skipped: 0, Time elapsed: 1.727 sec
Running br.com.caelum.vraptor.ioc.pico.PicoBasedContainerTest
Tests run: 3, Failures: 0, Errors: 0, Skipped: 0, Time elapsed: 0.032 sec
Running br.com.caelum.vraptor.ioc.pico.PicoComponentRegistryTest
17:54:29,311  WARN [PicoComponentRegistry] VRaptor was already initialized, the contexts were created but you are registering a component.This is nasty. The original component might already be in use.Avoid doing it: br.com.caelum.vraptor.ioc.pico.PicoComponentRegistryTest$Base
Tests run: 2, Failures: 0, Errors: 0, Skipped: 0, Time elapsed: 0.006 sec
Running br.com.caelum.vraptor.ioc.pico.PicoProviderTest
17:54:29,798  WARN [PicoComponentRegistry] VRaptor was already initialized, the contexts were created but you are registering a component.This is nasty. The original component might already be in use.Avoid doing it: br.com.caelum.vraptor.ioc.GenericContainerTest$MyAppComponent
17:54:29,839  WARN [PicoComponentRegistry] VRaptor was already initialized, the contexts were created but you are registering a component.This is nasty. The original component might already be in use.Avoid doing it: br.com.caelum.vraptor.ioc.GenericContainerTest$MyAppComponentWithLifecycle
Tests run: 22, Failures: 0, Errors: 0, Skipped: 0, Time elapsed: 0.784 sec
Running br.com.caelum.vraptor.ioc.spring.SpringBasedContainerTest
Tests run: 16, Failures: 0, Errors: 0, Skipped: 0, Time elapsed: 1.809 sec
Running br.com.caelum.vraptor.ioc.spring.SpringProviderRegisteringComponentsTest
Tests run: 21, Failures: 0, Errors: 0, Skipped: 0, Time elapsed: 2.259 sec
Running br.com.caelum.vraptor.ioc.spring.SpringProviderTest
17:54:34,178 ERROR [ScannotationComponentScanner] There's no occurence of package br.com.caelum.vraptor.ioc.spring.components.registrar in classpath
17:54:34,232 ERROR [ScannotationComponentScanner] There's no occurence of package br.com.caelum.vraptor.ioc.spring.components.registrar in classpath
17:54:34,249 ERROR [ScannotationComponentScanner] There's no occurence of package br.com.caelum.vraptor.ioc.spring.components.registrar in classpath
Tests run: 3, Failures: 0, Errors: 0, Skipped: 0, Time elapsed: 0.111 sec
Running br.com.caelum.vraptor.ioc.spring.VRaptorScopeResolverTest
Tests run: 4, Failures: 0, Errors: 0, Skipped: 0, Time elapsed: 0.005 sec
Running br.com.caelum.vraptor.proxy.CglibProxifierTest
Tests run: 8, Failures: 0, Errors: 0, Skipped: 0, Time elapsed: 0.03 sec
Running br.com.caelum.vraptor.proxy.JavassistProxifierTest
Tests run: 8, Failures: 0, Errors: 0, Skipped: 0, Time elapsed: 0.015 sec
Running br.com.caelum.vraptor.proxy.ReflectionInstanceCreatorTest
Tests run: 5, Failures: 0, Errors: 0, Skipped: 0, Time elapsed: 0.004 sec
Running br.com.caelum.vraptor.resource.DefaultMethodNotAllowedHandlerTest
Tests run: 4, Failures: 0, Errors: 0, Skipped: 0, Time elapsed: 0.004 sec
Running br.com.caelum.vraptor.resource.HttpMethodTest
Tests run: 6, Failures: 0, Errors: 0, Skipped: 0, Time elapsed: 0.005 sec
Running br.com.caelum.vraptor.resource.ResourceNotFoundHandlerTest
Tests run: 3, Failures: 0, Errors: 0, Skipped: 0, Time elapsed: 0.002 sec
Running br.com.caelum.vraptor.restfulie.headers.DefaultRestHeadersHandlerTest
Tests run: 5, Failures: 0, Errors: 0, Skipped: 0, Time elapsed: 0.023 sec
Running br.com.caelum.vraptor.restfulie.LinkConverterJSONTest
Tests run: 3, Failures: 0, Errors: 0, Skipped: 0, Time elapsed: 0.089 sec
Running br.com.caelum.vraptor.restfulie.LinkConverterTest
Tests run: 4, Failures: 0, Errors: 0, Skipped: 0, Time elapsed: 0.058 sec
Running br.com.caelum.vraptor.restfulie.relation.DefaultRelationBuilderTest
Tests run: 3, Failures: 0, Errors: 0, Skipped: 0, Time elapsed: 0.005 sec
Running br.com.caelum.vraptor.restfulie.serialization.MethodValueSupportConverterTest
Tests run: 2, Failures: 0, Errors: 0, Skipped: 0, Time elapsed: 0.006 sec
Running br.com.caelum.vraptor.restfulie.serialization.RestfulSerializationJSONTest
Tests run: 3, Failures: 0, Errors: 0, Skipped: 0, Time elapsed: 0.015 sec
Running br.com.caelum.vraptor.restfulie.serialization.RestfulSerializationTest
Tests run: 3, Failures: 0, Errors: 0, Skipped: 0, Time elapsed: 0.005 sec
Running br.com.caelum.vraptor.scan.DynamicWebAppBootstrapTest
Tests run: 3, Failures: 0, Errors: 0, Skipped: 0, Time elapsed: 0.003 sec
Running br.com.caelum.vraptor.scan.JavassistBootstrapGeneratorTest
Tests run: 2, Failures: 0, Errors: 0, Skipped: 0, Time elapsed: 0.078 sec
Running br.com.caelum.vraptor.scan.NullWebAppBootstrapTest
Tests run: 1, Failures: 0, Errors: 0, Skipped: 0, Time elapsed: 0 sec
Running br.com.caelum.vraptor.scan.ScannotationComponentScannerTest
Tests run: 4, Failures: 0, Errors: 0, Skipped: 0, Time elapsed: 0.041 sec
Running br.com.caelum.vraptor.scan.WebBasedClasspathResolverTest
17:54:34,699 ERROR [WebBasedClasspathResolver] Could not get class loader from servlet context. Using current thread class loader...
java.lang.SecurityException: getClassLoader
	at br.com.caelum.vraptor.scan.WebBasedClasspathResolver.getClassLoader(WebBasedClasspathResolver.java:49)
	at br.com.caelum.vraptor.scan.WebBasedClasspathResolverTest.callerContextDifferentFromRequestedClassLoaderReturnsCurrentClassLoader(WebBasedClasspathResolverTest.java:20)
	at sun.reflect.NativeMethodAccessorImpl.invoke0(Native Method)
	at sun.reflect.NativeMethodAccessorImpl.invoke(NativeMethodAccessorImpl.java:62)
	at sun.reflect.DelegatingMethodAccessorImpl.invoke(DelegatingMethodAccessorImpl.java:43)
	at java.lang.reflect.Method.invoke(Method.java:497)
	at org.junit.runners.model.FrameworkMethod$1.runReflectiveCall(FrameworkMethod.java:45)
	at org.junit.internal.runners.model.ReflectiveCallable.run(ReflectiveCallable.java:15)
	at org.junit.runners.model.FrameworkMethod.invokeExplosively(FrameworkMethod.java:42)
	at org.junit.internal.runners.statements.InvokeMethod.evaluate(InvokeMethod.java:20)
	at org.junit.runners.ParentRunner.runLeaf(ParentRunner.java:263)
	at org.junit.runners.BlockJUnit4ClassRunner.runChild(BlockJUnit4ClassRunner.java:68)
	at org.junit.runners.BlockJUnit4ClassRunner.runChild(BlockJUnit4ClassRunner.java:47)
	at org.junit.runners.ParentRunner$3.run(ParentRunner.java:231)
	at org.junit.runners.ParentRunner$1.schedule(ParentRunner.java:60)
	at org.junit.runners.ParentRunner.runChildren(ParentRunner.java:229)
	at org.junit.runners.ParentRunner.access$000(ParentRunner.java:50)
	at org.junit.runners.ParentRunner$2.evaluate(ParentRunner.java:222)
	at org.junit.runners.ParentRunner.run(ParentRunner.java:300)
	at org.apache.maven.surefire.junit4.JUnit4Provider.execute(JUnit4Provider.java:252)
	at org.apache.maven.surefire.junit4.JUnit4Provider.executeTestSet(JUnit4Provider.java:141)
	at org.apache.maven.surefire.junit4.JUnit4Provider.invoke(JUnit4Provider.java:112)
	at sun.reflect.NativeMethodAccessorImpl.invoke0(Native Method)
	at sun.reflect.NativeMethodAccessorImpl.invoke(NativeMethodAccessorImpl.java:62)
	at sun.reflect.DelegatingMethodAccessorImpl.invoke(DelegatingMethodAccessorImpl.java:43)
	at java.lang.reflect.Method.invoke(Method.java:497)
	at org.apache.maven.surefire.util.ReflectionUtils.invokeMethodWithArray(ReflectionUtils.java:189)
	at org.apache.maven.surefire.booter.ProviderFactory$ProviderProxy.invoke(ProviderFactory.java:165)
	at org.apache.maven.surefire.booter.ProviderFactory.invokeProvider(ProviderFactory.java:85)
	at org.apache.maven.surefire.booter.ForkedBooter.runSuitesInProcess(ForkedBooter.java:115)
	at org.apache.maven.surefire.booter.ForkedBooter.main(ForkedBooter.java:75)
Tests run: 1, Failures: 0, Errors: 0, Skipped: 0, Time elapsed: 0.002 sec
Running br.com.caelum.vraptor.serialization.DefaultRepresentationResultTest
Tests run: 7, Failures: 0, Errors: 0, Skipped: 0, Time elapsed: 0.035 sec
Running br.com.caelum.vraptor.serialization.DefaultXMLConfigurationTest
Tests run: 2, Failures: 0, Errors: 0, Skipped: 0, Time elapsed: 0.002 sec
Running br.com.caelum.vraptor.serialization.gson.adapters.MessageSerializerTest
Tests run: 1, Failures: 0, Errors: 0, Skipped: 0, Time elapsed: 0.018 sec
Running br.com.caelum.vraptor.serialization.gson.GsonJSONSerializationTest
Tests run: 27, Failures: 0, Errors: 0, Skipped: 1, Time elapsed: 0.172 sec
Running br.com.caelum.vraptor.serialization.HTMLSerializationTest
Tests run: 6, Failures: 0, Errors: 0, Skipped: 0, Time elapsed: 0.006 sec
Running br.com.caelum.vraptor.serialization.I18nMessageSerializationTest
Tests run: 3, Failures: 0, Errors: 0, Skipped: 0, Time elapsed: 0.019 sec
Running br.com.caelum.vraptor.serialization.PackageComparatorTest
Tests run: 3, Failures: 0, Errors: 0, Skipped: 0, Time elapsed: 0.005 sec
Running br.com.caelum.vraptor.serialization.xstream.XStreamJSONPSerializationTest
Tests run: 2, Failures: 0, Errors: 0, Skipped: 0, Time elapsed: 0.016 sec
Running br.com.caelum.vraptor.serialization.xstream.XStreamJSONSerializationTest
Tests run: 26, Failures: 0, Errors: 0, Skipped: 1, Time elapsed: 0.116 sec
Running br.com.caelum.vraptor.serialization.xstream.XStreamSerializerTest
Tests run: 27, Failures: 0, Errors: 0, Skipped: 1, Time elapsed: 0.102 sec
Running br.com.caelum.vraptor.serialization.xstream.XStreamXMLSerializationTest
Tests run: 27, Failures: 0, Errors: 0, Skipped: 1, Time elapsed: 0.103 sec
Running br.com.caelum.vraptor.util.extjs.DefaultExtJsonTest
Tests run: 4, Failures: 0, Errors: 0, Skipped: 0, Time elapsed: 0.023 sec
Running br.com.caelum.vraptor.util.ISO8601UtilTest
Tests run: 8, Failures: 0, Errors: 0, Skipped: 0, Time elapsed: 0.004 sec
Running br.com.caelum.vraptor.util.StringnifierTest
Tests run: 4, Failures: 0, Errors: 0, Skipped: 0, Time elapsed: 0.002 sec
Running br.com.caelum.vraptor.util.test.MockHttpResultTest
Tests run: 1, Failures: 0, Errors: 0, Skipped: 0, Time elapsed: 0.002 sec
Running br.com.caelum.vraptor.util.test.MockHttpServletResponseTest
Tests run: 2, Failures: 0, Errors: 0, Skipped: 0, Time elapsed: 0 sec
Running br.com.caelum.vraptor.util.test.MockResultTest
Tests run: 7, Failures: 0, Errors: 0, Skipped: 0, Time elapsed: 0.026 sec
Running br.com.caelum.vraptor.util.test.MockSerializationResultTest
Tests run: 1, Failures: 0, Errors: 0, Skipped: 0, Time elapsed: 0.024 sec
Running br.com.caelum.vraptor.util.test.MockValidatorTest
Tests run: 3, Failures: 0, Errors: 0, Skipped: 0, Time elapsed: 0.044 sec
Running br.com.caelum.vraptor.validator.BeanValidatorTest
17:54:35,598  WARN [DefaultBeanValidator] skiping validation, input bean is null.
17:54:35,600  WARN [NullBeanValidator   ] You are willing to validate an object, but there is no bean validation engine registered. Please add the jars of some implementation of Bean Validator.
17:54:35,600  WARN [NullBeanValidator   ] You are willing to validate an object, but there is no bean validation engine registered. Please add the jars of some implementation of Bean Validator.
17:54:35,600  WARN [NullBeanValidator   ] You are willing to validate an object, but there is no bean validation engine registered. Please add the jars of some implementation of Bean Validator.
17:54:35,626  WARN [DefaultBeanValidator] skiping validation, input bean is null.
17:54:35,649  WARN [DefaultBeanValidator] skiping validation, input bean is null.
Tests run: 13, Failures: 0, Errors: 0, Skipped: 0, Time elapsed: 0.213 sec
Running br.com.caelum.vraptor.validator.DefaultValidatorTest
Tests run: 12, Failures: 0, Errors: 0, Skipped: 0, Time elapsed: 0.069 sec
Running br.com.caelum.vraptor.validator.MethodValidatorTest
Tests run: 5, Failures: 0, Errors: 0, Skipped: 0, Time elapsed: 0.071 sec
Running br.com.caelum.vraptor.validator.ReplicatorOutjectorTest
Tests run: 1, Failures: 0, Errors: 0, Skipped: 0, Time elapsed: 0.001 sec
Running br.com.caelum.vraptor.validator.ValidationsTest
Tests run: 19, Failures: 0, Errors: 0, Skipped: 0, Time elapsed: 0.011 sec
Running br.com.caelum.vraptor.validator.ValidatorAcceptanceTest
Tests run: 1, Failures: 0, Errors: 0, Skipped: 0, Time elapsed: 0.004 sec
Running br.com.caelum.vraptor.view.DefaultAcceptHeaderToFormatTest
Tests run: 15, Failures: 0, Errors: 0, Skipped: 0, Time elapsed: 0.005 sec
Running br.com.caelum.vraptor.view.DefaultHttpResultTest
Tests run: 12, Failures: 0, Errors: 0, Skipped: 0, Time elapsed: 0.032 sec
Running br.com.caelum.vraptor.view.DefaultLogicResultTest
Tests run: 12, Failures: 0, Errors: 0, Skipped: 0, Time elapsed: 0.055 sec
Running br.com.caelum.vraptor.view.DefaultPageResultTest
Tests run: 14, Failures: 0, Errors: 0, Skipped: 0, Time elapsed: 0.039 sec
Running br.com.caelum.vraptor.view.DefaultPathResolverTest
Tests run: 3, Failures: 0, Errors: 0, Skipped: 0, Time elapsed: 0.006 sec
Running br.com.caelum.vraptor.view.DefaultRefererResultTest
Tests run: 6, Failures: 0, Errors: 0, Skipped: 0, Time elapsed: 0.015 sec
Running br.com.caelum.vraptor.view.DefaultStatusTest
Tests run: 13, Failures: 0, Errors: 0, Skipped: 0, Time elapsed: 0.033 sec
Running br.com.caelum.vraptor.view.DefaultValidationViewsFactoryTest
Tests run: 24, Failures: 0, Errors: 0, Skipped: 0, Time elapsed: 0.123 sec
Running br.com.caelum.vraptor.view.LinkToHandlerTest
Tests run: 11, Failures: 0, Errors: 0, Skipped: 0, Time elapsed: 0.086 sec
Running br.com.caelum.vraptor.VRaptorTest
Tests run: 4, Failures: 0, Errors: 0, Skipped: 0, Time elapsed: 0.036 sec

Results :

Tests in error: 
  shouldBeAbleToRegisterClasses(br.com.caelum.vraptor.ioc.guice.GuiceProviderTest): Guice creation errors:(..)
  shouldBeAbleToOverrideVRaptorsDefaultImplementation(br.com.caelum.vraptor.ioc.guice.GuiceProviderTest): Guice creation errors:(..)
  shouldBeAbleToRegisterClassesWithDependencies(br.com.caelum.vraptor.ioc.guice.GuiceProviderTest): Guice creation errors:(..)
  shouldBeAbleToReceiveListsOfSerializationsAsDependency(br.com.caelum.vraptor.ioc.guice.GuiceProviderTest): Guice creation errors:(..)
  canProvideAllApplicationScopedComponents(br.com.caelum.vraptor.ioc.guice.GuiceProviderTest): Guice creation errors:(..)
  canProvideAllPrototypeScopedComponents(br.com.caelum.vraptor.ioc.guice.GuiceProviderTest): Guice creation errors:(..)
  canProvideAllRequestScopedComponents(br.com.caelum.vraptor.ioc.guice.GuiceProviderTest): Guice creation errors:(..)
  processesCorrectlyAppBasedComponents(br.com.caelum.vraptor.ioc.guice.GuiceProviderTest): Guice creation errors:(..)
  canProvideJodaTimeConverters(br.com.caelum.vraptor.ioc.guice.GuiceProviderTest): Guice creation errors:(..)
  callsPredestroyExactlyOneTime(br.com.caelum.vraptor.ioc.guice.GuiceProviderTest): Guice creation errors:(..)
  setsAnAttributeOnRequestWithTheObjectTypeName(br.com.caelum.vraptor.ioc.guice.GuiceProviderTest): Guice creation errors:(..)
  setsAnAttributeOnSessionWithTheObjectTypeName(br.com.caelum.vraptor.ioc.guice.GuiceProviderTest): Guice creation errors:(..)
  processesCorrectlyRequestBasedComponents(br.com.caelum.vraptor.ioc.guice.GuiceProviderTest): Guice creation errors:(..)
  processesCorrectlyPrototypeBasedComponents(br.com.caelum.vraptor.ioc.guice.GuiceProviderTest): Guice creation errors:(..)
  supportsComponentFactoriesForCustomInstantiation(br.com.caelum.vraptor.ioc.guice.GuiceProviderTest): Guice creation errors:(..)
  shouldDisposeAfterRequest(br.com.caelum.vraptor.ioc.guice.GuiceProviderTest): Guice creation errors:(..)
  shouldStartBeforeRequestExecution(br.com.caelum.vraptor.ioc.guice.GuiceProviderTest): Guice creation errors:(..)
  canProvideComponentsInTheClasspath(br.com.caelum.vraptor.ioc.guice.GuiceProviderTest): Guice creation errors:(..)
  shoudRegisterResourcesInRouter(br.com.caelum.vraptor.ioc.guice.GuiceProviderTest): Guice creation errors:(..)
  shoudUseComponentFactoriesInTheClasspath(br.com.caelum.vraptor.ioc.guice.GuiceProviderTest): Guice creation errors:(..)
  shoudRegisterConvertersInConverters(br.com.caelum.vraptor.ioc.guice.GuiceProviderTest): Guice creation errors:(..)
  shouldReturnAllDefaultDeserializers(br.com.caelum.vraptor.ioc.guice.GuiceProviderTest): Guice creation errors:(..)
  shoudRegisterInterceptorsInInterceptorRegistry(br.com.caelum.vraptor.ioc.guice.GuiceProviderTest): Guice creation errors:(..)
  shoudCallPredestroyExactlyOneTimeForComponentsScannedFromTheClasspath(br.com.caelum.vraptor.ioc.guice.GuiceProviderTest): Guice creation errors:(..)
  shoudCallPredestroyExactlyOneTimeForComponentFactoriesScannedFromTheClasspath(br.com.caelum.vraptor.ioc.guice.GuiceProviderTest): Guice creation errors:(..)

Tests run: 1139, Failures: 0, Errors: 25, Skipped: 6

[INFO] ------------------------------------------------------------------------
[INFO] BUILD FAILURE
[INFO] ------------------------------------------------------------------------
[INFO] Total time: 21.717 s
[INFO] Finished at: 2015-10-06T17:54:36+02:00
[INFO] Final Memory: 22M/285M
[INFO] ------------------------------------------------------------------------
[ERROR] Failed to execute goal org.apache.maven.plugins:maven-surefire-plugin:2.12.4:test (default-test) on project vraptor: There are test failures.
[ERROR] 
[ERROR] Please refer to /Users/aliparsai/Study/LittleDarwin/Cases/vraptor-vraptor-parent-3.5.5/vraptor-core/target/surefire-reports for the individual test results.
[ERROR] -> [Help 1]
[ERROR] 
[ERROR] To see the full stack trace of the errors, re-run Maven with the -e switch.
[ERROR] Re-run Maven using the -X switch to enable full debug logging.
[ERROR] 
[ERROR] For more information about the errors and possible solutions, please read the following articles:
[ERROR] [Help 1] http://cwiki.apache.org/confluence/display/MAVEN/MojoFailureException
