-------------------------------------------------------------------------------
Test set: org.pitest.coverage.codeassist.CoverageClassVisitorTest
-------------------------------------------------------------------------------
Tests run: 1, Failures: 1, Errors: 0, Skipped: 0, Time elapsed: 0.036 sec <<< FAILURE! - in org.pitest.coverage.codeassist.CoverageClassVisitorTest
shouldRegisterProbesWithCodeCoverageStore(org.pitest.coverage.codeassist.CoverageClassVisitorTest)  Time elapsed: 0.031 sec  <<< FAILURE!
java.lang.AssertionError: expected:<[2]> but was:<[]>
	at org.junit.Assert.fail(Assert.java:88)
	at org.junit.Assert.failNotEquals(Assert.java:743)
	at org.junit.Assert.assertEquals(Assert.java:118)
	at org.junit.Assert.assertEquals(Assert.java:144)
	at org.pitest.coverage.codeassist.CoverageClassVisitorTest.shouldRegisterProbesWithCodeCoverageStore(CoverageClassVisitorTest.java:45)

