[INFO] Scanning for projects...
[INFO]                                                                         
[INFO] ------------------------------------------------------------------------
[INFO] Building pitest 1.1.7
[INFO] ------------------------------------------------------------------------
[INFO] 
[INFO] --- maven-resources-plugin:2.6:resources (default-resources) @ pitest ---
[INFO] Using 'UTF-8' encoding to copy filtered resources.
[INFO] Copying 8 resources
[INFO] 
[INFO] --- maven-compiler-plugin:3.1:compile (default-compile) @ pitest ---
[INFO] Changes detected - recompiling the module!
[INFO] Compiling 355 source files to /Users/aliparsai/Study/LittleDarwin/Cases/pitest-pitest-parent-1.1.7/pitest/target/classes
[WARNING] /Users/aliparsai/Study/LittleDarwin/Cases/pitest-pitest-parent-1.1.7/pitest/src/main/java/org/pitest/bytecode/NullVisitor.java: /Users/aliparsai/Study/LittleDarwin/Cases/pitest-pitest-parent-1.1.7/pitest/src/main/java/org/pitest/bytecode/NullVisitor.java uses or overrides a deprecated API.
[WARNING] /Users/aliparsai/Study/LittleDarwin/Cases/pitest-pitest-parent-1.1.7/pitest/src/main/java/org/pitest/bytecode/NullVisitor.java: Recompile with -Xlint:deprecation for details.
[INFO] 
[INFO] --- maven-resources-plugin:2.6:testResources (default-testResources) @ pitest ---
[INFO] Using 'UTF-8' encoding to copy filtered resources.
[INFO] Copying 30 resources
[INFO] 
[INFO] --- maven-compiler-plugin:3.1:testCompile (default-testCompile) @ pitest ---
[INFO] Changes detected - recompiling the module!
[INFO] Compiling 307 source files to /Users/aliparsai/Study/LittleDarwin/Cases/pitest-pitest-parent-1.1.7/pitest/target/test-classes
[WARNING] /Users/aliparsai/Study/LittleDarwin/Cases/pitest-pitest-parent-1.1.7/pitest/src/test/java/org/pitest/TestJUnitConfiguration.java: Some input files use or override a deprecated API.
[WARNING] /Users/aliparsai/Study/LittleDarwin/Cases/pitest-pitest-parent-1.1.7/pitest/src/test/java/org/pitest/TestJUnitConfiguration.java: Recompile with -Xlint:deprecation for details.
[INFO] 
[INFO] --- maven-surefire-plugin:2.17:test (default-test) @ pitest ---
[INFO] Surefire report directory: /Users/aliparsai/Study/LittleDarwin/Cases/pitest-pitest-parent-1.1.7/pitest/target/surefire-reports
[INFO] Using configured provider org.apache.maven.surefire.junitcore.JUnitCoreProvider
[INFO] parallel='none', perCoreThreadCount=true, threadCount=0, useUnlimitedThreads=false, threadCountSuites=0, threadCountClasses=0, threadCountMethods=0, parallelOptimized=true

-------------------------------------------------------
 T E S T S
-------------------------------------------------------
Running org.pitest.bytecode.FrameOptionsTest
Tests run: 8, Failures: 0, Errors: 0, Skipped: 0, Time elapsed: 0.038 sec - in org.pitest.bytecode.FrameOptionsTest
Running org.pitest.classinfo.AddlerHashTest
Tests run: 3, Failures: 0, Errors: 0, Skipped: 0, Time elapsed: 0.02 sec - in org.pitest.classinfo.AddlerHashTest
Running org.pitest.classinfo.ClassIdentifierTest
Tests run: 1, Failures: 0, Errors: 0, Skipped: 0, Time elapsed: 0.378 sec - in org.pitest.classinfo.ClassIdentifierTest
Running org.pitest.classinfo.ClassInfoTest
Tests run: 5, Failures: 0, Errors: 0, Skipped: 0, Time elapsed: 0.006 sec - in org.pitest.classinfo.ClassInfoTest
Running org.pitest.classinfo.ClassInfoVisitorTest
Tests run: 8, Failures: 0, Errors: 0, Skipped: 0, Time elapsed: 0.047 sec - in org.pitest.classinfo.ClassInfoVisitorTest
Running org.pitest.classinfo.ClassNameTest
2:08:35 PM PIT >> WARNING : Could not load org.unknown.Unknown (ClassNotFoundException: org.unknown.Unknown)
Tests run: 20, Failures: 0, Errors: 0, Skipped: 0, Time elapsed: 0.217 sec - in org.pitest.classinfo.ClassNameTest
Running org.pitest.classinfo.ComputeClassWriterTest
Tests run: 10, Failures: 0, Errors: 0, Skipped: 0, Time elapsed: 0.025 sec - in org.pitest.classinfo.ComputeClassWriterTest
Running org.pitest.classinfo.HierarchicalClassIdTest
Tests run: 1, Failures: 0, Errors: 0, Skipped: 0, Time elapsed: 0.012 sec - in org.pitest.classinfo.HierarchicalClassIdTest
Running org.pitest.classinfo.NameToClassInfoTest
Tests run: 1, Failures: 0, Errors: 0, Skipped: 0, Time elapsed: 0.123 sec - in org.pitest.classinfo.NameToClassInfoTest
Running org.pitest.classinfo.RepositoryTest
Tests run: 26, Failures: 0, Errors: 4, Skipped: 0, Time elapsed: 0.094 sec <<< FAILURE! - in org.pitest.classinfo.RepositoryTest
shouldRecordSourceFile(org.pitest.classinfo.RepositoryTest)  Time elapsed: 0.009 sec  <<< ERROR!
java.lang.ArrayIndexOutOfBoundsException: 16811
	at org.objectweb.asm.ClassReader.readUnsignedShort(Unknown Source)
	at org.objectweb.asm.ClassReader.a(Unknown Source)
	at org.objectweb.asm.ClassReader.accept(Unknown Source)
	at org.objectweb.asm.ClassReader.accept(Unknown Source)
	at org.pitest.classinfo.ClassInfoVisitor.getClassInfo(ClassInfoVisitor.java:46)
	at org.pitest.classinfo.Repository.nameToClassInfo(Repository.java:70)
	at org.pitest.classinfo.Repository.fetchClass(Repository.java:60)
	at org.pitest.classinfo.Repository.fetchClass(Repository.java:50)
	at org.pitest.classinfo.Repository.fetchClass(Repository.java:46)
	at org.pitest.classinfo.RepositoryTest.shouldRecordSourceFile(RepositoryTest.java:276)

shouldDetectConcreteClassesAsNotInterfaces(org.pitest.classinfo.RepositoryTest)  Time elapsed: 0.001 sec  <<< ERROR!
java.lang.ArrayIndexOutOfBoundsException: null

shouldCalculateHashForSuppledClass(org.pitest.classinfo.RepositoryTest)  Time elapsed: 0.002 sec  <<< ERROR!
java.lang.ArrayIndexOutOfBoundsException: null

shouldDetectConcreteClassesAsNotAbstract(org.pitest.classinfo.RepositoryTest)  Time elapsed: 0.001 sec  <<< ERROR!
java.lang.ArrayIndexOutOfBoundsException: null

Running org.pitest.classinfo.TestToClassMapperTest
Tests run: 3, Failures: 0, Errors: 0, Skipped: 0, Time elapsed: 0.002 sec - in org.pitest.classinfo.TestToClassMapperTest
Running org.pitest.classpath.ArchiveClassPathRootTest
Tests run: 6, Failures: 0, Errors: 0, Skipped: 0, Time elapsed: 0.005 sec - in org.pitest.classpath.ArchiveClassPathRootTest
Running org.pitest.classpath.ClassPathTest
