[INFO] Scanning for projects...
[INFO]                                                                         
[INFO] ------------------------------------------------------------------------
[INFO] Building pitest 1.1.7
[INFO] ------------------------------------------------------------------------
[INFO] 
[INFO] --- maven-resources-plugin:2.6:resources (default-resources) @ pitest ---
[INFO] Using 'UTF-8' encoding to copy filtered resources.
[INFO] Copying 8 resources
[INFO] 
[INFO] --- maven-compiler-plugin:3.1:compile (default-compile) @ pitest ---
[INFO] Changes detected - recompiling the module!
[INFO] Compiling 355 source files to /Users/aliparsai/Study/LittleDarwin/Cases/pitest-pitest-parent-1.1.7/pitest/target/classes
[WARNING] /Users/aliparsai/Study/LittleDarwin/Cases/pitest-pitest-parent-1.1.7/pitest/src/main/java/org/pitest/bytecode/NullVisitor.java: /Users/aliparsai/Study/LittleDarwin/Cases/pitest-pitest-parent-1.1.7/pitest/src/main/java/org/pitest/bytecode/NullVisitor.java uses or overrides a deprecated API.
[WARNING] /Users/aliparsai/Study/LittleDarwin/Cases/pitest-pitest-parent-1.1.7/pitest/src/main/java/org/pitest/bytecode/NullVisitor.java: Recompile with -Xlint:deprecation for details.
[INFO] 
[INFO] --- maven-resources-plugin:2.6:testResources (default-testResources) @ pitest ---
[INFO] Using 'UTF-8' encoding to copy filtered resources.
[INFO] Copying 30 resources
[INFO] 
[INFO] --- maven-compiler-plugin:3.1:testCompile (default-testCompile) @ pitest ---
[INFO] Changes detected - recompiling the module!
[INFO] Compiling 307 source files to /Users/aliparsai/Study/LittleDarwin/Cases/pitest-pitest-parent-1.1.7/pitest/target/test-classes
[WARNING] /Users/aliparsai/Study/LittleDarwin/Cases/pitest-pitest-parent-1.1.7/pitest/src/test/java/org/pitest/TestJUnitConfiguration.java: Some input files use or override a deprecated API.
[WARNING] /Users/aliparsai/Study/LittleDarwin/Cases/pitest-pitest-parent-1.1.7/pitest/src/test/java/org/pitest/TestJUnitConfiguration.java: Recompile with -Xlint:deprecation for details.
[INFO] 
[INFO] --- maven-surefire-plugin:2.17:test (default-test) @ pitest ---
[INFO] Surefire report directory: /Users/aliparsai/Study/LittleDarwin/Cases/pitest-pitest-parent-1.1.7/pitest/target/surefire-reports
[INFO] Using configured provider org.apache.maven.surefire.junitcore.JUnitCoreProvider
[INFO] parallel='none', perCoreThreadCount=true, threadCount=0, useUnlimitedThreads=false, threadCountSuites=0, threadCountClasses=0, threadCountMethods=0, parallelOptimized=true

-------------------------------------------------------
 T E S T S
-------------------------------------------------------
Running org.pitest.bytecode.FrameOptionsTest
Tests run: 8, Failures: 0, Errors: 0, Skipped: 0, Time elapsed: 0.002 sec - in org.pitest.bytecode.FrameOptionsTest
Running org.pitest.classinfo.AddlerHashTest
Tests run: 3, Failures: 0, Errors: 0, Skipped: 0, Time elapsed: 0.004 sec - in org.pitest.classinfo.AddlerHashTest
Running org.pitest.classinfo.ClassIdentifierTest
Tests run: 1, Failures: 0, Errors: 0, Skipped: 0, Time elapsed: 0.232 sec - in org.pitest.classinfo.ClassIdentifierTest
Running org.pitest.classinfo.ClassInfoTest
Tests run: 5, Failures: 0, Errors: 0, Skipped: 0, Time elapsed: 0.011 sec - in org.pitest.classinfo.ClassInfoTest
Running org.pitest.classinfo.ClassInfoVisitorTest
Tests run: 8, Failures: 0, Errors: 0, Skipped: 0, Time elapsed: 0.053 sec - in org.pitest.classinfo.ClassInfoVisitorTest
Running org.pitest.classinfo.ClassNameTest
12:36:04 PM PIT >> WARNING : Could not load org.unknown.Unknown (ClassNotFoundException: org.unknown.Unknown)
Tests run: 20, Failures: 0, Errors: 0, Skipped: 0, Time elapsed: 0.146 sec - in org.pitest.classinfo.ClassNameTest
Running org.pitest.classinfo.ComputeClassWriterTest
Tests run: 10, Failures: 0, Errors: 0, Skipped: 0, Time elapsed: 0.025 sec - in org.pitest.classinfo.ComputeClassWriterTest
Running org.pitest.classinfo.HierarchicalClassIdTest
Tests run: 1, Failures: 0, Errors: 0, Skipped: 0, Time elapsed: 0.019 sec - in org.pitest.classinfo.HierarchicalClassIdTest
Running org.pitest.classinfo.NameToClassInfoTest
Tests run: 1, Failures: 0, Errors: 0, Skipped: 0, Time elapsed: 0.154 sec - in org.pitest.classinfo.NameToClassInfoTest
Running org.pitest.classinfo.RepositoryTest
Tests run: 26, Failures: 0, Errors: 0, Skipped: 0, Time elapsed: 0.1 sec - in org.pitest.classinfo.RepositoryTest
Running org.pitest.classinfo.TestToClassMapperTest
Tests run: 3, Failures: 0, Errors: 0, Skipped: 0, Time elapsed: 0.001 sec - in org.pitest.classinfo.TestToClassMapperTest
Running org.pitest.classpath.ArchiveClassPathRootTest
Tests run: 6, Failures: 0, Errors: 0, Skipped: 0, Time elapsed: 0.004 sec - in org.pitest.classpath.ArchiveClassPathRootTest
Running org.pitest.classpath.ClassPathTest
Tests run: 4, Failures: 0, Errors: 0, Skipped: 0, Time elapsed: 0.017 sec - in org.pitest.classpath.ClassPathTest
Running org.pitest.classpath.CodeSourceTest
Tests run: 11, Failures: 0, Errors: 0, Skipped: 0, Time elapsed: 0.038 sec - in org.pitest.classpath.CodeSourceTest
Running org.pitest.classpath.CompoundClassPathRootTest
Tests run: 5, Failures: 0, Errors: 0, Skipped: 0, Time elapsed: 0.024 sec - in org.pitest.classpath.CompoundClassPathRootTest
Running org.pitest.classpath.DirectoryClassPathRootTest
Tests run: 2, Failures: 0, Errors: 0, Skipped: 0, Time elapsed: 0.015 sec - in org.pitest.classpath.DirectoryClassPathRootTest
Running org.pitest.classpath.OtherClassLoaderClassPathRootTest
Tests run: 3, Failures: 0, Errors: 0, Skipped: 0, Time elapsed: 0.003 sec - in org.pitest.classpath.OtherClassLoaderClassPathRootTest
Running org.pitest.containers.TestContainersSendCorrectNotifications
Tests run: 2, Failures: 0, Errors: 0, Skipped: 0, Time elapsed: 0.03 sec - in org.pitest.containers.TestContainersSendCorrectNotifications
Running org.pitest.coverage.analysis.BlockTest
Tests run: 1, Failures: 0, Errors: 0, Skipped: 0, Time elapsed: 0.082 sec - in org.pitest.coverage.analysis.BlockTest
Running org.pitest.coverage.BlockLocationTest
Tests run: 1, Failures: 0, Errors: 0, Skipped: 0, Time elapsed: 0.014 sec - in org.pitest.coverage.BlockLocationTest
Running org.pitest.coverage.ClassLineTest
Tests run: 1, Failures: 0, Errors: 0, Skipped: 0, Time elapsed: 0.011 sec - in org.pitest.coverage.ClassLineTest
Running org.pitest.coverage.codeassist.CoverageClassVisitorTest
Tests run: 1, Failures: 0, Errors: 0, Skipped: 0, Time elapsed: 0.04 sec - in org.pitest.coverage.codeassist.CoverageClassVisitorTest
Running org.pitest.coverage.codeassist.LineMapperTest
Tests run: 6, Failures: 0, Errors: 0, Skipped: 0, Time elapsed: 0.035 sec - in org.pitest.coverage.codeassist.LineMapperTest
Running org.pitest.coverage.CoverageDataTest
12:36:05 PM PIT >> WARNING : Description [testClass=null, name=fooTest] did not pass without mutation.
Tests run: 16, Failures: 0, Errors: 0, Skipped: 0, Time elapsed: 0.084 sec - in org.pitest.coverage.CoverageDataTest
Running org.pitest.coverage.CoverageResultTest
Tests run: 3, Failures: 0, Errors: 0, Skipped: 0, Time elapsed: 0 sec - in org.pitest.coverage.CoverageResultTest
Running org.pitest.coverage.CoverageSummaryTest
Tests run: 4, Failures: 0, Errors: 0, Skipped: 0, Time elapsed: 0 sec - in org.pitest.coverage.CoverageSummaryTest
Running org.pitest.coverage.CoverageTransformerTest
Tests run: 3, Failures: 0, Errors: 0, Skipped: 0, Time elapsed: 0.535 sec - in org.pitest.coverage.CoverageTransformerTest
Running org.pitest.coverage.execute.DependencyFilterTest
Tests run: 3, Failures: 0, Errors: 0, Skipped: 0, Time elapsed: 0.011 sec - in org.pitest.coverage.execute.DependencyFilterTest
Running org.pitest.coverage.execute.ReceiveTest
Tests run: 3, Failures: 0, Errors: 0, Skipped: 0, Time elapsed: 0.008 sec - in org.pitest.coverage.execute.ReceiveTest
Running org.pitest.coverage.execute.SendDataTest
12:36:06 PM PIT >> INFO : Sending 0 test classes to slave
12:36:06 PM PIT >> INFO : Sent tests to slave
12:36:06 PM PIT >> INFO : Sending 2 test classes to slave
12:36:06 PM PIT >> INFO : Sent tests to slave
Tests run: 2, Failures: 0, Errors: 0, Skipped: 0, Time elapsed: 0.013 sec - in org.pitest.coverage.execute.SendDataTest
Running org.pitest.coverage.export.DefaultCoverageExporterTest
Tests run: 2, Failures: 0, Errors: 0, Skipped: 0, Time elapsed: 0.004 sec - in org.pitest.coverage.export.DefaultCoverageExporterTest
Running org.pitest.coverage.TestInfoNameComparatorTest
Tests run: 2, Failures: 0, Errors: 0, Skipped: 0, Time elapsed: 0.001 sec - in org.pitest.coverage.TestInfoNameComparatorTest
Running org.pitest.coverage.TestInfoTest
Tests run: 1, Failures: 0, Errors: 0, Skipped: 0, Time elapsed: 0.018 sec - in org.pitest.coverage.TestInfoTest
Running org.pitest.dependency.DependencyAccessTest
Tests run: 1, Failures: 0, Errors: 0, Skipped: 0, Time elapsed: 0.016 sec - in org.pitest.dependency.DependencyAccessTest
Running org.pitest.dependency.DependencyClassVisitorTest
Tests run: 3, Failures: 0, Errors: 0, Skipped: 0, Time elapsed: 0.017 sec - in org.pitest.dependency.DependencyClassVisitorTest
Running org.pitest.dependency.DependencyExtractorTest
Tests run: 6, Failures: 0, Errors: 0, Skipped: 0, Time elapsed: 0.032 sec - in org.pitest.dependency.DependencyExtractorTest
Running org.pitest.dependency.IgnoreCoreClassesTest
Tests run: 7, Failures: 0, Errors: 0, Skipped: 0, Time elapsed: 0.002 sec - in org.pitest.dependency.IgnoreCoreClassesTest
Running org.pitest.functional.FArrayTest
Tests run: 9, Failures: 0, Errors: 0, Skipped: 0, Time elapsed: 0.007 sec - in org.pitest.functional.FArrayTest
Running org.pitest.functional.FCollectionTest
Tests run: 18, Failures: 0, Errors: 0, Skipped: 0, Time elapsed: 0.011 sec - in org.pitest.functional.FCollectionTest
Running org.pitest.functional.MutableListTest
Tests run: 28, Failures: 0, Errors: 0, Skipped: 0, Time elapsed: 0.038 sec - in org.pitest.functional.MutableListTest
Running org.pitest.functional.OptionTest
Tests run: 21, Failures: 0, Errors: 0, Skipped: 0, Time elapsed: 0.042 sec - in org.pitest.functional.OptionTest
Running org.pitest.functional.predicate.AndTest
Tests run: 6, Failures: 0, Errors: 0, Skipped: 0, Time elapsed: 0 sec - in org.pitest.functional.predicate.AndTest
Running org.pitest.functional.predicate.FalseTest
Tests run: 1, Failures: 0, Errors: 0, Skipped: 0, Time elapsed: 0 sec - in org.pitest.functional.predicate.FalseTest
Running org.pitest.functional.predicate.NotTest
Tests run: 2, Failures: 0, Errors: 0, Skipped: 0, Time elapsed: 0 sec - in org.pitest.functional.predicate.NotTest
Running org.pitest.functional.predicate.OrTest
Tests run: 6, Failures: 0, Errors: 0, Skipped: 0, Time elapsed: 0 sec - in org.pitest.functional.predicate.OrTest
Running org.pitest.functional.predicate.TrueTest
Tests run: 1, Failures: 0, Errors: 0, Skipped: 0, Time elapsed: 0 sec - in org.pitest.functional.predicate.TrueTest
Running org.pitest.functional.prelude.PreludeTest
Tests run: 5, Failures: 0, Errors: 0, Skipped: 0, Time elapsed: 0.022 sec - in org.pitest.functional.prelude.PreludeTest
Running org.pitest.help.PitHelpErrorTest
Tests run: 1, Failures: 0, Errors: 0, Skipped: 0, Time elapsed: 0 sec - in org.pitest.help.PitHelpErrorTest
Running org.pitest.junit.adapter.AdaptedJUnitTestUnitTest
Tests run: 6, Failures: 0, Errors: 0, Skipped: 0, Time elapsed: 0.089 sec - in org.pitest.junit.adapter.AdaptedJUnitTestUnitTest
Running org.pitest.junit.adapter.AdaptingRunListenerTest
Tests run: 6, Failures: 0, Errors: 0, Skipped: 0, Time elapsed: 0.008 sec - in org.pitest.junit.adapter.AdaptingRunListenerTest
Running org.pitest.junit.adapter.CustomRunnerExecutorTest
Tests run: 1, Failures: 0, Errors: 0, Skipped: 0, Time elapsed: 0.005 sec - in org.pitest.junit.adapter.CustomRunnerExecutorTest
Running org.pitest.junit.adapter.ForeignClassLoaderAdaptingRunListenerTest
Tests run: 6, Failures: 0, Errors: 0, Skipped: 0, Time elapsed: 0.097 sec - in org.pitest.junit.adapter.ForeignClassLoaderAdaptingRunListenerTest
Running org.pitest.junit.JUnit4SuiteFinderTest
Tests run: 2, Failures: 0, Errors: 0, Skipped: 0, Time elapsed: 0.003 sec - in org.pitest.junit.JUnit4SuiteFinderTest
Running org.pitest.junit.JUnitCompatibleConfigurationTest
Tests run: 4, Failures: 0, Errors: 0, Skipped: 0, Time elapsed: 0.006 sec - in org.pitest.junit.JUnitCompatibleConfigurationTest
Running org.pitest.junit.JUnitCustomRunnerTestUnitFinderTest
Tests run: 14, Failures: 0, Errors: 0, Skipped: 0, Time elapsed: 0.078 sec - in org.pitest.junit.JUnitCustomRunnerTestUnitFinderTest
Running org.pitest.junit.JUnitTestClassIdentifierTest
Tests run: 11, Failures: 0, Errors: 0, Skipped: 0, Time elapsed: 0.031 sec - in org.pitest.junit.JUnitTestClassIdentifierTest
Running org.pitest.junit.ParameterisedJUnitTestFinderTest
Tests run: 2, Failures: 0, Errors: 0, Skipped: 0, Time elapsed: 0.003 sec - in org.pitest.junit.ParameterisedJUnitTestFinderTest
Running org.pitest.junit.RunnerSuiteFinderTest
Tests run: 5, Failures: 0, Errors: 0, Skipped: 0, Time elapsed: 0.018 sec - in org.pitest.junit.RunnerSuiteFinderTest
Running org.pitest.junit.TestInfoTest
Tests run: 5, Failures: 0, Errors: 0, Skipped: 0, Time elapsed: 0.015 sec - in org.pitest.junit.TestInfoTest
Running org.pitest.mutationtest.build.AnalyisPriorityComparatorTest
Tests run: 2, Failures: 0, Errors: 0, Skipped: 0, Time elapsed: 0.002 sec - in org.pitest.mutationtest.build.AnalyisPriorityComparatorTest
Running org.pitest.mutationtest.build.DefaultGrouperTest
Tests run: 3, Failures: 0, Errors: 0, Skipped: 0, Time elapsed: 0.008 sec - in org.pitest.mutationtest.build.DefaultGrouperTest
Running org.pitest.mutationtest.build.DefaultTestPrioritiserTest
12:36:06 PM PIT >> WARNING : Using untargetted tests
Tests run: 3, Failures: 0, Errors: 0, Skipped: 0, Time elapsed: 0.008 sec - in org.pitest.mutationtest.build.DefaultTestPrioritiserTest
Running org.pitest.mutationtest.build.KnownStatusMutationTestUnitTest
Tests run: 2, Failures: 0, Errors: 0, Skipped: 0, Time elapsed: 0.003 sec - in org.pitest.mutationtest.build.KnownStatusMutationTestUnitTest
Running org.pitest.mutationtest.build.MutationSourceTest
Tests run: 2, Failures: 0, Errors: 0, Skipped: 0, Time elapsed: 0.012 sec - in org.pitest.mutationtest.build.MutationSourceTest
Running org.pitest.mutationtest.build.MutationTestBuilderTest
Tests run: 5, Failures: 0, Errors: 0, Skipped: 0, Time elapsed: 0.014 sec - in org.pitest.mutationtest.build.MutationTestBuilderTest
Running org.pitest.mutationtest.build.MutationTestUnitTest
Tests run: 2, Failures: 0, Errors: 0, Skipped: 0, Time elapsed: 0.032 sec - in org.pitest.mutationtest.build.MutationTestUnitTest
Running org.pitest.mutationtest.build.PercentAndConstantTimeoutStrategyTest
Tests run: 1, Failures: 0, Errors: 0, Skipped: 0, Time elapsed: 0.001 sec - in org.pitest.mutationtest.build.PercentAndConstantTimeoutStrategyTest
Running org.pitest.mutationtest.build.TestInfoPriorisationComparatorTest
Tests run: 3, Failures: 0, Errors: 0, Skipped: 0, Time elapsed: 0.002 sec - in org.pitest.mutationtest.build.TestInfoPriorisationComparatorTest
Running org.pitest.mutationtest.commandline.MutationCoverageReportTest
12:36:06 PM PIT >> INFO : Verbose logging is disabled. If you encounter an problem please enable it before reporting an issue.
12:36:06 PM PIT >> INFO : Created  0 mutation test units
12:36:06 PM PIT >> WARNING : No mutations found. This probably means there is an issue with either the supplied classpath or filters.
See http://pitest.org for more details.
12:36:06 PM PIT >> INFO : Completed in 0 seconds
================================================================================
- Timings
================================================================================
> build mutation tests : < 1 second
> run mutation analysis : < 1 second
--------------------------------------------------------------------------------
> Total  : < 1 second
--------------------------------------------------------------------------------
================================================================================
- Statistics
================================================================================
>> Generated 0 mutations Killed 0 (100%)
>> Ran 0 tests (0 tests per mutation)
================================================================================
- Mutators
================================================================================
12:36:06 PM PIT >> INFO : Verbose logging is disabled. If you encounter an problem please enable it before reporting an issue.
12:36:06 PM PIT >> INFO : Created  1 mutation test units
/12:36:06 PM PIT >> INFO : Completed in 0 seconds
================================================================================
- Timings
================================================================================
> build mutation tests : < 1 second
> run mutation analysis : < 1 second
--------------------------------------------------------------------------------
> Total  : < 1 second
--------------------------------------------------------------------------------
================================================================================
- Statistics
================================================================================
>> Generated 1 mutations Killed 0 (0%)
>> Ran 0 tests (0 tests per mutation)
================================================================================
- Mutators
================================================================================
> mutator
>> Generated 1 Killed 0 (0%)
> KILLED 0 SURVIVED 0 TIMED_OUT 0 NON_VIABLE 0 
> MEMORY_ERROR 0 NOT_STARTED 0 STARTED 0 RUN_ERROR 0 
> NO_COVERAGE 1 
--------------------------------------------------------------------------------
12:36:06 PM PIT >> INFO : Verbose logging is disabled. If you encounter an problem please enable it before reporting an issue.
12:36:06 PM PIT >> INFO : Created  0 mutation test units
12:36:06 PM PIT >> WARNING : No mutations found. This probably means there is an issue with either the supplied classpath or filters.
See http://pitest.org for more details.
12:36:06 PM PIT >> INFO : Completed in 0 seconds
================================================================================
- Timings
================================================================================
> build mutation tests : < 1 second
> run mutation analysis : < 1 second
--------------------------------------------------------------------------------
> Total  : < 1 second
--------------------------------------------------------------------------------
================================================================================
- Statistics
================================================================================
>> Generated 0 mutations Killed 0 (100%)
>> Ran 0 tests (0 tests per mutation)
================================================================================
- Mutators
================================================================================
12:36:06 PM PIT >> INFO : Verbose logging is disabled. If you encounter an problem please enable it before reporting an issue.
12:36:06 PM PIT >> INFO : Created  0 mutation test units
12:36:06 PM PIT >> INFO : Verbose logging is disabled. If you encounter an problem please enable it before reporting an issue.
12:36:06 PM PIT >> INFO : Created  0 mutation test units
12:36:06 PM PIT >> WARNING : No mutations found. This probably means there is an issue with either the supplied classpath or filters.
See http://pitest.org for more details.
12:36:06 PM PIT >> INFO : Completed in 0 seconds
================================================================================
- Timings
================================================================================
> build mutation tests : < 1 second
> run mutation analysis : < 1 second
--------------------------------------------------------------------------------
> Total  : < 1 second
--------------------------------------------------------------------------------
================================================================================
- Statistics
================================================================================
>> Generated 0 mutations Killed 0 (100%)
>> Ran 0 tests (0 tests per mutation)
================================================================================
- Mutators
================================================================================
12:36:06 PM PIT >> INFO : Verbose logging is disabled. If you encounter an problem please enable it before reporting an issue.
12:36:06 PM PIT >> INFO : Created  0 mutation test units
12:36:06 PM PIT >> WARNING : No mutations found. This probably means there is an issue with either the supplied classpath or filters.
See http://pitest.org for more details.
12:36:06 PM PIT >> INFO : Completed in 0 seconds
================================================================================
- Timings
================================================================================
> build mutation tests : < 1 second
> run mutation analysis : < 1 second
--------------------------------------------------------------------------------
> Total  : < 1 second
--------------------------------------------------------------------------------
================================================================================
- Statistics
================================================================================
>> Generated 0 mutations Killed 0 (100%)
>> Ran 0 tests (0 tests per mutation)
================================================================================
- Mutators
================================================================================
Tests run: 6, Failures: 0, Errors: 0, Skipped: 0, Time elapsed: 0.091 sec - in org.pitest.mutationtest.commandline.MutationCoverageReportTest
Running org.pitest.mutationtest.config.CompoundConfigurationTest
Tests run: 7, Failures: 0, Errors: 0, Skipped: 0, Time elapsed: 0.029 sec - in org.pitest.mutationtest.config.CompoundConfigurationTest
Running org.pitest.mutationtest.config.CompoundListenerFactoryTest
Tests run: 1, Failures: 0, Errors: 0, Skipped: 0, Time elapsed: 0.002 sec - in org.pitest.mutationtest.config.CompoundListenerFactoryTest
Running org.pitest.mutationtest.config.CompoundTestClassIdentifierTest
Tests run: 3, Failures: 0, Errors: 0, Skipped: 0, Time elapsed: 0.001 sec - in org.pitest.mutationtest.config.CompoundTestClassIdentifierTest
Running org.pitest.mutationtest.config.CompoundTestListenerTest
Tests run: 3, Failures: 0, Errors: 0, Skipped: 0, Time elapsed: 0.002 sec - in org.pitest.mutationtest.config.CompoundTestListenerTest
Running org.pitest.mutationtest.config.ConfigurationFactoryTest
Tests run: 6, Failures: 0, Errors: 0, Skipped: 0, Time elapsed: 0.046 sec - in org.pitest.mutationtest.config.ConfigurationFactoryTest
Running org.pitest.mutationtest.config.DefaultCodePathPredicateTest
Tests run: 5, Failures: 0, Errors: 0, Skipped: 0, Time elapsed: 0.001 sec - in org.pitest.mutationtest.config.DefaultCodePathPredicateTest
Running org.pitest.mutationtest.config.DefaultDependencyPathPredicateTest
Tests run: 2, Failures: 0, Errors: 0, Skipped: 0, Time elapsed: 0 sec - in org.pitest.mutationtest.config.DefaultDependencyPathPredicateTest
Running org.pitest.mutationtest.config.PathNamePredicateTest
Tests run: 2, Failures: 0, Errors: 0, Skipped: 0, Time elapsed: 0.003 sec - in org.pitest.mutationtest.config.PathNamePredicateTest
Running org.pitest.mutationtest.config.PluginServicesTest
Tests run: 3, Failures: 0, Errors: 0, Skipped: 0, Time elapsed: 0.004 sec - in org.pitest.mutationtest.config.PluginServicesTest
Running org.pitest.mutationtest.config.ReportOptionsTest
Tests run: 1, Failures: 0, Errors: 0, Skipped: 0, Time elapsed: 0.001 sec - in org.pitest.mutationtest.config.ReportOptionsTest
Running org.pitest.mutationtest.config.SettingsFactoryTest
Tests run: 12, Failures: 0, Errors: 0, Skipped: 0, Time elapsed: 0.04 sec - in org.pitest.mutationtest.config.SettingsFactoryTest
Running org.pitest.mutationtest.DetectionStatusTest
Tests run: 12, Failures: 0, Errors: 0, Skipped: 0, Time elapsed: 0.003 sec - in org.pitest.mutationtest.DetectionStatusTest
Running org.pitest.mutationtest.engine.gregor.analysis.InstructionTrackingMethodVisitorTest
Tests run: 3, Failures: 0, Errors: 0, Skipped: 0, Time elapsed: 0.006 sec - in org.pitest.mutationtest.engine.gregor.analysis.InstructionTrackingMethodVisitorTest
Running org.pitest.mutationtest.engine.gregor.AvoidAssertsMethodAdapterTest
Tests run: 31, Failures: 0, Errors: 0, Skipped: 0, Time elapsed: 0.052 sec - in org.pitest.mutationtest.engine.gregor.AvoidAssertsMethodAdapterTest
Running org.pitest.mutationtest.engine.gregor.blocks.BlockTrackingMethodDecoratorTest
Tests run: 40, Failures: 0, Errors: 0, Skipped: 0, Time elapsed: 0.039 sec - in org.pitest.mutationtest.engine.gregor.blocks.BlockTrackingMethodDecoratorTest
Running org.pitest.mutationtest.engine.gregor.blocks.ConcreteBlockCounterTest
Tests run: 2, Failures: 0, Errors: 0, Skipped: 0, Time elapsed: 0 sec - in org.pitest.mutationtest.engine.gregor.blocks.ConcreteBlockCounterTest
Running org.pitest.mutationtest.engine.gregor.ClassInfoTest
Tests run: 3, Failures: 0, Errors: 0, Skipped: 0, Time elapsed: 0 sec - in org.pitest.mutationtest.engine.gregor.ClassInfoTest
Running org.pitest.mutationtest.engine.gregor.config.MutatorTest
Tests run: 4, Failures: 0, Errors: 4, Skipped: 0, Time elapsed: 44.329 sec <<< FAILURE! - in org.pitest.mutationtest.engine.gregor.config.MutatorTest
shouldNotCreateDuplicatesWhenRequestedDirectly(org.pitest.mutationtest.engine.gregor.config.MutatorTest)  Time elapsed: 44.327 sec  <<< ERROR!
java.lang.OutOfMemoryError: Java heap space
	at java.util.Arrays.copyOf(Arrays.java:3181)
	at java.util.ArrayList.grow(ArrayList.java:261)
	at java.util.ArrayList.ensureExplicitCapacity(ArrayList.java:235)
	at java.util.ArrayList.ensureCapacityInternal(ArrayList.java:227)
	at java.util.ArrayList.add(ArrayList.java:458)
	at org.pitest.mutationtest.engine.gregor.mutators.experimental.RemoveSwitchMutator.makeMutators(RemoveSwitchMutator.java:23)
	at org.pitest.mutationtest.engine.gregor.config.Mutator.<clinit>(Mutator.java:156)
	at org.pitest.mutationtest.engine.gregor.config.MutatorTest.parseStrings(MutatorTest.java:50)
	at org.pitest.mutationtest.engine.gregor.config.MutatorTest.shouldNotCreateDuplicatesWhenRequestedDirectly(MutatorTest.java:40)

shouldNotCreateDuplicatesWhenRequestedViaGroup(org.pitest.mutationtest.engine.gregor.config.MutatorTest)  Time elapsed: 0 sec  <<< ERROR!
java.lang.NoClassDefFoundError: Could not initialize class org.pitest.mutationtest.engine.gregor.config.Mutator
	at org.pitest.mutationtest.engine.gregor.config.MutatorTest.parseStrings(MutatorTest.java:50)
	at org.pitest.mutationtest.engine.gregor.config.MutatorTest.shouldNotCreateDuplicatesWhenRequestedViaGroup(MutatorTest.java:45)

shouldReturnRequestedMutators(org.pitest.mutationtest.engine.gregor.config.MutatorTest)  Time elapsed: 0 sec  <<< ERROR!
java.lang.NoClassDefFoundError: Could not initialize class org.pitest.mutationtest.engine.gregor.config.Mutator
	at org.pitest.mutationtest.engine.gregor.config.MutatorTest.parseStrings(MutatorTest.java:50)
	at org.pitest.mutationtest.engine.gregor.config.MutatorTest.shouldReturnRequestedMutators(MutatorTest.java:33)

allContainsReplaceMethodMutator(org.pitest.mutationtest.engine.gregor.config.MutatorTest)  Time elapsed: 0 sec  <<< ERROR!
java.lang.NoClassDefFoundError: Could not initialize class org.pitest.mutationtest.engine.gregor.config.Mutator
	at org.pitest.mutationtest.engine.gregor.config.MutatorTest.allContainsReplaceMethodMutator(MutatorTest.java:55)

Running org.pitest.mutationtest.engine.gregor.GregorMutationEngineTest
Tests run: 1, Failures: 0, Errors: 1, Skipped: 0, Time elapsed: 0 sec <<< FAILURE! - in org.pitest.mutationtest.engine.gregor.GregorMutationEngineTest
shouldReportNamesOfSuppliedMutators(org.pitest.mutationtest.engine.gregor.GregorMutationEngineTest)  Time elapsed: 0 sec  <<< ERROR!
java.lang.NoClassDefFoundError: Could not initialize class org.pitest.mutationtest.engine.gregor.config.Mutator
	at org.pitest.mutationtest.engine.gregor.GregorMutationEngineTest.shouldReportNamesOfSuppliedMutators(GregorMutationEngineTest.java:38)

Running org.pitest.mutationtest.engine.gregor.inlinedcode.InlinedFinallyBlockDetectorTest
12:36:51 PM PIT >> WARNING : Found more than one mutation similar on same line in a finally block. Can't correct for inlining.
Tests run: 4, Failures: 0, Errors: 0, Skipped: 0, Time elapsed: 0.002 sec - in org.pitest.mutationtest.engine.gregor.inlinedcode.InlinedFinallyBlockDetectorTest
Running org.pitest.mutationtest.engine.gregor.inlinedcode.NoInlinedCodeDetectionTest
Tests run: 1, Failures: 0, Errors: 0, Skipped: 0, Time elapsed: 0.015 sec - in org.pitest.mutationtest.engine.gregor.inlinedcode.NoInlinedCodeDetectionTest
Running org.pitest.mutationtest.engine.gregor.LineFilterMethodAdapterTest
Tests run: 25, Failures: 0, Errors: 0, Skipped: 0, Time elapsed: 0.02 sec - in org.pitest.mutationtest.engine.gregor.LineFilterMethodAdapterTest
Running org.pitest.mutationtest.engine.gregor.MethodInfoTest
Tests run: 18, Failures: 0, Errors: 0, Skipped: 0, Time elapsed: 0.001 sec - in org.pitest.mutationtest.engine.gregor.MethodInfoTest
Running org.pitest.mutationtest.engine.gregor.mutators.ArgumentPropagationMutatorTest
Tests run: 13, Failures: 0, Errors: 0, Skipped: 0, Time elapsed: 0.566 sec - in org.pitest.mutationtest.engine.gregor.mutators.ArgumentPropagationMutatorTest
Running org.pitest.mutationtest.engine.gregor.mutators.ConditionalsBoundaryMutatorTest
Tests run: 9, Failures: 0, Errors: 0, Skipped: 0, Time elapsed: 0.217 sec - in org.pitest.mutationtest.engine.gregor.mutators.ConditionalsBoundaryMutatorTest
Running org.pitest.mutationtest.engine.gregor.mutators.ConstructorCallMutatorTest
Tests run: 6, Failures: 0, Errors: 0, Skipped: 0, Time elapsed: 0.117 sec - in org.pitest.mutationtest.engine.gregor.mutators.ConstructorCallMutatorTest
Running org.pitest.mutationtest.engine.gregor.mutators.experimental.MemberVariableMutatorTest
Tests run: 8, Failures: 0, Errors: 0, Skipped: 0, Time elapsed: 0.081 sec - in org.pitest.mutationtest.engine.gregor.mutators.experimental.MemberVariableMutatorTest
Running org.pitest.mutationtest.engine.gregor.mutators.experimental.MutantStarterTest
Tests run: 3, Failures: 0, Errors: 0, Skipped: 0, Time elapsed: 0.008 sec - in org.pitest.mutationtest.engine.gregor.mutators.experimental.MutantStarterTest
Running org.pitest.mutationtest.engine.gregor.mutators.experimental.RemoveIncrementsMutatorTest
Tests run: 3, Failures: 0, Errors: 0, Skipped: 0, Time elapsed: 0.019 sec - in org.pitest.mutationtest.engine.gregor.mutators.experimental.RemoveIncrementsMutatorTest
Running org.pitest.mutationtest.engine.gregor.mutators.experimental.RemoveSwitchMutatorTest
Tests run: 7, Failures: 0, Errors: 0, Skipped: 0, Time elapsed: 0.103 sec - in org.pitest.mutationtest.engine.gregor.mutators.experimental.RemoveSwitchMutatorTest
Running org.pitest.mutationtest.engine.gregor.mutators.experimental.ReturnValuesMutatorTest
Tests run: 26, Failures: 0, Errors: 0, Skipped: 0, Time elapsed: 0.204 sec - in org.pitest.mutationtest.engine.gregor.mutators.experimental.ReturnValuesMutatorTest
Running org.pitest.mutationtest.engine.gregor.mutators.experimental.SwitchMutatorTest
Tests run: 8, Failures: 0, Errors: 0, Skipped: 0, Time elapsed: 0.099 sec - in org.pitest.mutationtest.engine.gregor.mutators.experimental.SwitchMutatorTest
Running org.pitest.mutationtest.engine.gregor.mutators.IncrementsMutatorTest
Tests run: 2, Failures: 0, Errors: 0, Skipped: 0, Time elapsed: 0.015 sec - in org.pitest.mutationtest.engine.gregor.mutators.IncrementsMutatorTest
Running org.pitest.mutationtest.engine.gregor.mutators.InlineConstantMutatorTest
