[INFO] Scanning for projects...
[INFO]                                                                         
[INFO] ------------------------------------------------------------------------
[INFO] Building pitest 1.1.7
[INFO] ------------------------------------------------------------------------
[INFO] 
[INFO] --- maven-resources-plugin:2.6:resources (default-resources) @ pitest ---
[INFO] Using 'UTF-8' encoding to copy filtered resources.
[INFO] Copying 8 resources
[INFO] 
[INFO] --- maven-compiler-plugin:3.1:compile (default-compile) @ pitest ---
[INFO] Changes detected - recompiling the module!
[INFO] Compiling 355 source files to /Users/aliparsai/Study/LittleDarwin/Cases/pitest-pitest-parent-1.1.7/pitest/target/classes
[WARNING] /Users/aliparsai/Study/LittleDarwin/Cases/pitest-pitest-parent-1.1.7/pitest/src/main/java/org/pitest/bytecode/NullVisitor.java: /Users/aliparsai/Study/LittleDarwin/Cases/pitest-pitest-parent-1.1.7/pitest/src/main/java/org/pitest/bytecode/NullVisitor.java uses or overrides a deprecated API.
[WARNING] /Users/aliparsai/Study/LittleDarwin/Cases/pitest-pitest-parent-1.1.7/pitest/src/main/java/org/pitest/bytecode/NullVisitor.java: Recompile with -Xlint:deprecation for details.
[INFO] 
[INFO] --- maven-resources-plugin:2.6:testResources (default-testResources) @ pitest ---
[INFO] Using 'UTF-8' encoding to copy filtered resources.
[INFO] Copying 30 resources
[INFO] 
[INFO] --- maven-compiler-plugin:3.1:testCompile (default-testCompile) @ pitest ---
[INFO] Changes detected - recompiling the module!
[INFO] Compiling 307 source files to /Users/aliparsai/Study/LittleDarwin/Cases/pitest-pitest-parent-1.1.7/pitest/target/test-classes
[WARNING] /Users/aliparsai/Study/LittleDarwin/Cases/pitest-pitest-parent-1.1.7/pitest/src/test/java/org/pitest/TestJUnitConfiguration.java: Some input files use or override a deprecated API.
[WARNING] /Users/aliparsai/Study/LittleDarwin/Cases/pitest-pitest-parent-1.1.7/pitest/src/test/java/org/pitest/TestJUnitConfiguration.java: Recompile with -Xlint:deprecation for details.
[INFO] 
[INFO] --- maven-surefire-plugin:2.17:test (default-test) @ pitest ---
[INFO] Surefire report directory: /Users/aliparsai/Study/LittleDarwin/Cases/pitest-pitest-parent-1.1.7/pitest/target/surefire-reports
[INFO] Using configured provider org.apache.maven.surefire.junitcore.JUnitCoreProvider
[INFO] parallel='none', perCoreThreadCount=true, threadCount=0, useUnlimitedThreads=false, threadCountSuites=0, threadCountClasses=0, threadCountMethods=0, parallelOptimized=true

-------------------------------------------------------
 T E S T S
-------------------------------------------------------
Running org.pitest.bytecode.FrameOptionsTest
Tests run: 8, Failures: 0, Errors: 0, Skipped: 0, Time elapsed: 0.002 sec - in org.pitest.bytecode.FrameOptionsTest
Running org.pitest.classinfo.AddlerHashTest
Tests run: 3, Failures: 0, Errors: 0, Skipped: 0, Time elapsed: 0.001 sec - in org.pitest.classinfo.AddlerHashTest
Running org.pitest.classinfo.ClassIdentifierTest
Tests run: 1, Failures: 0, Errors: 0, Skipped: 0, Time elapsed: 0.204 sec - in org.pitest.classinfo.ClassIdentifierTest
Running org.pitest.classinfo.ClassInfoTest
Tests run: 5, Failures: 0, Errors: 0, Skipped: 0, Time elapsed: 0.004 sec - in org.pitest.classinfo.ClassInfoTest
Running org.pitest.classinfo.ClassInfoVisitorTest
Tests run: 8, Failures: 0, Errors: 0, Skipped: 0, Time elapsed: 0.033 sec - in org.pitest.classinfo.ClassInfoVisitorTest
Running org.pitest.classinfo.ClassNameTest
10:44:44 AM PIT >> WARNING : Could not load org.unknown.Unknown (ClassNotFoundException: org.unknown.Unknown)
Tests run: 20, Failures: 0, Errors: 0, Skipped: 0, Time elapsed: 0.128 sec - in org.pitest.classinfo.ClassNameTest
Running org.pitest.classinfo.ComputeClassWriterTest
Tests run: 10, Failures: 0, Errors: 0, Skipped: 0, Time elapsed: 0.016 sec - in org.pitest.classinfo.ComputeClassWriterTest
Running org.pitest.classinfo.HierarchicalClassIdTest
Tests run: 1, Failures: 0, Errors: 0, Skipped: 0, Time elapsed: 0.011 sec - in org.pitest.classinfo.HierarchicalClassIdTest
Running org.pitest.classinfo.NameToClassInfoTest
Tests run: 1, Failures: 0, Errors: 0, Skipped: 0, Time elapsed: 0.134 sec - in org.pitest.classinfo.NameToClassInfoTest
Running org.pitest.classinfo.RepositoryTest
Tests run: 26, Failures: 1, Errors: 0, Skipped: 0, Time elapsed: 0.086 sec <<< FAILURE! - in org.pitest.classinfo.RepositoryTest
shouldCorrectlyNegotiateClassHierachies(org.pitest.classinfo.RepositoryTest)  Time elapsed: 0.007 sec  <<< FAILURE!
java.lang.AssertionError: null
	at org.junit.Assert.fail(Assert.java:86)
	at org.junit.Assert.assertTrue(Assert.java:41)
	at org.junit.Assert.assertTrue(Assert.java:52)
	at org.pitest.classinfo.RepositoryTest.shouldCorrectlyNegotiateClassHierachies(RepositoryTest.java:262)

Running org.pitest.classinfo.TestToClassMapperTest
Tests run: 3, Failures: 0, Errors: 0, Skipped: 0, Time elapsed: 0.003 sec - in org.pitest.classinfo.TestToClassMapperTest
Running org.pitest.classpath.ArchiveClassPathRootTest
Tests run: 6, Failures: 0, Errors: 0, Skipped: 0, Time elapsed: 0.003 sec - in org.pitest.classpath.ArchiveClassPathRootTest
Running org.pitest.classpath.ClassPathTest
Tests run: 4, Failures: 0, Errors: 0, Skipped: 0, Time elapsed: 0.017 sec - in org.pitest.classpath.ClassPathTest
Running org.pitest.classpath.CodeSourceTest
Tests run: 11, Failures: 0, Errors: 0, Skipped: 0, Time elapsed: 0.023 sec - in org.pitest.classpath.CodeSourceTest
Running org.pitest.classpath.CompoundClassPathRootTest
Tests run: 5, Failures: 0, Errors: 0, Skipped: 0, Time elapsed: 0.021 sec - in org.pitest.classpath.CompoundClassPathRootTest
Running org.pitest.classpath.DirectoryClassPathRootTest
Tests run: 2, Failures: 0, Errors: 0, Skipped: 0, Time elapsed: 0.016 sec - in org.pitest.classpath.DirectoryClassPathRootTest
Running org.pitest.classpath.OtherClassLoaderClassPathRootTest
Tests run: 3, Failures: 0, Errors: 0, Skipped: 0, Time elapsed: 0.005 sec - in org.pitest.classpath.OtherClassLoaderClassPathRootTest
Running org.pitest.containers.TestContainersSendCorrectNotifications
Tests run: 2, Failures: 0, Errors: 0, Skipped: 0, Time elapsed: 0.021 sec - in org.pitest.containers.TestContainersSendCorrectNotifications
Running org.pitest.coverage.analysis.BlockTest
Tests run: 1, Failures: 0, Errors: 0, Skipped: 0, Time elapsed: 0.068 sec - in org.pitest.coverage.analysis.BlockTest
Running org.pitest.coverage.BlockLocationTest
Tests run: 1, Failures: 0, Errors: 0, Skipped: 0, Time elapsed: 0.007 sec - in org.pitest.coverage.BlockLocationTest
Running org.pitest.coverage.ClassLineTest
Tests run: 1, Failures: 0, Errors: 0, Skipped: 0, Time elapsed: 0.009 sec - in org.pitest.coverage.ClassLineTest
Running org.pitest.coverage.codeassist.CoverageClassVisitorTest
Tests run: 1, Failures: 0, Errors: 0, Skipped: 0, Time elapsed: 0.025 sec - in org.pitest.coverage.codeassist.CoverageClassVisitorTest
Running org.pitest.coverage.codeassist.LineMapperTest
Tests run: 6, Failures: 0, Errors: 0, Skipped: 0, Time elapsed: 0.026 sec - in org.pitest.coverage.codeassist.LineMapperTest
Running org.pitest.coverage.CoverageDataTest
10:44:45 AM PIT >> WARNING : Description [testClass=null, name=fooTest] did not pass without mutation.
Tests run: 16, Failures: 0, Errors: 0, Skipped: 0, Time elapsed: 0.08 sec - in org.pitest.coverage.CoverageDataTest
Running org.pitest.coverage.CoverageResultTest
Tests run: 3, Failures: 0, Errors: 0, Skipped: 0, Time elapsed: 0 sec - in org.pitest.coverage.CoverageResultTest
Running org.pitest.coverage.CoverageSummaryTest
Tests run: 4, Failures: 0, Errors: 0, Skipped: 0, Time elapsed: 0.002 sec - in org.pitest.coverage.CoverageSummaryTest
Running org.pitest.coverage.CoverageTransformerTest
Tests run: 3, Failures: 0, Errors: 0, Skipped: 0, Time elapsed: 0.456 sec - in org.pitest.coverage.CoverageTransformerTest
Running org.pitest.coverage.execute.DependencyFilterTest
Tests run: 3, Failures: 0, Errors: 0, Skipped: 0, Time elapsed: 0.006 sec - in org.pitest.coverage.execute.DependencyFilterTest
Running org.pitest.coverage.execute.ReceiveTest
Tests run: 3, Failures: 0, Errors: 0, Skipped: 0, Time elapsed: 0.022 sec - in org.pitest.coverage.execute.ReceiveTest
Running org.pitest.coverage.execute.SendDataTest
10:44:45 AM PIT >> INFO : Sending 0 test classes to slave
10:44:45 AM PIT >> INFO : Sent tests to slave
10:44:45 AM PIT >> INFO : Sending 2 test classes to slave
10:44:45 AM PIT >> INFO : Sent tests to slave
Tests run: 2, Failures: 0, Errors: 0, Skipped: 0, Time elapsed: 0.016 sec - in org.pitest.coverage.execute.SendDataTest
Running org.pitest.coverage.export.DefaultCoverageExporterTest
Tests run: 2, Failures: 0, Errors: 0, Skipped: 0, Time elapsed: 0.006 sec - in org.pitest.coverage.export.DefaultCoverageExporterTest
Running org.pitest.coverage.TestInfoNameComparatorTest
Tests run: 2, Failures: 0, Errors: 0, Skipped: 0, Time elapsed: 0.001 sec - in org.pitest.coverage.TestInfoNameComparatorTest
Running org.pitest.coverage.TestInfoTest
Tests run: 1, Failures: 0, Errors: 0, Skipped: 0, Time elapsed: 0.023 sec - in org.pitest.coverage.TestInfoTest
Running org.pitest.dependency.DependencyAccessTest
Tests run: 1, Failures: 0, Errors: 0, Skipped: 0, Time elapsed: 0.028 sec - in org.pitest.dependency.DependencyAccessTest
Running org.pitest.dependency.DependencyClassVisitorTest
Tests run: 3, Failures: 0, Errors: 0, Skipped: 0, Time elapsed: 0.032 sec - in org.pitest.dependency.DependencyClassVisitorTest
Running org.pitest.dependency.DependencyExtractorTest
10:44:45 AM PIT >> WARNING : No bytes found for org.pitest.dependency.DependencyExtractorTest$Foo
10:44:45 AM PIT >> WARNING : No bytes found for org.pitest.dependency.DependencyExtractorTest$Foo
10:44:45 AM PIT >> WARNING : No bytes found for org.pitest.dependency.DependencyExtractorTest$Foo
10:44:45 AM PIT >> WARNING : No bytes found for org.pitest.dependency.DependencyExtractorTest$Foo
10:44:45 AM PIT >> WARNING : No bytes found for org.pitest.dependency.DependencyExtractorTest$Foo
10:44:45 AM PIT >> WARNING : No bytes found for org.pitest.dependency.DependencyExtractorTest$CyclicFoo
Tests run: 6, Failures: 6, Errors: 0, Skipped: 0, Time elapsed: 0.031 sec <<< FAILURE! - in org.pitest.dependency.DependencyExtractorTest
shouldNotPickUpDependenciesFromFilteredMethods(org.pitest.dependency.DependencyExtractorTest)  Time elapsed: 0.007 sec  <<< FAILURE!
java.lang.AssertionError: expected:<[org/pitest/dependency/DependencyExtractorTest$Car]> but was:<[]>
	at org.junit.Assert.fail(Assert.java:88)
	at org.junit.Assert.failNotEquals(Assert.java:743)
	at org.junit.Assert.assertEquals(Assert.java:118)
	at org.junit.Assert.assertEquals(Assert.java:144)
	at org.pitest.dependency.DependencyExtractorTest.assertCollectionEquals(DependencyExtractorTest.java:182)
	at org.pitest.dependency.DependencyExtractorTest.shouldNotPickUpDependenciesFromFilteredMethods(DependencyExtractorTest.java:111)

shouldTraverseTwoLevelsOfDependenciesWhenDepthIsTwo(org.pitest.dependency.DependencyExtractorTest)  Time elapsed: 0.005 sec  <<< FAILURE!
java.lang.AssertionError: expected:<[org/pitest/dependency/DependencyExtractorTest$Far, org/pitest/dependency/DependencyExtractorTest$Car, org/pitest/dependency/DependencyExtractorTest$Bar]> but was:<[]>
	at org.junit.Assert.fail(Assert.java:88)
	at org.junit.Assert.failNotEquals(Assert.java:743)
	at org.junit.Assert.assertEquals(Assert.java:118)
	at org.junit.Assert.assertEquals(Assert.java:144)
	at org.pitest.dependency.DependencyExtractorTest.assertCollectionEquals(DependencyExtractorTest.java:182)
	at org.pitest.dependency.DependencyExtractorTest.shouldTraverseTwoLevelsOfDependenciesWhenDepthIsTwo(DependencyExtractorTest.java:90)

shouldTraverseUnboundedWhenDepthIsZero(org.pitest.dependency.DependencyExtractorTest)  Time elapsed: 0.003 sec  <<< FAILURE!
java.lang.AssertionError: expected:<[org/pitest/dependency/DependencyExtractorTest$Far, org/pitest/dependency/DependencyExtractorTest$Car, org/pitest/dependency/DependencyExtractorTest$VeryFar, org/pitest/dependency/DependencyExtractorTest$Bar]> but was:<[]>
	at org.junit.Assert.fail(Assert.java:88)
	at org.junit.Assert.failNotEquals(Assert.java:743)
	at org.junit.Assert.assertEquals(Assert.java:118)
	at org.junit.Assert.assertEquals(Assert.java:144)
	at org.pitest.dependency.DependencyExtractorTest.assertCollectionEquals(DependencyExtractorTest.java:182)
	at org.pitest.dependency.DependencyExtractorTest.shouldTraverseUnboundedWhenDepthIsZero(DependencyExtractorTest.java:102)

shouldFindDependenciesReachedViaClassesNotMatchingFilter(org.pitest.dependency.DependencyExtractorTest)  Time elapsed: 0.004 sec  <<< FAILURE!
java.lang.AssertionError: expected:<[org/pitest/dependency/DependencyExtractorTest$VeryFar]> but was:<[]>
	at org.junit.Assert.fail(Assert.java:88)
	at org.junit.Assert.failNotEquals(Assert.java:743)
	at org.junit.Assert.assertEquals(Assert.java:118)
	at org.junit.Assert.assertEquals(Assert.java:144)
	at org.pitest.dependency.DependencyExtractorTest.assertCollectionEquals(DependencyExtractorTest.java:182)
	at org.pitest.dependency.DependencyExtractorTest.shouldFindDependenciesReachedViaClassesNotMatchingFilter(DependencyExtractorTest.java:122)

shouldFindOnlyImmediateDependenciesWhenDepthIsOne(org.pitest.dependency.DependencyExtractorTest)  Time elapsed: 0.003 sec  <<< FAILURE!
java.lang.AssertionError: expected:<[org/pitest/dependency/DependencyExtractorTest$Car, org/pitest/dependency/DependencyExtractorTest$Bar]> but was:<[]>
	at org.junit.Assert.fail(Assert.java:88)
	at org.junit.Assert.failNotEquals(Assert.java:743)
	at org.junit.Assert.assertEquals(Assert.java:118)
	at org.junit.Assert.assertEquals(Assert.java:144)
	at org.pitest.dependency.DependencyExtractorTest.assertCollectionEquals(DependencyExtractorTest.java:182)
	at org.pitest.dependency.DependencyExtractorTest.shouldFindOnlyImmediateDependenciesWhenDepthIsOne(DependencyExtractorTest.java:78)

shouldHandleCyclicDependencies(org.pitest.dependency.DependencyExtractorTest)  Time elapsed: 0.004 sec  <<< FAILURE!
java.lang.AssertionError: expected:<[org/pitest/dependency/DependencyExtractorTest$CyclicBar]> but was:<[]>
	at org.junit.Assert.fail(Assert.java:88)
	at org.junit.Assert.failNotEquals(Assert.java:743)
	at org.junit.Assert.assertEquals(Assert.java:118)
	at org.junit.Assert.assertEquals(Assert.java:144)
	at org.pitest.dependency.DependencyExtractorTest.assertCollectionEquals(DependencyExtractorTest.java:182)
	at org.pitest.dependency.DependencyExtractorTest.shouldHandleCyclicDependencies(DependencyExtractorTest.java:133)

Running org.pitest.dependency.IgnoreCoreClassesTest
Tests run: 7, Failures: 0, Errors: 0, Skipped: 0, Time elapsed: 0.006 sec - in org.pitest.dependency.IgnoreCoreClassesTest
Running org.pitest.functional.FArrayTest
Tests run: 9, Failures: 0, Errors: 0, Skipped: 0, Time elapsed: 0.014 sec - in org.pitest.functional.FArrayTest
Running org.pitest.functional.FCollectionTest
Tests run: 18, Failures: 0, Errors: 0, Skipped: 0, Time elapsed: 0.009 sec - in org.pitest.functional.FCollectionTest
Running org.pitest.functional.MutableListTest
Tests run: 28, Failures: 0, Errors: 0, Skipped: 0, Time elapsed: 0.053 sec - in org.pitest.functional.MutableListTest
Running org.pitest.functional.OptionTest
Tests run: 21, Failures: 2, Errors: 0, Skipped: 0, Time elapsed: 0.064 sec <<< FAILURE! - in org.pitest.functional.OptionTest
someShouldNotHaveNone(org.pitest.functional.OptionTest)  Time elapsed: 0 sec  <<< FAILURE!
java.lang.AssertionError: null
	at org.junit.Assert.fail(Assert.java:86)
	at org.junit.Assert.assertTrue(Assert.java:41)
	at org.junit.Assert.assertFalse(Assert.java:64)
	at org.junit.Assert.assertFalse(Assert.java:74)
	at org.pitest.functional.OptionTest.someShouldNotHaveNone(OptionTest.java:77)

noneShouldHaveNone(org.pitest.functional.OptionTest)  Time elapsed: 0 sec  <<< FAILURE!
java.lang.AssertionError: null
	at org.junit.Assert.fail(Assert.java:86)
	at org.junit.Assert.assertTrue(Assert.java:41)
	at org.junit.Assert.assertTrue(Assert.java:52)
	at org.pitest.functional.OptionTest.noneShouldHaveNone(OptionTest.java:82)

Running org.pitest.functional.predicate.AndTest
Tests run: 6, Failures: 0, Errors: 0, Skipped: 0, Time elapsed: 0.001 sec - in org.pitest.functional.predicate.AndTest
Running org.pitest.functional.predicate.FalseTest
Tests run: 1, Failures: 0, Errors: 0, Skipped: 0, Time elapsed: 0 sec - in org.pitest.functional.predicate.FalseTest
Running org.pitest.functional.predicate.NotTest
Tests run: 2, Failures: 0, Errors: 0, Skipped: 0, Time elapsed: 0 sec - in org.pitest.functional.predicate.NotTest
Running org.pitest.functional.predicate.OrTest
Tests run: 6, Failures: 0, Errors: 0, Skipped: 0, Time elapsed: 0 sec - in org.pitest.functional.predicate.OrTest
Running org.pitest.functional.predicate.TrueTest
Tests run: 1, Failures: 0, Errors: 0, Skipped: 0, Time elapsed: 0 sec - in org.pitest.functional.predicate.TrueTest
Running org.pitest.functional.prelude.PreludeTest
Tests run: 5, Failures: 0, Errors: 0, Skipped: 0, Time elapsed: 0.021 sec - in org.pitest.functional.prelude.PreludeTest
Running org.pitest.help.PitHelpErrorTest
Tests run: 1, Failures: 0, Errors: 0, Skipped: 0, Time elapsed: 0.002 sec - in org.pitest.help.PitHelpErrorTest
Running org.pitest.junit.adapter.AdaptedJUnitTestUnitTest
Tests run: 6, Failures: 0, Errors: 0, Skipped: 0, Time elapsed: 0.096 sec - in org.pitest.junit.adapter.AdaptedJUnitTestUnitTest
Running org.pitest.junit.adapter.AdaptingRunListenerTest
Tests run: 6, Failures: 0, Errors: 0, Skipped: 0, Time elapsed: 0.019 sec - in org.pitest.junit.adapter.AdaptingRunListenerTest
Running org.pitest.junit.adapter.CustomRunnerExecutorTest
Tests run: 1, Failures: 0, Errors: 0, Skipped: 0, Time elapsed: 0.022 sec - in org.pitest.junit.adapter.CustomRunnerExecutorTest
Running org.pitest.junit.adapter.ForeignClassLoaderAdaptingRunListenerTest
Tests run: 6, Failures: 0, Errors: 0, Skipped: 0, Time elapsed: 0.113 sec - in org.pitest.junit.adapter.ForeignClassLoaderAdaptingRunListenerTest
Running org.pitest.junit.JUnit4SuiteFinderTest
Tests run: 2, Failures: 0, Errors: 0, Skipped: 0, Time elapsed: 0.002 sec - in org.pitest.junit.JUnit4SuiteFinderTest
Running org.pitest.junit.JUnitCompatibleConfigurationTest
Tests run: 4, Failures: 0, Errors: 0, Skipped: 0, Time elapsed: 0.004 sec - in org.pitest.junit.JUnitCompatibleConfigurationTest
Running org.pitest.junit.JUnitCustomRunnerTestUnitFinderTest
Tests run: 14, Failures: 2, Errors: 0, Skipped: 0, Time elapsed: 0.068 sec <<< FAILURE! - in org.pitest.junit.JUnitCustomRunnerTestUnitFinderTest
shouldCreateSingleAtomicUnitWhenAnyFieldAnnotatedWithClassRule(org.pitest.junit.JUnitCustomRunnerTestUnitFinderTest)  Time elapsed: 0.007 sec  <<< FAILURE!
java.lang.AssertionError: expected:<1> but was:<2>
	at org.junit.Assert.fail(Assert.java:88)
	at org.junit.Assert.failNotEquals(Assert.java:743)
	at org.junit.Assert.assertEquals(Assert.java:118)
	at org.junit.Assert.assertEquals(Assert.java:555)
	at org.junit.Assert.assertEquals(Assert.java:542)
	at org.pitest.junit.JUnitCustomRunnerTestUnitFinderTest.shouldCreateSingleAtomicUnitWhenAnyFieldAnnotatedWithClassRule(JUnitCustomRunnerTestUnitFinderTest.java:283)

shouldCreateSingleAtomicUnitWhenAnyMethodAnnotatedWithClassRule(org.pitest.junit.JUnitCustomRunnerTestUnitFinderTest)  Time elapsed: 0.002 sec  <<< FAILURE!
java.lang.AssertionError: expected:<1> but was:<2>
	at org.junit.Assert.fail(Assert.java:88)
	at org.junit.Assert.failNotEquals(Assert.java:743)
	at org.junit.Assert.assertEquals(Assert.java:118)
	at org.junit.Assert.assertEquals(Assert.java:555)
	at org.junit.Assert.assertEquals(Assert.java:542)
	at org.pitest.junit.JUnitCustomRunnerTestUnitFinderTest.shouldCreateSingleAtomicUnitWhenAnyMethodAnnotatedWithClassRule(JUnitCustomRunnerTestUnitFinderTest.java:261)

Running org.pitest.junit.JUnitTestClassIdentifierTest
Tests run: 11, Failures: 0, Errors: 4, Skipped: 0, Time elapsed: 0.024 sec <<< FAILURE! - in org.pitest.junit.JUnitTestClassIdentifierTest
shouldRecogniseAbstractJUnit3ClassesAsTests(org.pitest.junit.JUnitTestClassIdentifierTest)  Time elapsed: 0.007 sec  <<< ERROR!
java.lang.UnsupportedOperationException: Tried to retrieve value but had None.
	at org.pitest.functional.Option$None.value(Option.java:27)
	at org.pitest.classinfo.ClassInfo.descendsFrom(ClassInfo.java:143)
	at org.pitest.classinfo.ClassInfo.descendsFrom(ClassInfo.java:106)
	at org.pitest.junit.TestInfo.isJUnit3Test(TestInfo.java:56)
	at org.pitest.junit.TestInfo.isATest(TestInfo.java:34)
	at org.pitest.junit.TestInfo.isATest(TestInfo.java:40)
	at org.pitest.junit.TestInfo.isATest(TestInfo.java:35)
	at org.pitest.junit.TestInfo.isATest(TestInfo.java:40)
	at org.pitest.junit.TestInfo.isATest(TestInfo.java:35)
	at org.pitest.junit.TestInfo.isATest(TestInfo.java:40)
	at org.pitest.junit.TestInfo.isATest(TestInfo.java:35)
	at org.pitest.junit.TestInfo.isWithinATestClass(TestInfo.java:28)
	at org.pitest.junit.JUnitTestClassIdentifier.isATestClass(JUnitTestClassIdentifier.java:37)
	at org.pitest.junit.JUnitTestClassIdentifierTest.shouldRecogniseAbstractJUnit3ClassesAsTests(JUnitTestClassIdentifierTest.java:71)

shouldRecogniseJUnit3ClassesAsTests(org.pitest.junit.JUnitTestClassIdentifierTest)  Time elapsed: 0.003 sec  <<< ERROR!
java.lang.UnsupportedOperationException: Tried to retrieve value but had None.
	at org.pitest.functional.Option$None.value(Option.java:27)
	at org.pitest.classinfo.ClassInfo.descendsFrom(ClassInfo.java:143)
	at org.pitest.classinfo.ClassInfo.descendsFrom(ClassInfo.java:106)
	at org.pitest.junit.TestInfo.isJUnit3Test(TestInfo.java:56)
	at org.pitest.junit.TestInfo.isATest(TestInfo.java:34)
	at org.pitest.junit.TestInfo.isATest(TestInfo.java:40)
	at org.pitest.junit.TestInfo.isATest(TestInfo.java:35)
	at org.pitest.junit.TestInfo.isATest(TestInfo.java:40)
	at org.pitest.junit.TestInfo.isATest(TestInfo.java:35)
	at org.pitest.junit.TestInfo.isATest(TestInfo.java:40)
	at org.pitest.junit.TestInfo.isATest(TestInfo.java:35)
	at org.pitest.junit.TestInfo.isWithinATestClass(TestInfo.java:28)
	at org.pitest.junit.JUnitTestClassIdentifier.isATestClass(JUnitTestClassIdentifier.java:37)
	at org.pitest.junit.JUnitTestClassIdentifierTest.shouldRecogniseJUnit3ClassesAsTests(JUnitTestClassIdentifierTest.java:62)

shouldNotRecogniseNonTestClassesAsTests(org.pitest.junit.JUnitTestClassIdentifierTest)  Time elapsed: 0.002 sec  <<< ERROR!
java.lang.UnsupportedOperationException: Tried to retrieve value but had None.
	at org.pitest.functional.Option$None.value(Option.java:27)
	at org.pitest.classinfo.ClassInfo.descendsFrom(ClassInfo.java:143)
	at org.pitest.classinfo.ClassInfo.descendsFrom(ClassInfo.java:106)
	at org.pitest.junit.TestInfo.isJUnit3Test(TestInfo.java:56)
	at org.pitest.junit.TestInfo.isATest(TestInfo.java:34)
	at org.pitest.junit.TestInfo.isATest(TestInfo.java:40)
	at org.pitest.junit.TestInfo.isATest(TestInfo.java:35)
	at org.pitest.junit.TestInfo.isWithinATestClass(TestInfo.java:28)
	at org.pitest.junit.JUnitTestClassIdentifier.isATestClass(JUnitTestClassIdentifier.java:37)
	at org.pitest.junit.JUnitTestClassIdentifierTest.shouldNotRecogniseNonTestClassesAsTests(JUnitTestClassIdentifierTest.java:54)

shouldRecogniseNestedClassesWithTestsAsTestsClasses(org.pitest.junit.JUnitTestClassIdentifierTest)  Time elapsed: 0.002 sec  <<< ERROR!
java.lang.UnsupportedOperationException: Tried to retrieve value but had None.
	at org.pitest.functional.Option$None.value(Option.java:27)
	at org.pitest.classinfo.ClassInfo.descendsFrom(ClassInfo.java:143)
	at org.pitest.classinfo.ClassInfo.descendsFrom(ClassInfo.java:106)
	at org.pitest.junit.TestInfo.isJUnit3Test(TestInfo.java:56)
	at org.pitest.junit.TestInfo.isATest(TestInfo.java:34)
	at org.pitest.junit.TestInfo.isATest(TestInfo.java:40)
	at org.pitest.junit.TestInfo.isATest(TestInfo.java:35)
	at org.pitest.junit.TestInfo.isWithinATestClass(TestInfo.java:28)
	at org.pitest.junit.JUnitTestClassIdentifier.isATestClass(JUnitTestClassIdentifier.java:37)
	at org.pitest.junit.JUnitTestClassIdentifierTest.shouldRecogniseNestedClassesWithTestsAsTestsClasses(JUnitTestClassIdentifierTest.java:102)

Running org.pitest.junit.ParameterisedJUnitTestFinderTest
Tests run: 2, Failures: 0, Errors: 0, Skipped: 0, Time elapsed: 0.002 sec - in org.pitest.junit.ParameterisedJUnitTestFinderTest
Running org.pitest.junit.RunnerSuiteFinderTest
Tests run: 5, Failures: 0, Errors: 0, Skipped: 0, Time elapsed: 0.01 sec - in org.pitest.junit.RunnerSuiteFinderTest
Running org.pitest.junit.TestInfoTest
Tests run: 5, Failures: 0, Errors: 4, Skipped: 0, Time elapsed: 0.011 sec <<< FAILURE! - in org.pitest.junit.TestInfoTest
isATestShouldReturnTrueForJUnit3Suites(org.pitest.junit.TestInfoTest)  Time elapsed: 0.003 sec  <<< ERROR!
java.lang.UnsupportedOperationException: Tried to retrieve value but had None.
	at org.pitest.functional.Option$None.value(Option.java:27)
	at org.pitest.classinfo.ClassInfo.descendsFrom(ClassInfo.java:143)
	at org.pitest.classinfo.ClassInfo.descendsFrom(ClassInfo.java:106)
	at org.pitest.junit.TestInfo.isJUnit3Test(TestInfo.java:56)
	at org.pitest.junit.TestInfo.isATest(TestInfo.java:34)
	at org.pitest.junit.TestInfo.isATest(TestInfo.java:40)
	at org.pitest.junit.TestInfo.isATest(TestInfo.java:35)
	at org.pitest.junit.TestInfo.isATest(TestInfo.java:40)
	at org.pitest.junit.TestInfo.isATest(TestInfo.java:35)
	at org.pitest.junit.TestInfo.access$000(TestInfo.java:23)
	at org.pitest.junit.TestInfo$1.apply(TestInfo.java:49)
	at org.pitest.junit.TestInfo$1.apply(TestInfo.java:46)
	at org.pitest.junit.TestInfoTest.isATestShouldReturnTrueForJUnit3Suites(TestInfoTest.java:52)

isWithinATestClassShouldReturnTrueForNestedClassesWithinATest(org.pitest.junit.TestInfoTest)  Time elapsed: 0.002 sec  <<< ERROR!
java.lang.UnsupportedOperationException: Tried to retrieve value but had None.
	at org.pitest.functional.Option$None.value(Option.java:27)
	at org.pitest.classinfo.ClassInfo.descendsFrom(ClassInfo.java:143)
	at org.pitest.classinfo.ClassInfo.descendsFrom(ClassInfo.java:106)
	at org.pitest.junit.TestInfo.isJUnit3Test(TestInfo.java:56)
	at org.pitest.junit.TestInfo.isATest(TestInfo.java:34)
	at org.pitest.junit.TestInfo.isATest(TestInfo.java:40)
	at org.pitest.junit.TestInfo.isATest(TestInfo.java:35)
	at org.pitest.junit.TestInfo.isWithinATestClass(TestInfo.java:28)
	at org.pitest.junit.TestInfoTest.isWithinATestClassShouldReturnTrueForNestedClassesWithinATest(TestInfoTest.java:71)

isATestShouldReturnFalseForNonTests(org.pitest.junit.TestInfoTest)  Time elapsed: 0.002 sec  <<< ERROR!
java.lang.UnsupportedOperationException: Tried to retrieve value but had None.
	at org.pitest.functional.Option$None.value(Option.java:27)
	at org.pitest.classinfo.ClassInfo.descendsFrom(ClassInfo.java:143)
	at org.pitest.classinfo.ClassInfo.descendsFrom(ClassInfo.java:106)
	at org.pitest.junit.TestInfo.isJUnit3Test(TestInfo.java:56)
	at org.pitest.junit.TestInfo.isATest(TestInfo.java:34)
	at org.pitest.junit.TestInfo.isATest(TestInfo.java:40)
	at org.pitest.junit.TestInfo.isATest(TestInfo.java:35)
	at org.pitest.junit.TestInfo.access$000(TestInfo.java:23)
	at org.pitest.junit.TestInfo$1.apply(TestInfo.java:49)
	at org.pitest.junit.TestInfo$1.apply(TestInfo.java:46)
	at org.pitest.junit.TestInfoTest.isATestShouldReturnFalseForNonTests(TestInfoTest.java:62)

isATestShouldReturnTrueForJUnit3Tests(org.pitest.junit.TestInfoTest)  Time elapsed: 0.002 sec  <<< ERROR!
java.lang.UnsupportedOperationException: Tried to retrieve value but had None.
	at org.pitest.functional.Option$None.value(Option.java:27)
	at org.pitest.classinfo.ClassInfo.descendsFrom(ClassInfo.java:143)
	at org.pitest.classinfo.ClassInfo.descendsFrom(ClassInfo.java:106)
	at org.pitest.junit.TestInfo.isJUnit3Test(TestInfo.java:56)
	at org.pitest.junit.TestInfo.isATest(TestInfo.java:34)
	at org.pitest.junit.TestInfo.isATest(TestInfo.java:40)
	at org.pitest.junit.TestInfo.isATest(TestInfo.java:35)
	at org.pitest.junit.TestInfo.isATest(TestInfo.java:40)
	at org.pitest.junit.TestInfo.isATest(TestInfo.java:35)
	at org.pitest.junit.TestInfo.isATest(TestInfo.java:40)
	at org.pitest.junit.TestInfo.isATest(TestInfo.java:35)
	at org.pitest.junit.TestInfo.access$000(TestInfo.java:23)
	at org.pitest.junit.TestInfo$1.apply(TestInfo.java:49)
	at org.pitest.junit.TestInfo$1.apply(TestInfo.java:46)
	at org.pitest.junit.TestInfoTest.isATestShouldReturnTrueForJUnit3Tests(TestInfoTest.java:44)

Running org.pitest.mutationtest.build.AnalyisPriorityComparatorTest
Tests run: 2, Failures: 0, Errors: 0, Skipped: 0, Time elapsed: 0 sec - in org.pitest.mutationtest.build.AnalyisPriorityComparatorTest
Running org.pitest.mutationtest.build.DefaultGrouperTest
Tests run: 3, Failures: 0, Errors: 0, Skipped: 0, Time elapsed: 0.006 sec - in org.pitest.mutationtest.build.DefaultGrouperTest
Running org.pitest.mutationtest.build.DefaultTestPrioritiserTest
10:44:46 AM PIT >> WARNING : Using untargetted tests
Tests run: 3, Failures: 0, Errors: 0, Skipped: 0, Time elapsed: 0.009 sec - in org.pitest.mutationtest.build.DefaultTestPrioritiserTest
Running org.pitest.mutationtest.build.KnownStatusMutationTestUnitTest
Tests run: 2, Failures: 0, Errors: 0, Skipped: 0, Time elapsed: 0.001 sec - in org.pitest.mutationtest.build.KnownStatusMutationTestUnitTest
Running org.pitest.mutationtest.build.MutationSourceTest
Tests run: 2, Failures: 0, Errors: 0, Skipped: 0, Time elapsed: 0.012 sec - in org.pitest.mutationtest.build.MutationSourceTest
Running org.pitest.mutationtest.build.MutationTestBuilderTest
Tests run: 5, Failures: 0, Errors: 0, Skipped: 0, Time elapsed: 0.015 sec - in org.pitest.mutationtest.build.MutationTestBuilderTest
Running org.pitest.mutationtest.build.MutationTestUnitTest
Tests run: 2, Failures: 0, Errors: 0, Skipped: 0, Time elapsed: 0.024 sec - in org.pitest.mutationtest.build.MutationTestUnitTest
Running org.pitest.mutationtest.build.PercentAndConstantTimeoutStrategyTest
Tests run: 1, Failures: 0, Errors: 0, Skipped: 0, Time elapsed: 0.001 sec - in org.pitest.mutationtest.build.PercentAndConstantTimeoutStrategyTest
Running org.pitest.mutationtest.build.TestInfoPriorisationComparatorTest
Tests run: 3, Failures: 0, Errors: 0, Skipped: 0, Time elapsed: 0.001 sec - in org.pitest.mutationtest.build.TestInfoPriorisationComparatorTest
Running org.pitest.mutationtest.commandline.MutationCoverageReportTest
10:44:46 AM PIT >> INFO : Verbose logging is disabled. If you encounter an problem please enable it before reporting an issue.
10:44:46 AM PIT >> INFO : Created  0 mutation test units
10:44:46 AM PIT >> WARNING : No mutations found. This probably means there is an issue with either the supplied classpath or filters.
See http://pitest.org for more details.
10:44:46 AM PIT >> INFO : Completed in 0 seconds
================================================================================
- Timings
================================================================================
> build mutation tests : < 1 second
> run mutation analysis : < 1 second
--------------------------------------------------------------------------------
> Total  : < 1 second
--------------------------------------------------------------------------------
================================================================================
- Statistics
================================================================================
>> Generated 0 mutations Killed 0 (100%)
>> Ran 0 tests (0 tests per mutation)
================================================================================
- Mutators
================================================================================
10:44:46 AM PIT >> INFO : Verbose logging is disabled. If you encounter an problem please enable it before reporting an issue.
10:44:46 AM PIT >> INFO : Verbose logging is disabled. If you encounter an problem please enable it before reporting an issue.
10:44:46 AM PIT >> INFO : Created  0 mutation test units
10:44:46 AM PIT >> WARNING : No mutations found. This probably means there is an issue with either the supplied classpath or filters.
See http://pitest.org for more details.
10:44:46 AM PIT >> INFO : Completed in 0 seconds
================================================================================
- Timings
================================================================================
> build mutation tests : < 1 second
> run mutation analysis : < 1 second
--------------------------------------------------------------------------------
> Total  : < 1 second
--------------------------------------------------------------------------------
================================================================================
- Statistics
================================================================================
>> Generated 0 mutations Killed 0 (100%)
>> Ran 0 tests (0 tests per mutation)
================================================================================
- Mutators
================================================================================
10:44:46 AM PIT >> INFO : Verbose logging is disabled. If you encounter an problem please enable it before reporting an issue.
10:44:46 AM PIT >> INFO : Created  0 mutation test units
10:44:46 AM PIT >> INFO : Verbose logging is disabled. If you encounter an problem please enable it before reporting an issue.
10:44:46 AM PIT >> INFO : Created  0 mutation test units
10:44:46 AM PIT >> WARNING : No mutations found. This probably means there is an issue with either the supplied classpath or filters.
See http://pitest.org for more details.
10:44:46 AM PIT >> INFO : Completed in 0 seconds
================================================================================
- Timings
================================================================================
> build mutation tests : < 1 second
> run mutation analysis : < 1 second
--------------------------------------------------------------------------------
> Total  : < 1 second
--------------------------------------------------------------------------------
================================================================================
- Statistics
================================================================================
>> Generated 0 mutations Killed 0 (100%)
>> Ran 0 tests (0 tests per mutation)
================================================================================
- Mutators
================================================================================
10:44:46 AM PIT >> INFO : Verbose logging is disabled. If you encounter an problem please enable it before reporting an issue.
10:44:46 AM PIT >> INFO : Created  0 mutation test units
10:44:46 AM PIT >> WARNING : No mutations found. This probably means there is an issue with either the supplied classpath or filters.
See http://pitest.org for more details.
10:44:46 AM PIT >> INFO : Completed in 0 seconds
================================================================================
- Timings
================================================================================
> build mutation tests : < 1 second
> run mutation analysis : < 1 second
--------------------------------------------------------------------------------
> Total  : < 1 second
--------------------------------------------------------------------------------
================================================================================
- Statistics
================================================================================
>> Generated 0 mutations Killed 0 (100%)
>> Ran 0 tests (0 tests per mutation)
================================================================================
- Mutators
================================================================================
Tests run: 6, Failures: 0, Errors: 1, Skipped: 0, Time elapsed: 0.09 sec <<< FAILURE! - in org.pitest.mutationtest.commandline.MutationCoverageReportTest
shouldReportMutationsFoundWhenSomeDetected(org.pitest.mutationtest.commandline.MutationCoverageReportTest)  Time elapsed: 0.006 sec  <<< ERROR!
java.lang.UnsupportedOperationException: Tried to retrieve value but had None.
	at org.pitest.functional.Option$None.value(Option.java:27)
	at org.pitest.mutationtest.incremental.IncrementalAnalyser.analyse(IncrementalAnalyser.java:58)
	at org.pitest.mutationtest.build.MutationTestBuilder.createMutationTestUnits(MutationTestBuilder.java:62)
	at org.pitest.mutationtest.tooling.MutationCoverage.buildMutationTests(MutationCoverage.java:262)
	at org.pitest.mutationtest.tooling.MutationCoverage.runReport(MutationCoverage.java:131)
	at org.pitest.mutationtest.commandline.MutationCoverageReportTest.createAndRunTestee(MutationCoverageReportTest.java:203)
	at org.pitest.mutationtest.commandline.MutationCoverageReportTest.shouldReportMutationsFoundWhenSomeDetected(MutationCoverageReportTest.java:189)

Running org.pitest.mutationtest.config.CompoundConfigurationTest
Tests run: 7, Failures: 0, Errors: 0, Skipped: 0, Time elapsed: 0.033 sec - in org.pitest.mutationtest.config.CompoundConfigurationTest
Running org.pitest.mutationtest.config.CompoundListenerFactoryTest
Tests run: 1, Failures: 0, Errors: 0, Skipped: 0, Time elapsed: 0.002 sec - in org.pitest.mutationtest.config.CompoundListenerFactoryTest
Running org.pitest.mutationtest.config.CompoundTestClassIdentifierTest
Tests run: 3, Failures: 0, Errors: 0, Skipped: 0, Time elapsed: 0.005 sec - in org.pitest.mutationtest.config.CompoundTestClassIdentifierTest
Running org.pitest.mutationtest.config.CompoundTestListenerTest
Tests run: 3, Failures: 0, Errors: 0, Skipped: 0, Time elapsed: 0.003 sec - in org.pitest.mutationtest.config.CompoundTestListenerTest
Running org.pitest.mutationtest.config.ConfigurationFactoryTest
Tests run: 6, Failures: 0, Errors: 0, Skipped: 0, Time elapsed: 0.051 sec - in org.pitest.mutationtest.config.ConfigurationFactoryTest
Running org.pitest.mutationtest.config.DefaultCodePathPredicateTest
Tests run: 5, Failures: 0, Errors: 0, Skipped: 0, Time elapsed: 0 sec - in org.pitest.mutationtest.config.DefaultCodePathPredicateTest
Running org.pitest.mutationtest.config.DefaultDependencyPathPredicateTest
Tests run: 2, Failures: 0, Errors: 0, Skipped: 0, Time elapsed: 0 sec - in org.pitest.mutationtest.config.DefaultDependencyPathPredicateTest
Running org.pitest.mutationtest.config.PathNamePredicateTest
Tests run: 2, Failures: 0, Errors: 0, Skipped: 0, Time elapsed: 0 sec - in org.pitest.mutationtest.config.PathNamePredicateTest
Running org.pitest.mutationtest.config.PluginServicesTest
Tests run: 3, Failures: 0, Errors: 0, Skipped: 0, Time elapsed: 0.005 sec - in org.pitest.mutationtest.config.PluginServicesTest
Running org.pitest.mutationtest.config.ReportOptionsTest
Tests run: 1, Failures: 0, Errors: 0, Skipped: 0, Time elapsed: 0 sec - in org.pitest.mutationtest.config.ReportOptionsTest
Running org.pitest.mutationtest.config.SettingsFactoryTest
Tests run: 12, Failures: 0, Errors: 0, Skipped: 0, Time elapsed: 0.044 sec - in org.pitest.mutationtest.config.SettingsFactoryTest
Running org.pitest.mutationtest.DetectionStatusTest
Tests run: 12, Failures: 0, Errors: 0, Skipped: 0, Time elapsed: 0 sec - in org.pitest.mutationtest.DetectionStatusTest
Running org.pitest.mutationtest.engine.gregor.analysis.InstructionTrackingMethodVisitorTest
Tests run: 3, Failures: 0, Errors: 0, Skipped: 0, Time elapsed: 0.004 sec - in org.pitest.mutationtest.engine.gregor.analysis.InstructionTrackingMethodVisitorTest
Running org.pitest.mutationtest.engine.gregor.AvoidAssertsMethodAdapterTest
Tests run: 31, Failures: 0, Errors: 0, Skipped: 0, Time elapsed: 0.053 sec - in org.pitest.mutationtest.engine.gregor.AvoidAssertsMethodAdapterTest
Running org.pitest.mutationtest.engine.gregor.blocks.BlockTrackingMethodDecoratorTest
Tests run: 40, Failures: 0, Errors: 0, Skipped: 0, Time elapsed: 0.037 sec - in org.pitest.mutationtest.engine.gregor.blocks.BlockTrackingMethodDecoratorTest
Running org.pitest.mutationtest.engine.gregor.blocks.ConcreteBlockCounterTest
Tests run: 2, Failures: 0, Errors: 0, Skipped: 0, Time elapsed: 0 sec - in org.pitest.mutationtest.engine.gregor.blocks.ConcreteBlockCounterTest
Running org.pitest.mutationtest.engine.gregor.ClassInfoTest
Tests run: 3, Failures: 0, Errors: 0, Skipped: 0, Time elapsed: 0.003 sec - in org.pitest.mutationtest.engine.gregor.ClassInfoTest
Running org.pitest.mutationtest.engine.gregor.config.MutatorTest
Tests run: 4, Failures: 0, Errors: 0, Skipped: 0, Time elapsed: 0.024 sec - in org.pitest.mutationtest.engine.gregor.config.MutatorTest
Running org.pitest.mutationtest.engine.gregor.GregorMutationEngineTest
Tests run: 1, Failures: 0, Errors: 0, Skipped: 0, Time elapsed: 0.002 sec - in org.pitest.mutationtest.engine.gregor.GregorMutationEngineTest
Running org.pitest.mutationtest.engine.gregor.inlinedcode.InlinedFinallyBlockDetectorTest
10:44:46 AM PIT >> WARNING : Found more than one mutation similar on same line in a finally block. Can't correct for inlining.
Tests run: 4, Failures: 0, Errors: 0, Skipped: 0, Time elapsed: 0.005 sec - in org.pitest.mutationtest.engine.gregor.inlinedcode.InlinedFinallyBlockDetectorTest
Running org.pitest.mutationtest.engine.gregor.inlinedcode.NoInlinedCodeDetectionTest
Tests run: 1, Failures: 0, Errors: 0, Skipped: 0, Time elapsed: 0 sec - in org.pitest.mutationtest.engine.gregor.inlinedcode.NoInlinedCodeDetectionTest
Running org.pitest.mutationtest.engine.gregor.LineFilterMethodAdapterTest
Tests run: 25, Failures: 0, Errors: 0, Skipped: 0, Time elapsed: 0.023 sec - in org.pitest.mutationtest.engine.gregor.LineFilterMethodAdapterTest
Running org.pitest.mutationtest.engine.gregor.MethodInfoTest
Tests run: 18, Failures: 0, Errors: 0, Skipped: 0, Time elapsed: 0.002 sec - in org.pitest.mutationtest.engine.gregor.MethodInfoTest
Running org.pitest.mutationtest.engine.gregor.mutators.ArgumentPropagationMutatorTest
Tests run: 13, Failures: 0, Errors: 0, Skipped: 0, Time elapsed: 0.264 sec - in org.pitest.mutationtest.engine.gregor.mutators.ArgumentPropagationMutatorTest
Running org.pitest.mutationtest.engine.gregor.mutators.ConditionalsBoundaryMutatorTest
Tests run: 9, Failures: 0, Errors: 0, Skipped: 0, Time elapsed: 0.23 sec - in org.pitest.mutationtest.engine.gregor.mutators.ConditionalsBoundaryMutatorTest
Running org.pitest.mutationtest.engine.gregor.mutators.ConstructorCallMutatorTest
Tests run: 6, Failures: 0, Errors: 0, Skipped: 0, Time elapsed: 0.021 sec - in org.pitest.mutationtest.engine.gregor.mutators.ConstructorCallMutatorTest
Running org.pitest.mutationtest.engine.gregor.mutators.experimental.MemberVariableMutatorTest
Tests run: 8, Failures: 0, Errors: 0, Skipped: 0, Time elapsed: 0.045 sec - in org.pitest.mutationtest.engine.gregor.mutators.experimental.MemberVariableMutatorTest
Running org.pitest.mutationtest.engine.gregor.mutators.experimental.MutantStarterTest
Tests run: 3, Failures: 0, Errors: 0, Skipped: 0, Time elapsed: 0.007 sec - in org.pitest.mutationtest.engine.gregor.mutators.experimental.MutantStarterTest
Running org.pitest.mutationtest.engine.gregor.mutators.experimental.RemoveIncrementsMutatorTest
Tests run: 3, Failures: 0, Errors: 0, Skipped: 0, Time elapsed: 0.014 sec - in org.pitest.mutationtest.engine.gregor.mutators.experimental.RemoveIncrementsMutatorTest
Running org.pitest.mutationtest.engine.gregor.mutators.experimental.RemoveSwitchMutatorTest
Tests run: 7, Failures: 0, Errors: 0, Skipped: 0, Time elapsed: 0.097 sec - in org.pitest.mutationtest.engine.gregor.mutators.experimental.RemoveSwitchMutatorTest
Running org.pitest.mutationtest.engine.gregor.mutators.experimental.ReturnValuesMutatorTest
Tests run: 26, Failures: 0, Errors: 0, Skipped: 0, Time elapsed: 0.225 sec - in org.pitest.mutationtest.engine.gregor.mutators.experimental.ReturnValuesMutatorTest
Running org.pitest.mutationtest.engine.gregor.mutators.experimental.SwitchMutatorTest
Tests run: 8, Failures: 0, Errors: 0, Skipped: 0, Time elapsed: 0.101 sec - in org.pitest.mutationtest.engine.gregor.mutators.experimental.SwitchMutatorTest
Running org.pitest.mutationtest.engine.gregor.mutators.IncrementsMutatorTest
Tests run: 2, Failures: 0, Errors: 0, Skipped: 0, Time elapsed: 0.008 sec - in org.pitest.mutationtest.engine.gregor.mutators.IncrementsMutatorTest
Running org.pitest.mutationtest.engine.gregor.mutators.InlineConstantMutatorTest
Tests run: 32, Failures: 0, Errors: 0, Skipped: 0, Time elapsed: 0.223 sec - in org.pitest.mutationtest.engine.gregor.mutators.InlineConstantMutatorTest
Running org.pitest.mutationtest.engine.gregor.mutators.InvertNegsMutatorTest
Tests run: 4, Failures: 0, Errors: 0, Skipped: 0, Time elapsed: 0.034 sec - in org.pitest.mutationtest.engine.gregor.mutators.InvertNegsMutatorTest
Running org.pitest.mutationtest.engine.gregor.mutators.MathMutatorTest
Tests run: 32, Failures: 0, Errors: 0, Skipped: 0, Time elapsed: 0.26 sec - in org.pitest.mutationtest.engine.gregor.mutators.MathMutatorTest
Running org.pitest.mutationtest.engine.gregor.mutators.NegateConditionalsMutatorTest
package asm.org.pitest.mutationtest.engine.gregor.mutators;
import java.util.*;
import org.objectweb.asm.*;
public class NegateConditionalsMutatorTest$HasIF_ACMPNEDump implements Opcodes {

public static byte[] dump () throws Exception {

ClassWriter cw = new ClassWriter(0);
FieldVisitor fv;
MethodVisitor mv;
AnnotationVisitor av0;

cw.visit(V1_6, ACC_SUPER, "org/pitest/mutationtest/engine/gregor/mutators/NegateConditionalsMutatorTest$HasIF_ACMPNE", "Ljava/lang/Object;Ljava/util/concurrent/Callable<Ljava/lang/String;>;", "java/lang/Object", new String[] { "java/util/concurrent/Callable" });

cw.visitSource("NegateConditionalsMutatorTest.java", null);

cw.visitInnerClass("org/pitest/mutationtest/engine/gregor/mutators/NegateConditionalsMutatorTest$HasIF_ACMPNE", "org/pitest/mutationtest/engine/gregor/mutators/NegateConditionalsMutatorTest", "HasIF_ACMPNE", ACC_PRIVATE + ACC_STATIC);

{
fv = cw.visitField(ACC_PRIVATE + ACC_FINAL, "i", "Ljava/lang/Object;", null, null);
fv.visitEnd();
}
{
mv = cw.visitMethod(0, "<init>", "(Ljava/lang/Object;)V", null, null);
mv.visitCode();
Label l0 = new Label();
mv.visitLabel(l0);
mv.visitLineNumber(388, l0);
mv.visitVarInsn(ALOAD, 0);
mv.visitMethodInsn(INVOKESPECIAL, "java/lang/Object", "<init>", "()V", false);
Label l1 = new Label();
mv.visitLabel(l1);
mv.visitLineNumber(389, l1);
mv.visitVarInsn(ALOAD, 0);
mv.visitVarInsn(ALOAD, 1);
mv.visitFieldInsn(PUTFIELD, "org/pitest/mutationtest/engine/gregor/mutators/NegateConditionalsMutatorTest$HasIF_ACMPNE", "i", "Ljava/lang/Object;");
Label l2 = new Label();
mv.visitLabel(l2);
mv.visitLineNumber(390, l2);
mv.visitInsn(RETURN);
Label l3 = new Label();
mv.visitLabel(l3);
mv.visitLocalVariable("this", "Lorg/pitest/mutationtest/engine/gregor/mutators/NegateConditionalsMutatorTest$HasIF_ACMPNE;", null, l0, l3, 0);
mv.visitLocalVariable("i", "Ljava/lang/Object;", null, l0, l3, 1);
mv.visitMaxs(2, 2);
mv.visitEnd();
}
{
mv = cw.visitMethod(ACC_PUBLIC, "call", "()Ljava/lang/String;", null, null);
mv.visitCode();
Label l0 = new Label();
mv.visitLabel(l0);
mv.visitLineNumber(394, l0);
mv.visitLdcInsn(Type.getType("Ljava/lang/Integer;"));
mv.visitVarInsn(ASTORE, 1);
Label l1 = new Label();
mv.visitLabel(l1);
mv.visitLineNumber(395, l1);
mv.visitVarInsn(ALOAD, 0);
mv.visitFieldInsn(GETFIELD, "org/pitest/mutationtest/engine/gregor/mutators/NegateConditionalsMutatorTest$HasIF_ACMPNE", "i", "Ljava/lang/Object;");
mv.visitVarInsn(ALOAD, 1);
Label l2 = new Label();
mv.visitJumpInsn(IF_ACMPEQ, l2);
Label l3 = new Label();
mv.visitLabel(l3);
mv.visitLineNumber(396, l3);
mv.visitLdcInsn("was integer");
mv.visitInsn(ARETURN);
mv.visitLabel(l2);
mv.visitLineNumber(398, l2);
mv.visitFrame(Opcodes.F_NEW, 2, new Object[] {"org/pitest/mutationtest/engine/gregor/mutators/NegateConditionalsMutatorTest$HasIF_ACMPNE", "java/lang/Object"}, 0, new Object[] {});
mv.visitLdcInsn("was not integer");
mv.visitInsn(ARETURN);
Label l4 = new Label();
mv.visitLabel(l4);
mv.visitLocalVariable("this", "Lorg/pitest/mutationtest/engine/gregor/mutators/NegateConditionalsMutatorTest$HasIF_ACMPNE;", null, l0, l4, 0);
mv.visitLocalVariable("integer", "Ljava/lang/Object;", null, l1, l4, 1);
mv.visitMaxs(2, 2);
mv.visitEnd();
}
{
mv = cw.visitMethod(ACC_PUBLIC + ACC_BRIDGE + ACC_SYNTHETIC, "call", "()Ljava/lang/Object;", null, new String[] { "java/lang/Exception" });
mv.visitCode();
Label l0 = new Label();
mv.visitLabel(l0);
mv.visitLineNumber(385, l0);
mv.visitVarInsn(ALOAD, 0);
mv.visitMethodInsn(INVOKEVIRTUAL, "org/pitest/mutationtest/engine/gregor/mutators/NegateConditionalsMutatorTest$HasIF_ACMPNE", "call", "()Ljava/lang/String;", false);
mv.visitInsn(ARETURN);
Label l1 = new Label();
mv.visitLabel(l1);
mv.visitLocalVariable("this", "Lorg/pitest/mutationtest/engine/gregor/mutators/NegateConditionalsMutatorTest$HasIF_ACMPNE;", null, l0, l1, 0);
mv.visitMaxs(1, 1);
mv.visitEnd();
}
cw.visitEnd();

return cw.toByteArray();
}
}
Tests run: 16, Failures: 0, Errors: 0, Skipped: 0, Time elapsed: 0.229 sec - in org.pitest.mutationtest.engine.gregor.mutators.NegateConditionalsMutatorTest
Running org.pitest.mutationtest.engine.gregor.mutators.NonVoidMethodCallMutatorTest
Tests run: 14, Failures: 0, Errors: 0, Skipped: 0, Time elapsed: 0.049 sec - in org.pitest.mutationtest.engine.gregor.mutators.NonVoidMethodCallMutatorTest
Running org.pitest.mutationtest.engine.gregor.mutators.RemoveConditionalMutatorTest
Tests run: 69, Failures: 0, Errors: 0, Skipped: 0, Time elapsed: 0.437 sec - in org.pitest.mutationtest.engine.gregor.mutators.RemoveConditionalMutatorTest
Running org.pitest.mutationtest.engine.gregor.mutators.ReturnValsMutatorTest
Tests run: 12, Failures: 0, Errors: 0, Skipped: 0, Time elapsed: 0.069 sec - in org.pitest.mutationtest.engine.gregor.mutators.ReturnValsMutatorTest
Running org.pitest.mutationtest.engine.gregor.mutators.VoidMethodCallMutatorTest
Tests run: 5, Failures: 0, Errors: 0, Skipped: 0, Time elapsed: 0.018 sec - in org.pitest.mutationtest.engine.gregor.mutators.VoidMethodCallMutatorTest
Running org.pitest.mutationtest.engine.gregor.TestGregorMutater
Tests run: 18, Failures: 0, Errors: 0, Skipped: 0, Time elapsed: 0.063 sec - in org.pitest.mutationtest.engine.gregor.TestGregorMutater
Running org.pitest.mutationtest.engine.gregor.TestTryWithResources
Tests run: 1, Failures: 0, Errors: 0, Skipped: 0, Time elapsed: 0.018 sec - in org.pitest.mutationtest.engine.gregor.TestTryWithResources
Running org.pitest.mutationtest.engine.LocationTest
Tests run: 2, Failures: 0, Errors: 0, Skipped: 0, Time elapsed: 0.01 sec - in org.pitest.mutationtest.engine.LocationTest
Running org.pitest.mutationtest.engine.MutationDetailsTest
Tests run: 1, Failures: 0, Errors: 0, Skipped: 0, Time elapsed: 0.018 sec - in org.pitest.mutationtest.engine.MutationDetailsTest
Running org.pitest.mutationtest.engine.MutationIdentifierTest
Tests run: 13, Failures: 0, Errors: 0, Skipped: 0, Time elapsed: 0.015 sec - in org.pitest.mutationtest.engine.MutationIdentifierTest
Running org.pitest.mutationtest.execute.CheckTestHasFailedResultListenerTest
Tests run: 4, Failures: 0, Errors: 0, Skipped: 0, Time elapsed: 0 sec - in org.pitest.mutationtest.execute.CheckTestHasFailedResultListenerTest
Running org.pitest.mutationtest.execute.DefaultReporterTest
Tests run: 3, Failures: 0, Errors: 0, Skipped: 0, Time elapsed: 0.003 sec - in org.pitest.mutationtest.execute.DefaultReporterTest
Running org.pitest.mutationtest.execute.MutationTestSlaveTest
10:44:49 AM PIT >> WARNING : Error during mutation test
org.pitest.util.PitError: foo

Please copy and paste the information and the complete stacktrace below when reporting an issue
VM : Java HotSpot(TM) 64-Bit Server VM
Vendor : Oracle Corporation
Version : 25.60-b23
Uptime : 5933
Input -> 
BootClassPathSupported : true

	at org.pitest.mutationtest.execute.MutationTestWorker.processMutation(MutationTestWorker.java:91)
	at org.pitest.mutationtest.execute.MutationTestWorker.run(MutationTestWorker.java:77)
	at org.pitest.mutationtest.execute.MutationTestSlave.run(MutationTestSlave.java:84)
	at org.pitest.mutationtest.execute.MutationTestSlaveTest.shouldReportErrorWhenOneOccursDuringAnalysis(MutationTestSlaveTest.java:83)
	at sun.reflect.NativeMethodAccessorImpl.invoke0(Native Method)
	at sun.reflect.NativeMethodAccessorImpl.invoke(NativeMethodAccessorImpl.java:62)
	at sun.reflect.DelegatingMethodAccessorImpl.invoke(DelegatingMethodAccessorImpl.java:43)
	at java.lang.reflect.Method.invoke(Method.java:497)
	at org.junit.runners.model.FrameworkMethod$1.runReflectiveCall(FrameworkMethod.java:47)
	at org.junit.internal.runners.model.ReflectiveCallable.run(ReflectiveCallable.java:12)
	at org.junit.runners.model.FrameworkMethod.invokeExplosively(FrameworkMethod.java:44)
	at org.junit.internal.runners.statements.InvokeMethod.evaluate(InvokeMethod.java:17)
	at org.junit.internal.runners.statements.RunBefores.evaluate(RunBefores.java:26)
	at org.junit.runners.ParentRunner.runLeaf(ParentRunner.java:271)
	at org.junit.runners.BlockJUnit4ClassRunner.runChild(BlockJUnit4ClassRunner.java:70)
	at org.junit.runners.BlockJUnit4ClassRunner.runChild(BlockJUnit4ClassRunner.java:50)
	at org.junit.runners.ParentRunner$3.run(ParentRunner.java:238)
	at org.junit.runners.ParentRunner$1.schedule(ParentRunner.java:63)
	at org.junit.runners.ParentRunner.runChildren(ParentRunner.java:236)
	at org.junit.runners.ParentRunner.access$000(ParentRunner.java:53)
	at org.junit.runners.ParentRunner$2.evaluate(ParentRunner.java:229)
	at org.junit.runners.ParentRunner.run(ParentRunner.java:309)
	at org.junit.runners.Suite.runChild(Suite.java:127)
	at org.junit.runners.Suite.runChild(Suite.java:26)
	at org.junit.runners.ParentRunner$3.run(ParentRunner.java:238)
	at org.junit.runners.ParentRunner$1.schedule(ParentRunner.java:63)
	at org.junit.runners.ParentRunner.runChildren(ParentRunner.java:236)
	at org.junit.runners.ParentRunner.access$000(ParentRunner.java:53)
	at org.junit.runners.ParentRunner$2.evaluate(ParentRunner.java:229)
	at org.junit.runners.ParentRunner.run(ParentRunner.java:309)
	at org.junit.runner.JUnitCore.run(JUnitCore.java:160)
	at org.junit.runner.JUnitCore.run(JUnitCore.java:138)
	at org.apache.maven.surefire.junitcore.JUnitCoreWrapper.createRequestAndRun(JUnitCoreWrapper.java:113)
	at org.apache.maven.surefire.junitcore.JUnitCoreWrapper.executeEager(JUnitCoreWrapper.java:85)
	at org.apache.maven.surefire.junitcore.JUnitCoreWrapper.execute(JUnitCoreWrapper.java:54)
	at org.apache.maven.surefire.junitcore.JUnitCoreProvider.invoke(JUnitCoreProvider.java:134)
	at org.apache.maven.surefire.booter.ForkedBooter.invokeProviderInSameClassLoader(ForkedBooter.java:200)
	at org.apache.maven.surefire.booter.ForkedBooter.runSuitesInProcess(ForkedBooter.java:153)
	at org.apache.maven.surefire.booter.ForkedBooter.main(ForkedBooter.java:103)
Tests run: 2, Failures: 0, Errors: 0, Skipped: 0, Time elapsed: 0.01 sec - in org.pitest.mutationtest.execute.MutationTestSlaveTest
Running org.pitest.mutationtest.execute.MutationTestWorkerTest
10:44:49 AM PIT >> WARNING : Mutation MutationDetails [id=MutationIdentifier [location=Location [clazz=foo, method=method, methodDesc=()I], indexes=[1], mutator=mutator], filename=sourceFile, block=0, lineNumber=42, description=desc, testsInOrder=[]] was not viable 
10:44:49 AM PIT >> INFO : No test coverage for mutation  MutationDetails [id=MutationIdentifier [location=Location [clazz=foo, method=method, methodDesc=()I], indexes=[1], mutator=mutator], filename=sourceFile, block=0, lineNumber=42, description=desc, testsInOrder=[]] in method
10:44:49 AM PIT >> INFO : No test coverage for mutation  MutationDetails [id=MutationIdentifier [location=Location [clazz=foo, method=method, methodDesc=()I], indexes=[2], mutator=mutator], filename=sourceFile, block=0, lineNumber=42, description=desc, testsInOrder=[]] in method
Tests run: 5, Failures: 0, Errors: 0, Skipped: 1, Time elapsed: 0.02 sec - in org.pitest.mutationtest.execute.MutationTestWorkerTest
Running org.pitest.mutationtest.execute.MutationTimeoutDecoratorTest
Tests run: 2, Failures: 0, Errors: 0, Skipped: 0, Time elapsed: 0.063 sec - in org.pitest.mutationtest.execute.MutationTimeoutDecoratorTest
Running org.pitest.mutationtest.execute.TimeOutDecoratedTestSourceTest
Tests run: 3, Failures: 0, Errors: 0, Skipped: 0, Time elapsed: 0.002 sec - in org.pitest.mutationtest.execute.TimeOutDecoratedTestSourceTest
Running org.pitest.mutationtest.execute.TimeOutSystemExitSideEffectTest
Tests run: 1, Failures: 0, Errors: 0, Skipped: 0, Time elapsed: 0 sec - in org.pitest.mutationtest.execute.TimeOutSystemExitSideEffectTest
Running org.pitest.mutationtest.filter.LimitNumberOfMutationPerClassFilterTest
Tests run: 4, Failures: 0, Errors: 0, Skipped: 0, Time elapsed: 0.001 sec - in org.pitest.mutationtest.filter.LimitNumberOfMutationPerClassFilterTest
Running org.pitest.mutationtest.filter.LimitNumberOfMutationsPerClassFilterFactoryTest
Tests run: 3, Failures: 0, Errors: 0, Skipped: 0, Time elapsed: 0 sec - in org.pitest.mutationtest.filter.LimitNumberOfMutationsPerClassFilterFactoryTest
Running org.pitest.mutationtest.incremental.DefaultCodeHistoryTest
Tests run: 6, Failures: 0, Errors: 0, Skipped: 0, Time elapsed: 0.008 sec - in org.pitest.mutationtest.incremental.DefaultCodeHistoryTest
Running org.pitest.mutationtest.incremental.FileWriterFactoryTest
Tests run: 3, Failures: 0, Errors: 0, Skipped: 0, Time elapsed: 0.025 sec - in org.pitest.mutationtest.incremental.FileWriterFactoryTest
Running org.pitest.mutationtest.incremental.HistoryListenerTest
Tests run: 1, Failures: 0, Errors: 0, Skipped: 0, Time elapsed: 0.002 sec - in org.pitest.mutationtest.incremental.HistoryListenerTest
Running org.pitest.mutationtest.incremental.IncrementalAnalyserTest
Tests run: 7, Failures: 3, Errors: 1, Skipped: 0, Time elapsed: 0.009 sec <<< FAILURE! - in org.pitest.mutationtest.incremental.IncrementalAnalyserTest
shouldStartPreviousTimedOutMutationsAtAStatusOfTimedOutWhenClassHasNotChanged(org.pitest.mutationtest.incremental.IncrementalAnalyserTest)  Time elapsed: 0.001 sec  <<< FAILURE!
java.lang.AssertionError: expected:<TIMED_OUT> but was:<NOT_STARTED>
	at org.junit.Assert.fail(Assert.java:88)
	at org.junit.Assert.failNotEquals(Assert.java:743)
	at org.junit.Assert.assertEquals(Assert.java:118)
	at org.junit.Assert.assertEquals(Assert.java:144)
	at org.pitest.mutationtest.incremental.IncrementalAnalyserTest.shouldStartPreviousTimedOutMutationsAtAStatusOfTimedOutWhenClassHasNotChanged(IncrementalAnalyserTest.java:101)

shouldStartPreviousSurvivedMutationsAtAStatusOfSurvivedWhenCoverageHasNotChanged(org.pitest.mutationtest.incremental.IncrementalAnalyserTest)  Time elapsed: 0.001 sec  <<< FAILURE!
java.lang.AssertionError: expected:<SURVIVED> but was:<NOT_STARTED>
	at org.junit.Assert.fail(Assert.java:88)
	at org.junit.Assert.failNotEquals(Assert.java:743)
	at org.junit.Assert.assertEquals(Assert.java:118)
	at org.junit.Assert.assertEquals(Assert.java:144)
	at org.pitest.mutationtest.incremental.IncrementalAnalyserTest.shouldStartPreviousSurvivedMutationsAtAStatusOfSurvivedWhenCoverageHasNotChanged(IncrementalAnalyserTest.java:78)

shouldStartPreviousKilledMutationsAtAStatusOfNotStartedWhenNeitherClassOrTestHasChanged(org.pitest.mutationtest.incremental.IncrementalAnalyserTest)  Time elapsed: 0.001 sec  <<< FAILURE!
java.lang.AssertionError: expected:<KILLED> but was:<NOT_STARTED>
	at org.junit.Assert.fail(Assert.java:88)
	at org.junit.Assert.failNotEquals(Assert.java:743)
	at org.junit.Assert.assertEquals(Assert.java:118)
	at org.junit.Assert.assertEquals(Assert.java:144)
	at org.pitest.mutationtest.incremental.IncrementalAnalyserTest.shouldStartPreviousKilledMutationsAtAStatusOfNotStartedWhenNeitherClassOrTestHasChanged(IncrementalAnalyserTest.java:119)

shouldStartNewMutationsAtAStatusOfNotStarted(org.pitest.mutationtest.incremental.IncrementalAnalyserTest)  Time elapsed: 0.001 sec  <<< ERROR!
java.lang.UnsupportedOperationException: Tried to retrieve value but had None.
	at org.pitest.functional.Option$None.value(Option.java:27)
	at org.pitest.mutationtest.incremental.IncrementalAnalyser.analyse(IncrementalAnalyser.java:58)
	at org.pitest.mutationtest.incremental.IncrementalAnalyserTest.shouldStartNewMutationsAtAStatusOfNotStarted(IncrementalAnalyserTest.java:49)

Running org.pitest.mutationtest.incremental.NullHistoryStoreTest
Tests run: 2, Failures: 0, Errors: 0, Skipped: 0, Time elapsed: 0.001 sec - in org.pitest.mutationtest.incremental.NullHistoryStoreTest
Running org.pitest.mutationtest.incremental.NullWriterFactoryTest
Tests run: 1, Failures: 0, Errors: 0, Skipped: 0, Time elapsed: 0.002 sec - in org.pitest.mutationtest.incremental.NullWriterFactoryTest
Running org.pitest.mutationtest.incremental.XStreamHistoryStoreTest
10:44:49 AM PIT >> WARNING : Could not read previous results
Tests run: 4, Failures: 0, Errors: 0, Skipped: 0, Time elapsed: 0.012 sec - in org.pitest.mutationtest.incremental.XStreamHistoryStoreTest
Running org.pitest.mutationtest.mocksupport.BendJavassistToMyWillTransformerTest
Tests run: 2, Failures: 0, Errors: 0, Skipped: 0, Time elapsed: 0.01 sec - in org.pitest.mutationtest.mocksupport.BendJavassistToMyWillTransformerTest
Running org.pitest.mutationtest.mocksupport.JavassistInputStreamInterceptorAdapaterTest
Tests run: 4, Failures: 0, Errors: 0, Skipped: 0, Time elapsed: 0.001 sec - in org.pitest.mutationtest.mocksupport.JavassistInputStreamInterceptorAdapaterTest
Running org.pitest.mutationtest.mocksupport.JavassistInterceptorTest
Tests run: 3, Failures: 0, Errors: 0, Skipped: 0, Time elapsed: 0 sec - in org.pitest.mutationtest.mocksupport.JavassistInterceptorTest
Running org.pitest.mutationtest.MutationMetaDataTest
Tests run: 3, Failures: 0, Errors: 0, Skipped: 0, Time elapsed: 0.007 sec - in org.pitest.mutationtest.MutationMetaDataTest
Running org.pitest.mutationtest.MutationResultTest
Tests run: 4, Failures: 0, Errors: 0, Skipped: 0, Time elapsed: 0.013 sec - in org.pitest.mutationtest.MutationResultTest
Running org.pitest.mutationtest.MutationStatusMapTest
Tests run: 8, Failures: 0, Errors: 0, Skipped: 0, Time elapsed: 0.003 sec - in org.pitest.mutationtest.MutationStatusMapTest
Running org.pitest.mutationtest.MutationStatusTestPairTest
Tests run: 1, Failures: 0, Errors: 0, Skipped: 0, Time elapsed: 0.009 sec - in org.pitest.mutationtest.MutationStatusTestPairTest
Running org.pitest.mutationtest.report.csv.CSVReportListenerTest
Tests run: 2, Failures: 0, Errors: 0, Skipped: 0, Time elapsed: 0.004 sec - in org.pitest.mutationtest.report.csv.CSVReportListenerTest
Running org.pitest.mutationtest.report.xml.XMLReportListenerTest
Tests run: 4, Failures: 0, Errors: 0, Skipped: 0, Time elapsed: 0.001 sec - in org.pitest.mutationtest.report.xml.XMLReportListenerTest
Running org.pitest.mutationtest.statistics.MutationStatisticsListenerTest
Tests run: 1, Failures: 0, Errors: 0, Skipped: 0, Time elapsed: 0.001 sec - in org.pitest.mutationtest.statistics.MutationStatisticsListenerTest
Running org.pitest.mutationtest.statistics.MutationStatisticsTest
Tests run: 10, Failures: 0, Errors: 0, Skipped: 0, Time elapsed: 0.003 sec - in org.pitest.mutationtest.statistics.MutationStatisticsTest
Running org.pitest.mutationtest.statistics.ScoreTest
Tests run: 13, Failures: 0, Errors: 0, Skipped: 0, Time elapsed: 0.001 sec - in org.pitest.mutationtest.statistics.ScoreTest
Running org.pitest.mutationtest.tooling.DirectorySourceLocatorTest
Tests run: 2, Failures: 0, Errors: 0, Skipped: 0, Time elapsed: 0.003 sec - in org.pitest.mutationtest.tooling.DirectorySourceLocatorTest
Running org.pitest.mutationtest.tooling.JarCreatingJarFinderTest
Tests run: 9, Failures: 2, Errors: 5, Skipped: 0, Time elapsed: 0.011 sec <<< FAILURE! - in org.pitest.mutationtest.tooling.JarCreatingJarFinderTest
shouldCreateJarFile(org.pitest.mutationtest.tooling.JarCreatingJarFinderTest)  Time elapsed: 0.002 sec  <<< FAILURE!
java.lang.AssertionError: null
	at org.junit.Assert.fail(Assert.java:86)
	at org.junit.Assert.assertTrue(Assert.java:41)
	at org.junit.Assert.assertTrue(Assert.java:52)
	at org.pitest.mutationtest.tooling.JarCreatingJarFinderTest.shouldCreateJarFile(JarCreatingJarFinderTest.java:82)

shouldAddPITToTheBootClassPath(org.pitest.mutationtest.tooling.JarCreatingJarFinderTest)  Time elapsed: 0.001 sec  <<< ERROR!
java.lang.UnsupportedOperationException: Tried to retrieve value but had None.
	at org.pitest.functional.Option$None.value(Option.java:27)
	at org.pitest.mutationtest.tooling.JarCreatingJarFinderTest.getGeneratedManifestAttribute(JarCreatingJarFinderTest.java:135)
	at org.pitest.mutationtest.tooling.JarCreatingJarFinderTest.shouldAddPITToTheBootClassPath(JarCreatingJarFinderTest.java:112)

shouldSetPreMainClassAttribute(org.pitest.mutationtest.tooling.JarCreatingJarFinderTest)  Time elapsed: 0 sec  <<< ERROR!
java.lang.UnsupportedOperationException: Tried to retrieve value but had None.
	at org.pitest.functional.Option$None.value(Option.java:27)
	at org.pitest.mutationtest.tooling.JarCreatingJarFinderTest.getGeneratedManifestAttribute(JarCreatingJarFinderTest.java:135)
	at org.pitest.mutationtest.tooling.JarCreatingJarFinderTest.assertGeneratedManifestEntryEquals(JarCreatingJarFinderTest.java:128)
	at org.pitest.mutationtest.tooling.JarCreatingJarFinderTest.shouldSetPreMainClassAttribute(JarCreatingJarFinderTest.java:94)

shouldFailOnUnreadableRessources(org.pitest.mutationtest.tooling.JarCreatingJarFinderTest)  Time elapsed: 0.002 sec  <<< FAILURE!
java.lang.AssertionError: Expected test to throw an instance of org.pitest.util.PitError
	at org.junit.Assert.fail(Assert.java:88)
	at org.junit.rules.ExpectedException.failDueToMissingException(ExpectedException.java:184)
	at org.junit.rules.ExpectedException.access$100(ExpectedException.java:85)
	at org.junit.rules.ExpectedException$ExpectedExceptionStatement.evaluate(ExpectedException.java:170)
	at org.junit.rules.RunRules.evaluate(RunRules.java:20)
	at org.junit.runners.ParentRunner.runLeaf(ParentRunner.java:271)
	at org.junit.runners.BlockJUnit4ClassRunner.runChild(BlockJUnit4ClassRunner.java:70)
	at org.junit.runners.BlockJUnit4ClassRunner.runChild(BlockJUnit4ClassRunner.java:50)
	at org.junit.runners.ParentRunner$3.run(ParentRunner.java:238)
	at org.junit.runners.ParentRunner$1.schedule(ParentRunner.java:63)
	at org.junit.runners.ParentRunner.runChildren(ParentRunner.java:236)
	at org.junit.runners.ParentRunner.access$000(ParentRunner.java:53)
	at org.junit.runners.ParentRunner$2.evaluate(ParentRunner.java:229)
	at org.junit.runners.ParentRunner.run(ParentRunner.java:309)
	at org.junit.runners.Suite.runChild(Suite.java:127)
	at org.junit.runners.Suite.runChild(Suite.java:26)
	at org.junit.runners.ParentRunner$3.run(ParentRunner.java:238)
	at org.junit.runners.ParentRunner$1.schedule(ParentRunner.java:63)
	at org.junit.runners.ParentRunner.runChildren(ParentRunner.java:236)
	at org.junit.runners.ParentRunner.access$000(ParentRunner.java:53)
	at org.junit.runners.ParentRunner$2.evaluate(ParentRunner.java:229)
	at org.junit.runners.ParentRunner.run(ParentRunner.java:309)
	at org.junit.runner.JUnitCore.run(JUnitCore.java:160)
	at org.junit.runner.JUnitCore.run(JUnitCore.java:138)
	at org.apache.maven.surefire.junitcore.JUnitCoreWrapper.createRequestAndRun(JUnitCoreWrapper.java:113)
	at org.apache.maven.surefire.junitcore.JUnitCoreWrapper.executeEager(JUnitCoreWrapper.java:85)
	at org.apache.maven.surefire.junitcore.JUnitCoreWrapper.execute(JUnitCoreWrapper.java:54)
	at org.apache.maven.surefire.junitcore.JUnitCoreProvider.invoke(JUnitCoreProvider.java:134)
	at org.apache.maven.surefire.booter.ForkedBooter.invokeProviderInSameClassLoader(ForkedBooter.java:200)
	at org.apache.maven.surefire.booter.ForkedBooter.runSuitesInProcess(ForkedBooter.java:153)
	at org.apache.maven.surefire.booter.ForkedBooter.main(ForkedBooter.java:103)

shouldCreateJarFileInSystemTempDirectory(org.pitest.mutationtest.tooling.JarCreatingJarFinderTest)  Time elapsed: 0.001 sec  <<< ERROR!
java.lang.UnsupportedOperationException: Tried to retrieve value but had None.
	at org.pitest.functional.Option$None.value(Option.java:27)
	at org.pitest.mutationtest.tooling.JarCreatingJarFinderTest.shouldCreateJarFileInSystemTempDirectory(JarCreatingJarFinderTest.java:89)

shouldSetCanRedefineClasses(org.pitest.mutationtest.tooling.JarCreatingJarFinderTest)  Time elapsed: 0 sec  <<< ERROR!
java.lang.UnsupportedOperationException: Tried to retrieve value but had None.
	at org.pitest.functional.Option$None.value(Option.java:27)
	at org.pitest.mutationtest.tooling.JarCreatingJarFinderTest.getGeneratedManifestAttribute(JarCreatingJarFinderTest.java:135)
	at org.pitest.mutationtest.tooling.JarCreatingJarFinderTest.assertGeneratedManifestEntryEquals(JarCreatingJarFinderTest.java:128)
	at org.pitest.mutationtest.tooling.JarCreatingJarFinderTest.shouldSetCanRedefineClasses(JarCreatingJarFinderTest.java:100)

shouldSetNativeMethodPrefix(org.pitest.mutationtest.tooling.JarCreatingJarFinderTest)  Time elapsed: 0 sec  <<< ERROR!
java.lang.UnsupportedOperationException: Tried to retrieve value but had None.
	at org.pitest.functional.Option$None.value(Option.java:27)
	at org.pitest.mutationtest.tooling.JarCreatingJarFinderTest.getGeneratedManifestAttribute(JarCreatingJarFinderTest.java:135)
	at org.pitest.mutationtest.tooling.JarCreatingJarFinderTest.assertGeneratedManifestEntryEquals(JarCreatingJarFinderTest.java:128)
	at org.pitest.mutationtest.tooling.JarCreatingJarFinderTest.shouldSetNativeMethodPrefix(JarCreatingJarFinderTest.java:106)

Running org.pitest.mutationtest.tooling.SpinnerListenerTest
Tests run: 1, Failures: 0, Errors: 0, Skipped: 0, Time elapsed: 0 sec - in org.pitest.mutationtest.tooling.SpinnerListenerTest
Running org.pitest.mutationtest.verify.DefaultBuildVerifierTest
Tests run: 4, Failures: 0, Errors: 0, Skipped: 0, Time elapsed: 0.002 sec - in org.pitest.mutationtest.verify.DefaultBuildVerifierTest
Running org.pitest.process.KnownLocationJavaExecutableLocatorTest
Tests run: 1, Failures: 0, Errors: 0, Skipped: 0, Time elapsed: 0 sec - in org.pitest.process.KnownLocationJavaExecutableLocatorTest
Running org.pitest.process.WrappingProcessTest
Tests run: 1, Failures: 0, Errors: 0, Skipped: 0, Time elapsed: 0.268 sec - in org.pitest.process.WrappingProcessTest
Running org.pitest.reflection.ReflectionTest
Tests run: 4, Failures: 0, Errors: 0, Skipped: 0, Time elapsed: 0 sec - in org.pitest.reflection.ReflectionTest
Running org.pitest.simpletest.EqualitySetTest
Tests run: 8, Failures: 0, Errors: 0, Skipped: 0, Time elapsed: 0 sec - in org.pitest.simpletest.EqualitySetTest
Running org.pitest.simpletest.NoArgsConstructorInstantiationStrategyTest
Tests run: 2, Failures: 0, Errors: 0, Skipped: 0, Time elapsed: 0 sec - in org.pitest.simpletest.NoArgsConstructorInstantiationStrategyTest
Running org.pitest.simpletest.SignatureEqualityStrategyTest
Tests run: 3, Failures: 0, Errors: 0, Skipped: 0, Time elapsed: 0 sec - in org.pitest.simpletest.SignatureEqualityStrategyTest
Running org.pitest.simpletest.steps.CallStepTest
Tests run: 1, Failures: 0, Errors: 0, Skipped: 0, Time elapsed: 0 sec - in org.pitest.simpletest.steps.CallStepTest
Running org.pitest.simpletest.steps.NoArgsInstantiateStepTest
Tests run: 2, Failures: 0, Errors: 0, Skipped: 0, Time elapsed: 0.001 sec - in org.pitest.simpletest.steps.NoArgsInstantiateStepTest
Running org.pitest.simpletest.TestMethodTest
Tests run: 1, Failures: 0, Errors: 0, Skipped: 0, Time elapsed: 0 sec - in org.pitest.simpletest.TestMethodTest
Running org.pitest.testapi.DescriptionTest
Tests run: 1, Failures: 0, Errors: 0, Skipped: 0, Time elapsed: 0 sec - in org.pitest.testapi.DescriptionTest
Running org.pitest.testapi.execute.ExitingResultCollectorTest
Tests run: 5, Failures: 0, Errors: 0, Skipped: 0, Time elapsed: 0 sec - in org.pitest.testapi.execute.ExitingResultCollectorTest
Running org.pitest.testapi.execute.MultipleTestGroupTest
Tests run: 3, Failures: 0, Errors: 0, Skipped: 0, Time elapsed: 0 sec - in org.pitest.testapi.execute.MultipleTestGroupTest
Running org.pitest.testapi.execute.ResultTypeTest
Tests run: 4, Failures: 0, Errors: 0, Skipped: 0, Time elapsed: 0.001 sec - in org.pitest.testapi.execute.ResultTypeTest
Running org.pitest.testapi.execute.TestPitest
Tests run: 12, Failures: 0, Errors: 0, Skipped: 0, Time elapsed: 0.014 sec - in org.pitest.testapi.execute.TestPitest
Running org.pitest.TestJUnitConfiguration
1
> 1
2
> 2
3
> 3
[AdaptedJUnitTestUnit [clazz=class org.pitest.TestJUnitConfiguration$MarkerTest1, filter=Some(one(org.pitest.TestJUnitConfiguration$MarkerTest1))], AdaptedJUnitTestUnit [clazz=class org.pitest.TestJUnitConfiguration$MarkerTest1, filter=Some(two(org.pitest.TestJUnitConfiguration$MarkerTest1))], AdaptedJUnitTestUnit [clazz=class org.pitest.TestJUnitConfiguration$MarkerTest2, filter=Some(one(org.pitest.TestJUnitConfiguration$MarkerTest2))], AdaptedJUnitTestUnit [clazz=class org.pitest.TestJUnitConfiguration$MarkerTest2, filter=Some(two(org.pitest.TestJUnitConfiguration$MarkerTest2))]]
java.lang.InterruptedException: sleep interrupted
	at java.lang.Thread.sleep(Native Method)
	at org.pitest.TestJUnitConfiguration$TestWithTimeout.testBar(TestJUnitConfiguration.java:262)
	at sun.reflect.NativeMethodAccessorImpl.invoke0(Native Method)
	at sun.reflect.NativeMethodAccessorImpl.invoke(NativeMethodAccessorImpl.java:62)
	at sun.reflect.DelegatingMethodAccessorImpl.invoke(DelegatingMethodAccessorImpl.java:43)
	at java.lang.reflect.Method.invoke(Method.java:497)
	at org.junit.runners.model.FrameworkMethod$1.runReflectiveCall(FrameworkMethod.java:47)
	at org.junit.internal.runners.model.ReflectiveCallable.run(ReflectiveCallable.java:12)
	at org.junit.runners.model.FrameworkMethod.invokeExplosively(FrameworkMethod.java:44)
	at org.junit.internal.runners.statements.InvokeMethod.evaluate(InvokeMethod.java:17)
	at org.junit.internal.runners.statements.FailOnTimeout$StatementThread.run(FailOnTimeout.java:74)
Tests run: 25, Failures: 0, Errors: 0, Skipped: 0, Time elapsed: 0.105 sec - in org.pitest.TestJUnitConfiguration
Running org.pitest.testng.TestNGAdapterTest
Tests run: 6, Failures: 0, Errors: 0, Skipped: 0, Time elapsed: 0.018 sec - in org.pitest.testng.TestNGAdapterTest
Running org.pitest.testng.TestNGConfigurationTest
Tests run: 1, Failures: 0, Errors: 0, Skipped: 0, Time elapsed: 0 sec - in org.pitest.testng.TestNGConfigurationTest
Running org.pitest.testng.TestNGTestClassIdentifierTest
Tests run: 4, Failures: 0, Errors: 0, Skipped: 0, Time elapsed: 0.004 sec - in org.pitest.testng.TestNGTestClassIdentifierTest
Running org.pitest.testng.TestNGTestUnitFinderTest
Tests run: 3, Failures: 0, Errors: 0, Skipped: 0, Time elapsed: 0 sec - in org.pitest.testng.TestNGTestUnitFinderTest
Running org.pitest.testng.TestNGTestUnitTest
[TestNG] Running:
  com.example.testng.HasGroups


===============================================
com.example.testng.HasGroups
Total tests run: 2, Failures: 0, Skips: 0
===============================================

[TestNG] Running:
  com.example.testng.HasGroups


===============================================
com.example.testng.HasGroups
Total tests run: 2, Failures: 0, Skips: 0
===============================================

[TestNG] Running:
  com.example.testng.Passes


===============================================
com.example.testng.Passes
Total tests run: 1, Failures: 0, Skips: 0
===============================================

[TestNG] Running:
  com.example.testng.Passes


===============================================
com.example.testng.Passes
Total tests run: 1, Failures: 0, Skips: 0
===============================================

[TestNG] Running:
  com.example.testng.Passes


===============================================
com.example.testng.Passes
Total tests run: 1, Failures: 0, Skips: 0
===============================================

[TestNG] Running:
  com.example.testng.Fails


===============================================
com.example.testng.Fails
Total tests run: 2, Failures: 1, Skips: 1
===============================================

[TestNG] Running:
  com.example.testng.Passes


===============================================
com.example.testng.Passes
Total tests run: 1, Failures: 0, Skips: 0
===============================================

[TestNG] Running:
  com.example.testng.Fails


===============================================
com.example.testng.Fails
Total tests run: 2, Failures: 1, Skips: 1
===============================================

[TestNG] Running:
  com.example.testng.Fails


===============================================
com.example.testng.Fails
Total tests run: 2, Failures: 1, Skips: 1
===============================================

[TestNG] Running:
  com.example.testng.Passes


===============================================
com.example.testng.Passes
Total tests run: 1, Failures: 0, Skips: 0
===============================================

[TestNG] Running:
  com.example.testng.Fails


===============================================
com.example.testng.Fails
Total tests run: 2, Failures: 1, Skips: 1
===============================================

[TestNG] Running:
  com.example.testng.Passes


===============================================
com.example.testng.Passes
Total tests run: 1, Failures: 0, Skips: 0
===============================================

[TestNG] Running:
  com.example.testng.Skips


===============================================
com.example.testng.Skips
Total tests run: 1, Failures: 0, Skips: 1
===============================================

[TestNG] Running:
  com.example.testng.Skips


===============================================
com.example.testng.Skips
Total tests run: 1, Failures: 0, Skips: 1
===============================================

Tests run: 14, Failures: 0, Errors: 0, Skipped: 0, Time elapsed: 0.19 sec - in org.pitest.testng.TestNGTestUnitTest
Running org.pitest.TestResultTest
Tests run: 1, Failures: 0, Errors: 0, Skipped: 0, Time elapsed: 0 sec - in org.pitest.TestResultTest
Running org.pitest.util.FunctionsTest
Tests run: 6, Failures: 0, Errors: 0, Skipped: 0, Time elapsed: 0.002 sec - in org.pitest.util.FunctionsTest
Running org.pitest.util.GlobTest
Tests run: 9, Failures: 0, Errors: 0, Skipped: 0, Time elapsed: 0.001 sec - in org.pitest.util.GlobTest
Running org.pitest.util.InputStreamLineIterableTest
Tests run: 6, Failures: 0, Errors: 0, Skipped: 0, Time elapsed: 0.002 sec - in org.pitest.util.InputStreamLineIterableTest
Running org.pitest.util.IsolationUtilsTest
Tests run: 4, Failures: 0, Errors: 0, Skipped: 0, Time elapsed: 0.006 sec - in org.pitest.util.IsolationUtilsTest
Running org.pitest.util.MemoryMonitorTest

DUMPING MEMORY INFO

Heap Memory Usage: init = 134217728(131072K) used = 92769720(90595K) committed = 204996608(200192K) max = 1908932608(1864192K)
Non-Heap Memory Usage: init = 2555904(2496K) used = 46559328(45468K) committed = 56164352(54848K) max = -1(-1K)

Name: PS Scavenge
Collection count: 7
Collection time: 94
Memory Pools: 
	PS Eden Space
	PS Survivor Space

Name: PS MarkSweep
Collection count: 1
Collection time: 56
Memory Pools: 
	PS Eden Space
	PS Survivor Space
	PS Old Gen
Memory Pools Info

Name: Code Cache
Usage: init = 2555904(2496K) used = 12689792(12392K) committed = 13959168(13632K) max = 251658240(245760K)
Collection Usage: null
Peak Usage: init = 2555904(2496K) used = 13790144(13466K) committed = 13959168(13632K) max = 251658240(245760K)
Type: Non-heap memory
Memory Manager Names: 
	CodeCacheManager



Name: Metaspace
Usage: init = 0(0K) used = 30041032(29336K) committed = 36175872(35328K) max = -1(-1K)
Collection Usage: null
Peak Usage: init = 0(0K) used = 30041032(29336K) committed = 36175872(35328K) max = -1(-1K)
Type: Non-heap memory
Memory Manager Names: 
	Metaspace Manager



Name: Compressed Class Space
Usage: init = 0(0K) used = 3884864(3793K) committed = 6291456(6144K) max = 1073741824(1048576K)
Collection Usage: null
Peak Usage: init = 0(0K) used = 3884864(3793K) committed = 6291456(6144K) max = 1073741824(1048576K)
Type: Non-heap memory
Memory Manager Names: 
	Metaspace Manager



Name: PS Eden Space
Usage: init = 34078720(33280K) used = 70708688(69051K) committed = 136314880(133120K) max = 692060160(675840K)
Collection Usage: init = 34078720(33280K) used = 0(0K) committed = 136314880(133120K) max = 692060160(675840K)
Peak Usage: init = 34078720(33280K) used = 136314880(133120K) committed = 136314880(133120K) max = 705167360(688640K)
Type: Heap memory
Memory Manager Names: 
	PS MarkSweep
	PS Scavenge



Name: PS Survivor Space
Usage: init = 5242880(5120K) used = 9961472(9728K) committed = 9961472(9728K) max = 9961472(9728K)
Collection Usage: init = 5242880(5120K) used = 9961472(9728K) committed = 9961472(9728K) max = 9961472(9728K)
Peak Usage: init = 5242880(5120K) used = 9961472(9728K) committed = 9961472(9728K) max = 9961472(9728K)
Type: Heap memory
Memory Manager Names: 
	PS MarkSweep
	PS Scavenge



Name: PS Old Gen
Usage: init = 89653248(87552K) used = 12099560(11815K) committed = 58720256(57344K) max = 1431830528(1398272K)
Collection Usage: init = 89653248(87552K) used = 7586224(7408K) committed = 58720256(57344K) max = 1431830528(1398272K)
Peak Usage: init = 89653248(87552K) used = 12099560(11815K) committed = 89653248(87552K) max = 1431830528(1398272K)
Type: Heap memory
Memory Manager Names: 
	PS MarkSweep


Tests run: 1, Failures: 0, Errors: 0, Skipped: 0, Time elapsed: 0.011 sec - in org.pitest.util.MemoryMonitorTest
Running org.pitest.util.SafeDataInputStreamTest
Tests run: 1, Failures: 0, Errors: 0, Skipped: 0, Time elapsed: 0.002 sec - in org.pitest.util.SafeDataInputStreamTest
Running org.pitest.util.ServiceLoaderTest
Tests run: 2, Failures: 0, Errors: 0, Skipped: 0, Time elapsed: 0.004 sec - in org.pitest.util.ServiceLoaderTest
Running org.pitest.util.SocketFinderTest
Tests run: 1, Failures: 0, Errors: 0, Skipped: 0, Time elapsed: 0.119 sec - in org.pitest.util.SocketFinderTest
Running org.pitest.util.SocketReadingCallableTest
Tests run: 4, Failures: 0, Errors: 0, Skipped: 0, Time elapsed: 0.027 sec - in org.pitest.util.SocketReadingCallableTest
Running org.pitest.util.StreamUtilTest
Tests run: 2, Failures: 0, Errors: 0, Skipped: 0, Time elapsed: 0 sec - in org.pitest.util.StreamUtilTest
Running org.pitest.util.StringUtilTest
Tests run: 4, Failures: 0, Errors: 0, Skipped: 0, Time elapsed: 0 sec - in org.pitest.util.StringUtilTest
Running org.pitest.util.TimeSpanTest
Tests run: 4, Failures: 0, Errors: 0, Skipped: 0, Time elapsed: 0 sec - in org.pitest.util.TimeSpanTest

Results :

Failed tests: 
  RepositoryTest.shouldCorrectlyNegotiateClassHierachies:262 null
  DependencyExtractorTest.shouldNotPickUpDependenciesFromFilteredMethods:111->assertCollectionEquals:182 expected:<[org/pitest/dependency/DependencyExtractorTest$Car]> but was:<[]>
  DependencyExtractorTest.shouldTraverseTwoLevelsOfDependenciesWhenDepthIsTwo:90->assertCollectionEquals:182 expected:<[org/pitest/dependency/DependencyExtractorTest$Far, org/pitest/dependency/DependencyExtractorTest$Car, org/pitest/dependency/DependencyExtractorTest$Bar]> but was:<[]>
  DependencyExtractorTest.shouldTraverseUnboundedWhenDepthIsZero:102->assertCollectionEquals:182 expected:<[org/pitest/dependency/DependencyExtractorTest$Far, org/pitest/dependency/DependencyExtractorTest$Car, org/pitest/dependency/DependencyExtractorTest$VeryFar, org/pitest/dependency/DependencyExtractorTest$Bar]> but was:<[]>
  DependencyExtractorTest.shouldFindDependenciesReachedViaClassesNotMatchingFilter:122->assertCollectionEquals:182 expected:<[org/pitest/dependency/DependencyExtractorTest$VeryFar]> but was:<[]>
  DependencyExtractorTest.shouldFindOnlyImmediateDependenciesWhenDepthIsOne:78->assertCollectionEquals:182 expected:<[org/pitest/dependency/DependencyExtractorTest$Car, org/pitest/dependency/DependencyExtractorTest$Bar]> but was:<[]>
  DependencyExtractorTest.shouldHandleCyclicDependencies:133->assertCollectionEquals:182 expected:<[org/pitest/dependency/DependencyExtractorTest$CyclicBar]> but was:<[]>
  OptionTest.someShouldNotHaveNone:77 null
  OptionTest.noneShouldHaveNone:82 null
  JUnitCustomRunnerTestUnitFinderTest.shouldCreateSingleAtomicUnitWhenAnyFieldAnnotatedWithClassRule:283 expected:<1> but was:<2>
  JUnitCustomRunnerTestUnitFinderTest.shouldCreateSingleAtomicUnitWhenAnyMethodAnnotatedWithClassRule:261 expected:<1> but was:<2>
  IncrementalAnalyserTest.shouldStartPreviousTimedOutMutationsAtAStatusOfTimedOutWhenClassHasNotChanged:101 expected:<TIMED_OUT> but was:<NOT_STARTED>
  IncrementalAnalyserTest.shouldStartPreviousSurvivedMutationsAtAStatusOfSurvivedWhenCoverageHasNotChanged:78 expected:<SURVIVED> but was:<NOT_STARTED>
  IncrementalAnalyserTest.shouldStartPreviousKilledMutationsAtAStatusOfNotStartedWhenNeitherClassOrTestHasChanged:119 expected:<KILLED> but was:<NOT_STARTED>
  JarCreatingJarFinderTest.shouldCreateJarFile:82 null
  JarCreatingJarFinderTest.shouldFailOnUnreadableRessources Expected test to throw an instance of org.pitest.util.PitError

Tests in error: 
  JUnitTestClassIdentifierTest.shouldRecogniseAbstractJUnit3ClassesAsTests:71 » UnsupportedOperation
  JUnitTestClassIdentifierTest.shouldRecogniseJUnit3ClassesAsTests:62 » UnsupportedOperation
  JUnitTestClassIdentifierTest.shouldNotRecogniseNonTestClassesAsTests:54 » UnsupportedOperation
  JUnitTestClassIdentifierTest.shouldRecogniseNestedClassesWithTestsAsTestsClasses:102 » UnsupportedOperation
  TestInfoTest.isATestShouldReturnTrueForJUnit3Suites:52 » UnsupportedOperation ...
  TestInfoTest.isWithinATestClassShouldReturnTrueForNestedClassesWithinATest:71 » UnsupportedOperation
  TestInfoTest.isATestShouldReturnFalseForNonTests:62 » UnsupportedOperation Tri...
  TestInfoTest.isATestShouldReturnTrueForJUnit3Tests:44 » UnsupportedOperation T...
  MutationCoverageReportTest.shouldReportMutationsFoundWhenSomeDetected:189->createAndRunTestee:203 » UnsupportedOperation
  IncrementalAnalyserTest.shouldStartNewMutationsAtAStatusOfNotStarted:49 » UnsupportedOperation
  JarCreatingJarFinderTest.shouldAddPITToTheBootClassPath:112->getGeneratedManifestAttribute:135 » UnsupportedOperation
  JarCreatingJarFinderTest.shouldSetPreMainClassAttribute:94->assertGeneratedManifestEntryEquals:128->getGeneratedManifestAttribute:135 » UnsupportedOperation
  JarCreatingJarFinderTest.shouldCreateJarFileInSystemTempDirectory:89 » UnsupportedOperation
  JarCreatingJarFinderTest.shouldSetCanRedefineClasses:100->assertGeneratedManifestEntryEquals:128->getGeneratedManifestAttribute:135 » UnsupportedOperation
  JarCreatingJarFinderTest.shouldSetNativeMethodPrefix:106->assertGeneratedManifestEntryEquals:128->getGeneratedManifestAttribute:135 » UnsupportedOperation

Tests run: 1135, Failures: 16, Errors: 15, Skipped: 1

[INFO] ------------------------------------------------------------------------
[INFO] BUILD FAILURE
[INFO] ------------------------------------------------------------------------
[INFO] Total time: 15.711 s
[INFO] Finished at: 2015-10-06T10:44:50+02:00
[INFO] Final Memory: 23M/301M
[INFO] ------------------------------------------------------------------------
[ERROR] Failed to execute goal org.apache.maven.plugins:maven-surefire-plugin:2.17:test (default-test) on project pitest: There are test failures.
[ERROR] 
[ERROR] Please refer to /Users/aliparsai/Study/LittleDarwin/Cases/pitest-pitest-parent-1.1.7/pitest/target/surefire-reports for the individual test results.
[ERROR] -> [Help 1]
[ERROR] 
[ERROR] To see the full stack trace of the errors, re-run Maven with the -e switch.
[ERROR] Re-run Maven using the -X switch to enable full debug logging.
[ERROR] 
[ERROR] For more information about the errors and possible solutions, please read the following articles:
[ERROR] [Help 1] http://cwiki.apache.org/confluence/display/MAVEN/MojoFailureException
