[INFO] Scanning for projects...
[INFO]                                                                         
[INFO] ------------------------------------------------------------------------
[INFO] Building pitest 1.1.7
[INFO] ------------------------------------------------------------------------
[INFO] 
[INFO] --- maven-resources-plugin:2.6:resources (default-resources) @ pitest ---
[INFO] Using 'UTF-8' encoding to copy filtered resources.
[INFO] Copying 8 resources
[INFO] 
[INFO] --- maven-compiler-plugin:3.1:compile (default-compile) @ pitest ---
[INFO] Changes detected - recompiling the module!
[INFO] Compiling 355 source files to /Users/aliparsai/Study/LittleDarwin/Cases/pitest-pitest-parent-1.1.7/pitest/target/classes
[WARNING] /Users/aliparsai/Study/LittleDarwin/Cases/pitest-pitest-parent-1.1.7/pitest/src/main/java/org/pitest/bytecode/NullVisitor.java: /Users/aliparsai/Study/LittleDarwin/Cases/pitest-pitest-parent-1.1.7/pitest/src/main/java/org/pitest/bytecode/NullVisitor.java uses or overrides a deprecated API.
[WARNING] /Users/aliparsai/Study/LittleDarwin/Cases/pitest-pitest-parent-1.1.7/pitest/src/main/java/org/pitest/bytecode/NullVisitor.java: Recompile with -Xlint:deprecation for details.
[INFO] 
[INFO] --- maven-resources-plugin:2.6:testResources (default-testResources) @ pitest ---
[INFO] Using 'UTF-8' encoding to copy filtered resources.
[INFO] Copying 30 resources
[INFO] 
[INFO] --- maven-compiler-plugin:3.1:testCompile (default-testCompile) @ pitest ---
[INFO] Changes detected - recompiling the module!
[INFO] Compiling 307 source files to /Users/aliparsai/Study/LittleDarwin/Cases/pitest-pitest-parent-1.1.7/pitest/target/test-classes
[WARNING] /Users/aliparsai/Study/LittleDarwin/Cases/pitest-pitest-parent-1.1.7/pitest/src/test/java/org/pitest/TestJUnitConfiguration.java: Some input files use or override a deprecated API.
[WARNING] /Users/aliparsai/Study/LittleDarwin/Cases/pitest-pitest-parent-1.1.7/pitest/src/test/java/org/pitest/TestJUnitConfiguration.java: Recompile with -Xlint:deprecation for details.
[INFO] 
[INFO] --- maven-surefire-plugin:2.17:test (default-test) @ pitest ---
[INFO] Surefire report directory: /Users/aliparsai/Study/LittleDarwin/Cases/pitest-pitest-parent-1.1.7/pitest/target/surefire-reports
[INFO] Using configured provider org.apache.maven.surefire.junitcore.JUnitCoreProvider
[INFO] parallel='none', perCoreThreadCount=true, threadCount=0, useUnlimitedThreads=false, threadCountSuites=0, threadCountClasses=0, threadCountMethods=0, parallelOptimized=true

-------------------------------------------------------
 T E S T S
-------------------------------------------------------
Running org.pitest.bytecode.FrameOptionsTest
Tests run: 8, Failures: 0, Errors: 0, Skipped: 0, Time elapsed: 0.006 sec - in org.pitest.bytecode.FrameOptionsTest
Running org.pitest.classinfo.AddlerHashTest
Tests run: 3, Failures: 0, Errors: 0, Skipped: 0, Time elapsed: 0 sec - in org.pitest.classinfo.AddlerHashTest
Running org.pitest.classinfo.ClassIdentifierTest
Tests run: 1, Failures: 0, Errors: 0, Skipped: 0, Time elapsed: 0.186 sec - in org.pitest.classinfo.ClassIdentifierTest
Running org.pitest.classinfo.ClassInfoTest
Tests run: 5, Failures: 0, Errors: 0, Skipped: 0, Time elapsed: 0.008 sec - in org.pitest.classinfo.ClassInfoTest
Running org.pitest.classinfo.ClassInfoVisitorTest
Tests run: 8, Failures: 0, Errors: 0, Skipped: 0, Time elapsed: 0.041 sec - in org.pitest.classinfo.ClassInfoVisitorTest
Running org.pitest.classinfo.ClassNameTest
9:45:29 AM PIT >> WARNING : Could not load org.unknown.Unknown (ClassNotFoundException: org.unknown.Unknown)
Tests run: 20, Failures: 0, Errors: 0, Skipped: 0, Time elapsed: 0.133 sec - in org.pitest.classinfo.ClassNameTest
Running org.pitest.classinfo.ComputeClassWriterTest
Tests run: 10, Failures: 0, Errors: 0, Skipped: 0, Time elapsed: 0.014 sec - in org.pitest.classinfo.ComputeClassWriterTest
Running org.pitest.classinfo.HierarchicalClassIdTest
Tests run: 1, Failures: 0, Errors: 0, Skipped: 0, Time elapsed: 0.017 sec - in org.pitest.classinfo.HierarchicalClassIdTest
Running org.pitest.classinfo.NameToClassInfoTest
Tests run: 1, Failures: 0, Errors: 0, Skipped: 0, Time elapsed: 0.1 sec - in org.pitest.classinfo.NameToClassInfoTest
Running org.pitest.classinfo.RepositoryTest
Tests run: 26, Failures: 0, Errors: 0, Skipped: 0, Time elapsed: 0.082 sec - in org.pitest.classinfo.RepositoryTest
Running org.pitest.classinfo.TestToClassMapperTest
Tests run: 3, Failures: 0, Errors: 0, Skipped: 0, Time elapsed: 0.001 sec - in org.pitest.classinfo.TestToClassMapperTest
Running org.pitest.classpath.ArchiveClassPathRootTest
Tests run: 6, Failures: 1, Errors: 2, Skipped: 0, Time elapsed: 0.011 sec <<< FAILURE! - in org.pitest.classpath.ArchiveClassPathRootTest
getDataShouldReturnNullForUnknownClass(org.pitest.classpath.ArchiveClassPathRootTest)  Time elapsed: 0.007 sec  <<< ERROR!
java.lang.NullPointerException: entry
	at java.util.zip.ZipFile.getInputStream(ZipFile.java:346)
	at org.pitest.classpath.ArchiveClassPathRoot.getData(ArchiveClassPathRoot.java:28)
	at org.pitest.classpath.ArchiveClassPathRootTest.getDataShouldReturnNullForUnknownClass(ArchiveClassPathRootTest.java:54)

getDataShouldReturnInputStreamForAKnownClass(org.pitest.classpath.ArchiveClassPathRootTest)  Time elapsed: 0.001 sec  <<< FAILURE!
java.lang.AssertionError: null
	at org.junit.Assert.fail(Assert.java:86)
	at org.junit.Assert.assertTrue(Assert.java:41)
	at org.junit.Assert.assertNotNull(Assert.java:621)
	at org.junit.Assert.assertNotNull(Assert.java:631)
	at org.pitest.classpath.ArchiveClassPathRootTest.getDataShouldReturnInputStreamForAKnownClass(ArchiveClassPathRootTest.java:59)

shouldReturnAReadableInputStream(org.pitest.classpath.ArchiveClassPathRootTest)  Time elapsed: 0.001 sec  <<< ERROR!
java.lang.NullPointerException: null
	at org.pitest.classpath.ArchiveClassPathRootTest.shouldReturnAReadableInputStream(ArchiveClassPathRootTest.java:67)

Running org.pitest.classpath.ClassPathTest
Tests run: 4, Failures: 0, Errors: 0, Skipped: 0, Time elapsed: 0.016 sec - in org.pitest.classpath.ClassPathTest
Running org.pitest.classpath.CodeSourceTest
Tests run: 11, Failures: 0, Errors: 0, Skipped: 0, Time elapsed: 0.026 sec - in org.pitest.classpath.CodeSourceTest
Running org.pitest.classpath.CompoundClassPathRootTest
Tests run: 5, Failures: 0, Errors: 0, Skipped: 0, Time elapsed: 0.026 sec - in org.pitest.classpath.CompoundClassPathRootTest
Running org.pitest.classpath.DirectoryClassPathRootTest
Tests run: 2, Failures: 0, Errors: 0, Skipped: 0, Time elapsed: 0.026 sec - in org.pitest.classpath.DirectoryClassPathRootTest
Running org.pitest.classpath.OtherClassLoaderClassPathRootTest
Tests run: 3, Failures: 0, Errors: 0, Skipped: 0, Time elapsed: 0.001 sec - in org.pitest.classpath.OtherClassLoaderClassPathRootTest
Running org.pitest.containers.TestContainersSendCorrectNotifications
Tests run: 2, Failures: 0, Errors: 0, Skipped: 0, Time elapsed: 0.026 sec - in org.pitest.containers.TestContainersSendCorrectNotifications
Running org.pitest.coverage.analysis.BlockTest
Tests run: 1, Failures: 0, Errors: 0, Skipped: 0, Time elapsed: 0.075 sec - in org.pitest.coverage.analysis.BlockTest
Running org.pitest.coverage.BlockLocationTest
Tests run: 1, Failures: 0, Errors: 0, Skipped: 0, Time elapsed: 0.011 sec - in org.pitest.coverage.BlockLocationTest
Running org.pitest.coverage.ClassLineTest
Tests run: 1, Failures: 0, Errors: 0, Skipped: 0, Time elapsed: 0.009 sec - in org.pitest.coverage.ClassLineTest
Running org.pitest.coverage.codeassist.CoverageClassVisitorTest
Tests run: 1, Failures: 0, Errors: 0, Skipped: 0, Time elapsed: 0.022 sec - in org.pitest.coverage.codeassist.CoverageClassVisitorTest
Running org.pitest.coverage.codeassist.LineMapperTest
Tests run: 6, Failures: 0, Errors: 0, Skipped: 0, Time elapsed: 0.022 sec - in org.pitest.coverage.codeassist.LineMapperTest
Running org.pitest.coverage.CoverageDataTest
9:45:29 AM PIT >> WARNING : Description [testClass=null, name=fooTest] did not pass without mutation.
Tests run: 16, Failures: 0, Errors: 0, Skipped: 0, Time elapsed: 0.073 sec - in org.pitest.coverage.CoverageDataTest
Running org.pitest.coverage.CoverageResultTest
Tests run: 3, Failures: 0, Errors: 0, Skipped: 0, Time elapsed: 0.001 sec - in org.pitest.coverage.CoverageResultTest
Running org.pitest.coverage.CoverageSummaryTest
Tests run: 4, Failures: 0, Errors: 0, Skipped: 0, Time elapsed: 0 sec - in org.pitest.coverage.CoverageSummaryTest
Running org.pitest.coverage.CoverageTransformerTest
Tests run: 3, Failures: 0, Errors: 0, Skipped: 0, Time elapsed: 0.464 sec - in org.pitest.coverage.CoverageTransformerTest
Running org.pitest.coverage.execute.DependencyFilterTest
Tests run: 3, Failures: 0, Errors: 0, Skipped: 0, Time elapsed: 0.007 sec - in org.pitest.coverage.execute.DependencyFilterTest
Running org.pitest.coverage.execute.ReceiveTest
Tests run: 3, Failures: 0, Errors: 0, Skipped: 0, Time elapsed: 0.011 sec - in org.pitest.coverage.execute.ReceiveTest
Running org.pitest.coverage.execute.SendDataTest
9:45:30 AM PIT >> INFO : Sending 0 test classes to slave
9:45:30 AM PIT >> INFO : Sent tests to slave
9:45:30 AM PIT >> INFO : Sending 2 test classes to slave
9:45:30 AM PIT >> INFO : Sent tests to slave
Tests run: 2, Failures: 0, Errors: 0, Skipped: 0, Time elapsed: 0.012 sec - in org.pitest.coverage.execute.SendDataTest
Running org.pitest.coverage.export.DefaultCoverageExporterTest
Tests run: 2, Failures: 0, Errors: 0, Skipped: 0, Time elapsed: 0.015 sec - in org.pitest.coverage.export.DefaultCoverageExporterTest
Running org.pitest.coverage.TestInfoNameComparatorTest
Tests run: 2, Failures: 0, Errors: 0, Skipped: 0, Time elapsed: 0.002 sec - in org.pitest.coverage.TestInfoNameComparatorTest
Running org.pitest.coverage.TestInfoTest
Tests run: 1, Failures: 0, Errors: 0, Skipped: 0, Time elapsed: 0.024 sec - in org.pitest.coverage.TestInfoTest
Running org.pitest.dependency.DependencyAccessTest
Tests run: 1, Failures: 0, Errors: 0, Skipped: 0, Time elapsed: 0.015 sec - in org.pitest.dependency.DependencyAccessTest
Running org.pitest.dependency.DependencyClassVisitorTest
Tests run: 3, Failures: 0, Errors: 0, Skipped: 0, Time elapsed: 0.018 sec - in org.pitest.dependency.DependencyClassVisitorTest
Running org.pitest.dependency.DependencyExtractorTest
Tests run: 6, Failures: 0, Errors: 0, Skipped: 0, Time elapsed: 0.026 sec - in org.pitest.dependency.DependencyExtractorTest
Running org.pitest.dependency.IgnoreCoreClassesTest
Tests run: 7, Failures: 0, Errors: 0, Skipped: 0, Time elapsed: 0.005 sec - in org.pitest.dependency.IgnoreCoreClassesTest
Running org.pitest.functional.FArrayTest
Tests run: 9, Failures: 0, Errors: 0, Skipped: 0, Time elapsed: 0.01 sec - in org.pitest.functional.FArrayTest
Running org.pitest.functional.FCollectionTest
Tests run: 18, Failures: 0, Errors: 0, Skipped: 0, Time elapsed: 0.01 sec - in org.pitest.functional.FCollectionTest
Running org.pitest.functional.MutableListTest
Tests run: 28, Failures: 0, Errors: 0, Skipped: 0, Time elapsed: 0.028 sec - in org.pitest.functional.MutableListTest
Running org.pitest.functional.OptionTest
Tests run: 21, Failures: 0, Errors: 0, Skipped: 0, Time elapsed: 0.039 sec - in org.pitest.functional.OptionTest
Running org.pitest.functional.predicate.AndTest
Tests run: 6, Failures: 0, Errors: 0, Skipped: 0, Time elapsed: 0.004 sec - in org.pitest.functional.predicate.AndTest
Running org.pitest.functional.predicate.FalseTest
Tests run: 1, Failures: 0, Errors: 0, Skipped: 0, Time elapsed: 0 sec - in org.pitest.functional.predicate.FalseTest
Running org.pitest.functional.predicate.NotTest
Tests run: 2, Failures: 0, Errors: 0, Skipped: 0, Time elapsed: 0 sec - in org.pitest.functional.predicate.NotTest
Running org.pitest.functional.predicate.OrTest
Tests run: 6, Failures: 0, Errors: 0, Skipped: 0, Time elapsed: 0 sec - in org.pitest.functional.predicate.OrTest
Running org.pitest.functional.predicate.TrueTest
Tests run: 1, Failures: 0, Errors: 0, Skipped: 0, Time elapsed: 0 sec - in org.pitest.functional.predicate.TrueTest
Running org.pitest.functional.prelude.PreludeTest
Tests run: 5, Failures: 0, Errors: 0, Skipped: 0, Time elapsed: 0.012 sec - in org.pitest.functional.prelude.PreludeTest
Running org.pitest.help.PitHelpErrorTest
Tests run: 1, Failures: 0, Errors: 0, Skipped: 0, Time elapsed: 0 sec - in org.pitest.help.PitHelpErrorTest
Running org.pitest.junit.adapter.AdaptedJUnitTestUnitTest
Tests run: 6, Failures: 0, Errors: 0, Skipped: 0, Time elapsed: 0.081 sec - in org.pitest.junit.adapter.AdaptedJUnitTestUnitTest
Running org.pitest.junit.adapter.AdaptingRunListenerTest
Tests run: 6, Failures: 0, Errors: 0, Skipped: 0, Time elapsed: 0.007 sec - in org.pitest.junit.adapter.AdaptingRunListenerTest
Running org.pitest.junit.adapter.CustomRunnerExecutorTest
Tests run: 1, Failures: 0, Errors: 0, Skipped: 0, Time elapsed: 0.003 sec - in org.pitest.junit.adapter.CustomRunnerExecutorTest
Running org.pitest.junit.adapter.ForeignClassLoaderAdaptingRunListenerTest
Tests run: 6, Failures: 0, Errors: 0, Skipped: 0, Time elapsed: 0.088 sec - in org.pitest.junit.adapter.ForeignClassLoaderAdaptingRunListenerTest
Running org.pitest.junit.JUnit4SuiteFinderTest
Tests run: 2, Failures: 0, Errors: 0, Skipped: 0, Time elapsed: 0.003 sec - in org.pitest.junit.JUnit4SuiteFinderTest
Running org.pitest.junit.JUnitCompatibleConfigurationTest
Tests run: 4, Failures: 0, Errors: 0, Skipped: 0, Time elapsed: 0.008 sec - in org.pitest.junit.JUnitCompatibleConfigurationTest
Running org.pitest.junit.JUnitCustomRunnerTestUnitFinderTest
Tests run: 14, Failures: 0, Errors: 0, Skipped: 0, Time elapsed: 0.073 sec - in org.pitest.junit.JUnitCustomRunnerTestUnitFinderTest
Running org.pitest.junit.JUnitTestClassIdentifierTest
Tests run: 11, Failures: 0, Errors: 0, Skipped: 0, Time elapsed: 0.026 sec - in org.pitest.junit.JUnitTestClassIdentifierTest
Running org.pitest.junit.ParameterisedJUnitTestFinderTest
Tests run: 2, Failures: 0, Errors: 0, Skipped: 0, Time elapsed: 0.003 sec - in org.pitest.junit.ParameterisedJUnitTestFinderTest
Running org.pitest.junit.RunnerSuiteFinderTest
Tests run: 5, Failures: 0, Errors: 0, Skipped: 0, Time elapsed: 0.011 sec - in org.pitest.junit.RunnerSuiteFinderTest
Running org.pitest.junit.TestInfoTest
Tests run: 5, Failures: 0, Errors: 0, Skipped: 0, Time elapsed: 0.009 sec - in org.pitest.junit.TestInfoTest
Running org.pitest.mutationtest.build.AnalyisPriorityComparatorTest
Tests run: 2, Failures: 0, Errors: 0, Skipped: 0, Time elapsed: 0.001 sec - in org.pitest.mutationtest.build.AnalyisPriorityComparatorTest
Running org.pitest.mutationtest.build.DefaultGrouperTest
Tests run: 3, Failures: 0, Errors: 0, Skipped: 0, Time elapsed: 0.007 sec - in org.pitest.mutationtest.build.DefaultGrouperTest
Running org.pitest.mutationtest.build.DefaultTestPrioritiserTest
9:45:30 AM PIT >> WARNING : Using untargetted tests
Tests run: 3, Failures: 0, Errors: 0, Skipped: 0, Time elapsed: 0.009 sec - in org.pitest.mutationtest.build.DefaultTestPrioritiserTest
Running org.pitest.mutationtest.build.KnownStatusMutationTestUnitTest
Tests run: 2, Failures: 0, Errors: 0, Skipped: 0, Time elapsed: 0.002 sec - in org.pitest.mutationtest.build.KnownStatusMutationTestUnitTest
Running org.pitest.mutationtest.build.MutationSourceTest
Tests run: 2, Failures: 0, Errors: 0, Skipped: 0, Time elapsed: 0.013 sec - in org.pitest.mutationtest.build.MutationSourceTest
Running org.pitest.mutationtest.build.MutationTestBuilderTest
Tests run: 5, Failures: 0, Errors: 0, Skipped: 0, Time elapsed: 0.02 sec - in org.pitest.mutationtest.build.MutationTestBuilderTest
Running org.pitest.mutationtest.build.MutationTestUnitTest
Tests run: 2, Failures: 0, Errors: 0, Skipped: 0, Time elapsed: 0.02 sec - in org.pitest.mutationtest.build.MutationTestUnitTest
Running org.pitest.mutationtest.build.PercentAndConstantTimeoutStrategyTest
Tests run: 1, Failures: 0, Errors: 0, Skipped: 0, Time elapsed: 0 sec - in org.pitest.mutationtest.build.PercentAndConstantTimeoutStrategyTest
Running org.pitest.mutationtest.build.TestInfoPriorisationComparatorTest
Tests run: 3, Failures: 0, Errors: 0, Skipped: 0, Time elapsed: 0 sec - in org.pitest.mutationtest.build.TestInfoPriorisationComparatorTest
Running org.pitest.mutationtest.commandline.MutationCoverageReportTest
9:45:30 AM PIT >> INFO : Verbose logging is disabled. If you encounter an problem please enable it before reporting an issue.
9:45:30 AM PIT >> INFO : Created  0 mutation test units
9:45:30 AM PIT >> WARNING : No mutations found. This probably means there is an issue with either the supplied classpath or filters.
See http://pitest.org for more details.
9:45:30 AM PIT >> INFO : Completed in 0 seconds
================================================================================
- Timings
================================================================================
> build mutation tests : < 1 second
> run mutation analysis : < 1 second
--------------------------------------------------------------------------------
> Total  : < 1 second
--------------------------------------------------------------------------------
================================================================================
- Statistics
================================================================================
>> Generated 0 mutations Killed 0 (100%)
>> Ran 0 tests (0 tests per mutation)
================================================================================
- Mutators
================================================================================
9:45:30 AM PIT >> INFO : Verbose logging is disabled. If you encounter an problem please enable it before reporting an issue.
9:45:30 AM PIT >> INFO : Created  1 mutation test units
/9:45:30 AM PIT >> INFO : Completed in 0 seconds
================================================================================
- Timings
================================================================================
> build mutation tests : < 1 second
> run mutation analysis : < 1 second
--------------------------------------------------------------------------------
> Total  : < 1 second
--------------------------------------------------------------------------------
================================================================================
- Statistics
================================================================================
>> Generated 1 mutations Killed 0 (0%)
>> Ran 0 tests (0 tests per mutation)
================================================================================
- Mutators
================================================================================
> mutator
>> Generated 1 Killed 0 (0%)
> KILLED 0 SURVIVED 0 TIMED_OUT 0 NON_VIABLE 0 
> MEMORY_ERROR 0 NOT_STARTED 0 STARTED 0 RUN_ERROR 0 
> NO_COVERAGE 1 
--------------------------------------------------------------------------------
9:45:30 AM PIT >> INFO : Verbose logging is disabled. If you encounter an problem please enable it before reporting an issue.
9:45:30 AM PIT >> INFO : Created  0 mutation test units
9:45:30 AM PIT >> WARNING : No mutations found. This probably means there is an issue with either the supplied classpath or filters.
See http://pitest.org for more details.
9:45:30 AM PIT >> INFO : Completed in 0 seconds
================================================================================
- Timings
================================================================================
> build mutation tests : < 1 second
> run mutation analysis : < 1 second
--------------------------------------------------------------------------------
> Total  : < 1 second
--------------------------------------------------------------------------------
================================================================================
- Statistics
================================================================================
>> Generated 0 mutations Killed 0 (100%)
>> Ran 0 tests (0 tests per mutation)
================================================================================
- Mutators
================================================================================
9:45:30 AM PIT >> INFO : Verbose logging is disabled. If you encounter an problem please enable it before reporting an issue.
9:45:30 AM PIT >> INFO : Created  0 mutation test units
9:45:30 AM PIT >> INFO : Verbose logging is disabled. If you encounter an problem please enable it before reporting an issue.
9:45:30 AM PIT >> INFO : Created  0 mutation test units
9:45:30 AM PIT >> WARNING : No mutations found. This probably means there is an issue with either the supplied classpath or filters.
See http://pitest.org for more details.
9:45:30 AM PIT >> INFO : Completed in 0 seconds
================================================================================
- Timings
================================================================================
> build mutation tests : < 1 second
> run mutation analysis : < 1 second
--------------------------------------------------------------------------------
> Total  : < 1 second
--------------------------------------------------------------------------------
================================================================================
- Statistics
================================================================================
>> Generated 0 mutations Killed 0 (100%)
>> Ran 0 tests (0 tests per mutation)
================================================================================
- Mutators
================================================================================
9:45:30 AM PIT >> INFO : Verbose logging is disabled. If you encounter an problem please enable it before reporting an issue.
9:45:30 AM PIT >> INFO : Created  0 mutation test units
9:45:30 AM PIT >> WARNING : No mutations found. This probably means there is an issue with either the supplied classpath or filters.
See http://pitest.org for more details.
9:45:30 AM PIT >> INFO : Completed in 0 seconds
================================================================================
- Timings
================================================================================
> build mutation tests : < 1 second
> run mutation analysis : < 1 second
--------------------------------------------------------------------------------
> Total  : < 1 second
--------------------------------------------------------------------------------
================================================================================
- Statistics
================================================================================
>> Generated 0 mutations Killed 0 (100%)
>> Ran 0 tests (0 tests per mutation)
================================================================================
- Mutators
================================================================================
Tests run: 6, Failures: 0, Errors: 0, Skipped: 0, Time elapsed: 0.079 sec - in org.pitest.mutationtest.commandline.MutationCoverageReportTest
Running org.pitest.mutationtest.config.CompoundConfigurationTest
Tests run: 7, Failures: 0, Errors: 0, Skipped: 0, Time elapsed: 0.027 sec - in org.pitest.mutationtest.config.CompoundConfigurationTest
Running org.pitest.mutationtest.config.CompoundListenerFactoryTest
Tests run: 1, Failures: 0, Errors: 0, Skipped: 0, Time elapsed: 0.002 sec - in org.pitest.mutationtest.config.CompoundListenerFactoryTest
Running org.pitest.mutationtest.config.CompoundTestClassIdentifierTest
Tests run: 3, Failures: 0, Errors: 0, Skipped: 0, Time elapsed: 0.002 sec - in org.pitest.mutationtest.config.CompoundTestClassIdentifierTest
Running org.pitest.mutationtest.config.CompoundTestListenerTest
Tests run: 3, Failures: 0, Errors: 0, Skipped: 0, Time elapsed: 0.001 sec - in org.pitest.mutationtest.config.CompoundTestListenerTest
Running org.pitest.mutationtest.config.ConfigurationFactoryTest
Tests run: 6, Failures: 0, Errors: 0, Skipped: 0, Time elapsed: 0.039 sec - in org.pitest.mutationtest.config.ConfigurationFactoryTest
Running org.pitest.mutationtest.config.DefaultCodePathPredicateTest
Tests run: 5, Failures: 0, Errors: 0, Skipped: 0, Time elapsed: 0 sec - in org.pitest.mutationtest.config.DefaultCodePathPredicateTest
Running org.pitest.mutationtest.config.DefaultDependencyPathPredicateTest
Tests run: 2, Failures: 0, Errors: 0, Skipped: 0, Time elapsed: 0 sec - in org.pitest.mutationtest.config.DefaultDependencyPathPredicateTest
Running org.pitest.mutationtest.config.PathNamePredicateTest
Tests run: 2, Failures: 0, Errors: 0, Skipped: 0, Time elapsed: 0 sec - in org.pitest.mutationtest.config.PathNamePredicateTest
Running org.pitest.mutationtest.config.PluginServicesTest
Tests run: 3, Failures: 0, Errors: 0, Skipped: 0, Time elapsed: 0.003 sec - in org.pitest.mutationtest.config.PluginServicesTest
Running org.pitest.mutationtest.config.ReportOptionsTest
Tests run: 1, Failures: 0, Errors: 0, Skipped: 0, Time elapsed: 0.002 sec - in org.pitest.mutationtest.config.ReportOptionsTest
Running org.pitest.mutationtest.config.SettingsFactoryTest
Tests run: 12, Failures: 0, Errors: 3, Skipped: 0, Time elapsed: 0.018 sec <<< FAILURE! - in org.pitest.mutationtest.config.SettingsFactoryTest
shouldNotAllowUserToCalculateCoverageForCoverageImplementation(org.pitest.mutationtest.config.SettingsFactoryTest)  Time elapsed: 0.003 sec  <<< ERROR!
java.lang.NullPointerException: entry
	at java.util.zip.ZipFile.getInputStream(ZipFile.java:346)
	at org.pitest.classpath.ArchiveClassPathRoot.getData(ArchiveClassPathRoot.java:28)
	at org.pitest.classpath.CompoundClassPathRoot.getData(CompoundClassPathRoot.java:27)
	at org.pitest.classpath.ClassPath.getClassData(ClassPath.java:101)
	at org.pitest.classpath.ClassPathByteArraySource.getBytes(ClassPathByteArraySource.java:41)
	at org.pitest.classinfo.Repository.querySource(Repository.java:82)
	at org.pitest.classinfo.Repository.nameToClassInfo(Repository.java:68)
	at org.pitest.classinfo.Repository.fetchClass(Repository.java:60)
	at org.pitest.mutationtest.config.ConfigurationFactory.createConfiguration(ConfigurationFactory.java:45)
	at org.pitest.mutationtest.config.LegacyTestFrameworkPlugin.createTestFrameworkConfiguration(LegacyTestFrameworkPlugin.java:36)
	at org.pitest.mutationtest.config.SettingsFactory.getTestFrameworkPlugin(SettingsFactory.java:132)
	at org.pitest.mutationtest.config.SettingsFactory.createCoverageOptions(SettingsFactory.java:140)
	at org.pitest.mutationtest.config.SettingsFactoryTest.shouldNotAllowUserToCalculateCoverageForCoverageImplementation(SettingsFactoryTest.java:102)

shouldReturnTheLegacyTestFrameworkPluginWhenNoOtherOnClasspath(org.pitest.mutationtest.config.SettingsFactoryTest)  Time elapsed: 0.001 sec  <<< ERROR!
java.lang.NullPointerException: entry
	at java.util.zip.ZipFile.getInputStream(ZipFile.java:346)
	at org.pitest.classpath.ArchiveClassPathRoot.getData(ArchiveClassPathRoot.java:28)
	at org.pitest.classpath.CompoundClassPathRoot.getData(CompoundClassPathRoot.java:27)
	at org.pitest.classpath.ClassPath.getClassData(ClassPath.java:101)
	at org.pitest.classpath.ClassPathByteArraySource.getBytes(ClassPathByteArraySource.java:41)
	at org.pitest.classinfo.Repository.querySource(Repository.java:82)
	at org.pitest.classinfo.Repository.nameToClassInfo(Repository.java:68)
	at org.pitest.classinfo.Repository.fetchClass(Repository.java:60)
	at org.pitest.mutationtest.config.ConfigurationFactory.createConfiguration(ConfigurationFactory.java:45)
	at org.pitest.mutationtest.config.LegacyTestFrameworkPlugin.createTestFrameworkConfiguration(LegacyTestFrameworkPlugin.java:36)
	at org.pitest.mutationtest.config.SettingsFactory.getTestFrameworkPlugin(SettingsFactory.java:132)
	at org.pitest.mutationtest.config.SettingsFactoryTest.shouldReturnTheLegacyTestFrameworkPluginWhenNoOtherOnClasspath(SettingsFactoryTest.java:36)

shouldNotAllowUserToCalculateCoverageForCoreClasses(org.pitest.mutationtest.config.SettingsFactoryTest)  Time elapsed: 0.002 sec  <<< ERROR!
java.lang.NullPointerException: entry
	at java.util.zip.ZipFile.getInputStream(ZipFile.java:346)
	at org.pitest.classpath.ArchiveClassPathRoot.getData(ArchiveClassPathRoot.java:28)
	at org.pitest.classpath.CompoundClassPathRoot.getData(CompoundClassPathRoot.java:27)
	at org.pitest.classpath.ClassPath.getClassData(ClassPath.java:101)
	at org.pitest.classpath.ClassPathByteArraySource.getBytes(ClassPathByteArraySource.java:41)
	at org.pitest.classinfo.Repository.querySource(Repository.java:82)
	at org.pitest.classinfo.Repository.nameToClassInfo(Repository.java:68)
	at org.pitest.classinfo.Repository.fetchClass(Repository.java:60)
	at org.pitest.mutationtest.config.ConfigurationFactory.createConfiguration(ConfigurationFactory.java:45)
	at org.pitest.mutationtest.config.LegacyTestFrameworkPlugin.createTestFrameworkConfiguration(LegacyTestFrameworkPlugin.java:36)
	at org.pitest.mutationtest.config.SettingsFactory.getTestFrameworkPlugin(SettingsFactory.java:132)
	at org.pitest.mutationtest.config.SettingsFactory.createCoverageOptions(SettingsFactory.java:140)
	at org.pitest.mutationtest.config.SettingsFactoryTest.shouldNotAllowUserToCalculateCoverageForCoreClasses(SettingsFactoryTest.java:94)

Running org.pitest.mutationtest.DetectionStatusTest
Tests run: 12, Failures: 0, Errors: 0, Skipped: 0, Time elapsed: 0 sec - in org.pitest.mutationtest.DetectionStatusTest
Running org.pitest.mutationtest.engine.gregor.analysis.InstructionTrackingMethodVisitorTest
Tests run: 3, Failures: 0, Errors: 0, Skipped: 0, Time elapsed: 0.004 sec - in org.pitest.mutationtest.engine.gregor.analysis.InstructionTrackingMethodVisitorTest
Running org.pitest.mutationtest.engine.gregor.AvoidAssertsMethodAdapterTest
Tests run: 31, Failures: 0, Errors: 0, Skipped: 0, Time elapsed: 0.065 sec - in org.pitest.mutationtest.engine.gregor.AvoidAssertsMethodAdapterTest
Running org.pitest.mutationtest.engine.gregor.blocks.BlockTrackingMethodDecoratorTest
Tests run: 40, Failures: 0, Errors: 0, Skipped: 0, Time elapsed: 0.029 sec - in org.pitest.mutationtest.engine.gregor.blocks.BlockTrackingMethodDecoratorTest
Running org.pitest.mutationtest.engine.gregor.blocks.ConcreteBlockCounterTest
Tests run: 2, Failures: 0, Errors: 0, Skipped: 0, Time elapsed: 0.001 sec - in org.pitest.mutationtest.engine.gregor.blocks.ConcreteBlockCounterTest
Running org.pitest.mutationtest.engine.gregor.ClassInfoTest
Tests run: 3, Failures: 0, Errors: 0, Skipped: 0, Time elapsed: 0.001 sec - in org.pitest.mutationtest.engine.gregor.ClassInfoTest
Running org.pitest.mutationtest.engine.gregor.config.MutatorTest
Tests run: 4, Failures: 0, Errors: 0, Skipped: 0, Time elapsed: 0.02 sec - in org.pitest.mutationtest.engine.gregor.config.MutatorTest
Running org.pitest.mutationtest.engine.gregor.GregorMutationEngineTest
Tests run: 1, Failures: 0, Errors: 0, Skipped: 0, Time elapsed: 0.001 sec - in org.pitest.mutationtest.engine.gregor.GregorMutationEngineTest
Running org.pitest.mutationtest.engine.gregor.inlinedcode.InlinedFinallyBlockDetectorTest
9:45:31 AM PIT >> WARNING : Found more than one mutation similar on same line in a finally block. Can't correct for inlining.
Tests run: 4, Failures: 0, Errors: 0, Skipped: 0, Time elapsed: 0.004 sec - in org.pitest.mutationtest.engine.gregor.inlinedcode.InlinedFinallyBlockDetectorTest
Running org.pitest.mutationtest.engine.gregor.inlinedcode.NoInlinedCodeDetectionTest
Tests run: 1, Failures: 0, Errors: 0, Skipped: 0, Time elapsed: 0 sec - in org.pitest.mutationtest.engine.gregor.inlinedcode.NoInlinedCodeDetectionTest
Running org.pitest.mutationtest.engine.gregor.LineFilterMethodAdapterTest
Tests run: 25, Failures: 0, Errors: 0, Skipped: 0, Time elapsed: 0.038 sec - in org.pitest.mutationtest.engine.gregor.LineFilterMethodAdapterTest
Running org.pitest.mutationtest.engine.gregor.MethodInfoTest
Tests run: 18, Failures: 0, Errors: 0, Skipped: 0, Time elapsed: 0.003 sec - in org.pitest.mutationtest.engine.gregor.MethodInfoTest
Running org.pitest.mutationtest.engine.gregor.mutators.ArgumentPropagationMutatorTest
Tests run: 13, Failures: 0, Errors: 4, Skipped: 0, Time elapsed: 0.198 sec <<< FAILURE! - in org.pitest.mutationtest.engine.gregor.mutators.ArgumentPropagationMutatorTest
alsoReplaceCallToMethodWhenReturnValueIsNotUsed(org.pitest.mutationtest.engine.gregor.mutators.ArgumentPropagationMutatorTest)  Time elapsed: 0.073 sec  <<< ERROR!
org.pitest.util.PitError: entry : entry
---- Debugging information ----
message             : entry
cause-exception     : java.lang.NullPointerException
cause-message       : entry
class               : org.pitest.mutationtest.engine.gregor.mutators.ArgumentPropagationMutatorTest$ReturnValueNotUsed
required-type       : org.pitest.mutationtest.engine.gregor.mutators.ArgumentPropagationMutatorTest$ReturnValueNotUsed
converter-type      : com.thoughtworks.xstream.converters.reflection.ReflectionConverter
path                : /org.pitest.mutationtest.engine.gregor.mutators.ArgumentPropagationMutatorTest$ReturnValueNotUsed/outer-class
line number         : 1
version             : 1.4.8
-------------------------------

Please copy and paste the information and the complete stacktrace below when reporting an issue
VM : Java HotSpot(TM) 64-Bit Server VM
Vendor : Oracle Corporation
Version : 25.60-b23
Uptime : 3243
Input -> 
BootClassPathSupported : true

	at java.util.zip.ZipFile.getInputStream(ZipFile.java:346)
	at org.pitest.classpath.ArchiveClassPathRoot.getData(ArchiveClassPathRoot.java:28)
	at org.pitest.classpath.CompoundClassPathRoot.getData(CompoundClassPathRoot.java:27)
	at org.pitest.classpath.ClassPath.getClassData(ClassPath.java:101)
	at org.pitest.mutationtest.execute.DefaultPITClassloader.findClass(DefaultPITClassloader.java:37)
	at java.lang.ClassLoader.loadClass(ClassLoader.java:424)
	at java.lang.ClassLoader.loadClass(ClassLoader.java:357)
	at java.lang.Class.getDeclaredFields0(Native Method)
	at java.lang.Class.privateGetDeclaredFields(Class.java:2583)
	at java.lang.Class.getDeclaredFields(Class.java:1916)
	at com.thoughtworks.xstream.converters.reflection.FieldDictionary.buildMap(FieldDictionary.java:136)
	at com.thoughtworks.xstream.converters.reflection.FieldDictionary.fieldOrNull(FieldDictionary.java:113)
	at com.thoughtworks.xstream.converters.reflection.PureJavaReflectionProvider.getFieldOrNull(PureJavaReflectionProvider.java:193)
	at com.thoughtworks.xstream.converters.reflection.AbstractReflectionConverter.canAccess(AbstractReflectionConverter.java:67)
	at com.thoughtworks.xstream.converters.reflection.ReflectionConverter.canConvert(ReflectionConverter.java:42)
	at com.thoughtworks.xstream.core.DefaultConverterLookup.lookupConverterForType(DefaultConverterLookup.java:56)
	at com.thoughtworks.xstream.XStream$1.lookupConverterForType(XStream.java:498)
	at com.thoughtworks.xstream.core.TreeUnmarshaller.convertAnother(TreeUnmarshaller.java:56)
	at com.thoughtworks.xstream.converters.reflection.AbstractReflectionConverter.unmarshallField(AbstractReflectionConverter.java:480)
	at com.thoughtworks.xstream.converters.reflection.AbstractReflectionConverter.doUnmarshal(AbstractReflectionConverter.java:412)
	at com.thoughtworks.xstream.converters.reflection.AbstractReflectionConverter.unmarshal(AbstractReflectionConverter.java:263)
	at com.thoughtworks.xstream.core.TreeUnmarshaller.convert(TreeUnmarshaller.java:72)
	at com.thoughtworks.xstream.core.AbstractReferenceUnmarshaller.convert(AbstractReferenceUnmarshaller.java:65)
	at com.thoughtworks.xstream.core.TreeUnmarshaller.convertAnother(TreeUnmarshaller.java:66)
	at com.thoughtworks.xstream.core.TreeUnmarshaller.convertAnother(TreeUnmarshaller.java:50)
	at com.thoughtworks.xstream.core.TreeUnmarshaller.start(TreeUnmarshaller.java:134)
	at com.thoughtworks.xstream.core.AbstractTreeMarshallingStrategy.unmarshal(AbstractTreeMarshallingStrategy.java:32)
	at com.thoughtworks.xstream.XStream.unmarshal(XStream.java:1206)
	at com.thoughtworks.xstream.XStream.unmarshal(XStream.java:1190)
	at com.thoughtworks.xstream.XStream.fromXML(XStream.java:1061)
	at com.thoughtworks.xstream.XStream.fromXML(XStream.java:1052)
	at org.pitest.util.IsolationUtils.cloneForLoader(IsolationUtils.java:58)
	at org.pitest.mutationtest.engine.gregor.MutatorTestBase.runInClassLoader(MutatorTestBase.java:152)
	at org.pitest.mutationtest.engine.gregor.MutatorTestBase.mutateAndCall(MutatorTestBase.java:119)
	at org.pitest.mutationtest.engine.gregor.MutatorTestBase.assertMutantCallableReturns(MutatorTestBase.java:108)
	at org.pitest.mutationtest.engine.gregor.mutators.ArgumentPropagationMutatorTest.alsoReplaceCallToMethodWhenReturnValueIsNotUsed(ArgumentPropagationMutatorTest.java:185)

shouldReplaceInstanceMethodCallThatIsUsedAsArgumentForCallToOtherObject(org.pitest.mutationtest.engine.gregor.mutators.ArgumentPropagationMutatorTest)  Time elapsed: 0.017 sec  <<< ERROR!
org.pitest.util.PitError: entry : entry
---- Debugging information ----
message             : entry
cause-exception     : java.lang.NullPointerException
cause-message       : entry
class               : org.pitest.mutationtest.engine.gregor.mutators.ArgumentPropagationMutatorTest$CallsOtherObjectWithResultOfInstanceMethod
required-type       : org.pitest.mutationtest.engine.gregor.mutators.ArgumentPropagationMutatorTest$CallsOtherObjectWithResultOfInstanceMethod
converter-type      : com.thoughtworks.xstream.converters.reflection.ReflectionConverter
path                : /org.pitest.mutationtest.engine.gregor.mutators.ArgumentPropagationMutatorTest$CallsOtherObjectWithResultOfInstanceMethod/outer-class
line number         : 1
version             : 1.4.8
-------------------------------

Please copy and paste the information and the complete stacktrace below when reporting an issue
VM : Java HotSpot(TM) 64-Bit Server VM
Vendor : Oracle Corporation
Version : 25.60-b23
Uptime : 3311
Input -> 
BootClassPathSupported : true

	at java.util.zip.ZipFile.getInputStream(ZipFile.java:346)
	at org.pitest.classpath.ArchiveClassPathRoot.getData(ArchiveClassPathRoot.java:28)
	at org.pitest.classpath.CompoundClassPathRoot.getData(CompoundClassPathRoot.java:27)
	at org.pitest.classpath.ClassPath.getClassData(ClassPath.java:101)
	at org.pitest.mutationtest.execute.DefaultPITClassloader.findClass(DefaultPITClassloader.java:37)
	at java.lang.ClassLoader.loadClass(ClassLoader.java:424)
	at java.lang.ClassLoader.loadClass(ClassLoader.java:357)
	at java.lang.Class.getDeclaredFields0(Native Method)
	at java.lang.Class.privateGetDeclaredFields(Class.java:2583)
	at java.lang.Class.getDeclaredFields(Class.java:1916)
	at com.thoughtworks.xstream.converters.reflection.FieldDictionary.buildMap(FieldDictionary.java:136)
	at com.thoughtworks.xstream.converters.reflection.FieldDictionary.fieldOrNull(FieldDictionary.java:113)
	at com.thoughtworks.xstream.converters.reflection.PureJavaReflectionProvider.getFieldOrNull(PureJavaReflectionProvider.java:193)
	at com.thoughtworks.xstream.converters.reflection.AbstractReflectionConverter.canAccess(AbstractReflectionConverter.java:67)
	at com.thoughtworks.xstream.converters.reflection.ReflectionConverter.canConvert(ReflectionConverter.java:42)
	at com.thoughtworks.xstream.core.DefaultConverterLookup.lookupConverterForType(DefaultConverterLookup.java:56)
	at com.thoughtworks.xstream.XStream$1.lookupConverterForType(XStream.java:498)
	at com.thoughtworks.xstream.core.TreeUnmarshaller.convertAnother(TreeUnmarshaller.java:56)
	at com.thoughtworks.xstream.converters.reflection.AbstractReflectionConverter.unmarshallField(AbstractReflectionConverter.java:480)
	at com.thoughtworks.xstream.converters.reflection.AbstractReflectionConverter.doUnmarshal(AbstractReflectionConverter.java:412)
	at com.thoughtworks.xstream.converters.reflection.AbstractReflectionConverter.unmarshal(AbstractReflectionConverter.java:263)
	at com.thoughtworks.xstream.core.TreeUnmarshaller.convert(TreeUnmarshaller.java:72)
	at com.thoughtworks.xstream.core.AbstractReferenceUnmarshaller.convert(AbstractReferenceUnmarshaller.java:65)
	at com.thoughtworks.xstream.core.TreeUnmarshaller.convertAnother(TreeUnmarshaller.java:66)
	at com.thoughtworks.xstream.core.TreeUnmarshaller.convertAnother(TreeUnmarshaller.java:50)
	at com.thoughtworks.xstream.core.TreeUnmarshaller.start(TreeUnmarshaller.java:134)
	at com.thoughtworks.xstream.core.AbstractTreeMarshallingStrategy.unmarshal(AbstractTreeMarshallingStrategy.java:32)
	at com.thoughtworks.xstream.XStream.unmarshal(XStream.java:1206)
	at com.thoughtworks.xstream.XStream.unmarshal(XStream.java:1190)
	at com.thoughtworks.xstream.XStream.fromXML(XStream.java:1061)
	at com.thoughtworks.xstream.XStream.fromXML(XStream.java:1052)
	at org.pitest.util.IsolationUtils.cloneForLoader(IsolationUtils.java:58)
	at org.pitest.mutationtest.engine.gregor.MutatorTestBase.runInClassLoader(MutatorTestBase.java:152)
	at org.pitest.mutationtest.engine.gregor.MutatorTestBase.mutateAndCall(MutatorTestBase.java:119)
	at org.pitest.mutationtest.engine.gregor.MutatorTestBase.assertMutantCallableReturns(MutatorTestBase.java:108)
	at org.pitest.mutationtest.engine.gregor.mutators.ArgumentPropagationMutatorTest.shouldReplaceInstanceMethodCallThatIsUsedAsArgumentForCallToOtherObject(ArgumentPropagationMutatorTest.java:268)

continuesUntilMatchingArgumentTypeIsFound(org.pitest.mutationtest.engine.gregor.mutators.ArgumentPropagationMutatorTest)  Time elapsed: 0.022 sec  <<< ERROR!
org.pitest.util.PitError: entry : entry
---- Debugging information ----
message             : entry
cause-exception     : java.lang.NullPointerException
cause-message       : entry
class               : org.pitest.mutationtest.engine.gregor.mutators.ArgumentPropagationMutatorTest$OnlyFirstArgumentHasMatchingType
required-type       : org.pitest.mutationtest.engine.gregor.mutators.ArgumentPropagationMutatorTest$OnlyFirstArgumentHasMatchingType
converter-type      : com.thoughtworks.xstream.converters.reflection.ReflectionConverter
path                : /org.pitest.mutationtest.engine.gregor.mutators.ArgumentPropagationMutatorTest$OnlyFirstArgumentHasMatchingType/outer-class
line number         : 1
version             : 1.4.8
-------------------------------

Please copy and paste the information and the complete stacktrace below when reporting an issue
VM : Java HotSpot(TM) 64-Bit Server VM
Vendor : Oracle Corporation
Version : 25.60-b23
Uptime : 3333
Input -> 
BootClassPathSupported : true

	at java.util.zip.ZipFile.getInputStream(ZipFile.java:346)
	at org.pitest.classpath.ArchiveClassPathRoot.getData(ArchiveClassPathRoot.java:28)
	at org.pitest.classpath.CompoundClassPathRoot.getData(CompoundClassPathRoot.java:27)
	at org.pitest.classpath.ClassPath.getClassData(ClassPath.java:101)
	at org.pitest.mutationtest.execute.DefaultPITClassloader.findClass(DefaultPITClassloader.java:37)
	at java.lang.ClassLoader.loadClass(ClassLoader.java:424)
	at java.lang.ClassLoader.loadClass(ClassLoader.java:357)
	at java.lang.Class.getDeclaredFields0(Native Method)
	at java.lang.Class.privateGetDeclaredFields(Class.java:2583)
	at java.lang.Class.getDeclaredFields(Class.java:1916)
	at com.thoughtworks.xstream.converters.reflection.FieldDictionary.buildMap(FieldDictionary.java:136)
	at com.thoughtworks.xstream.converters.reflection.FieldDictionary.fieldOrNull(FieldDictionary.java:113)
	at com.thoughtworks.xstream.converters.reflection.PureJavaReflectionProvider.getFieldOrNull(PureJavaReflectionProvider.java:193)
	at com.thoughtworks.xstream.converters.reflection.AbstractReflectionConverter.canAccess(AbstractReflectionConverter.java:67)
	at com.thoughtworks.xstream.converters.reflection.ReflectionConverter.canConvert(ReflectionConverter.java:42)
	at com.thoughtworks.xstream.core.DefaultConverterLookup.lookupConverterForType(DefaultConverterLookup.java:56)
	at com.thoughtworks.xstream.XStream$1.lookupConverterForType(XStream.java:498)
	at com.thoughtworks.xstream.core.TreeUnmarshaller.convertAnother(TreeUnmarshaller.java:56)
	at com.thoughtworks.xstream.converters.reflection.AbstractReflectionConverter.unmarshallField(AbstractReflectionConverter.java:480)
	at com.thoughtworks.xstream.converters.reflection.AbstractReflectionConverter.doUnmarshal(AbstractReflectionConverter.java:412)
	at com.thoughtworks.xstream.converters.reflection.AbstractReflectionConverter.unmarshal(AbstractReflectionConverter.java:263)
	at com.thoughtworks.xstream.core.TreeUnmarshaller.convert(TreeUnmarshaller.java:72)
	at com.thoughtworks.xstream.core.AbstractReferenceUnmarshaller.convert(AbstractReferenceUnmarshaller.java:65)
	at com.thoughtworks.xstream.core.TreeUnmarshaller.convertAnother(TreeUnmarshaller.java:66)
	at com.thoughtworks.xstream.core.TreeUnmarshaller.convertAnother(TreeUnmarshaller.java:50)
	at com.thoughtworks.xstream.core.TreeUnmarshaller.start(TreeUnmarshaller.java:134)
	at com.thoughtworks.xstream.core.AbstractTreeMarshallingStrategy.unmarshal(AbstractTreeMarshallingStrategy.java:32)
	at com.thoughtworks.xstream.XStream.unmarshal(XStream.java:1206)
	at com.thoughtworks.xstream.XStream.unmarshal(XStream.java:1190)
	at com.thoughtworks.xstream.XStream.fromXML(XStream.java:1061)
	at com.thoughtworks.xstream.XStream.fromXML(XStream.java:1052)
	at org.pitest.util.IsolationUtils.cloneForLoader(IsolationUtils.java:58)
	at org.pitest.mutationtest.engine.gregor.MutatorTestBase.runInClassLoader(MutatorTestBase.java:152)
	at org.pitest.mutationtest.engine.gregor.MutatorTestBase.mutateAndCall(MutatorTestBase.java:119)
	at org.pitest.mutationtest.engine.gregor.MutatorTestBase.assertMutantCallableReturns(MutatorTestBase.java:108)
	at org.pitest.mutationtest.engine.gregor.mutators.ArgumentPropagationMutatorTest.continuesUntilMatchingArgumentTypeIsFound(ArgumentPropagationMutatorTest.java:128)

usesLastArgumentOfMatchingTypeToReplaceMethod(org.pitest.mutationtest.engine.gregor.mutators.ArgumentPropagationMutatorTest)  Time elapsed: 0.024 sec  <<< ERROR!
org.pitest.util.PitError: entry : entry
---- Debugging information ----
message             : entry
cause-exception     : java.lang.NullPointerException
cause-message       : entry
class               : org.pitest.mutationtest.engine.gregor.mutators.ArgumentPropagationMutatorTest$HasSeveralArgumentWithMatchingType
required-type       : org.pitest.mutationtest.engine.gregor.mutators.ArgumentPropagationMutatorTest$HasSeveralArgumentWithMatchingType
converter-type      : com.thoughtworks.xstream.converters.reflection.ReflectionConverter
path                : /org.pitest.mutationtest.engine.gregor.mutators.ArgumentPropagationMutatorTest$HasSeveralArgumentWithMatchingType/outer-class
line number         : 1
version             : 1.4.8
-------------------------------

Please copy and paste the information and the complete stacktrace below when reporting an issue
VM : Java HotSpot(TM) 64-Bit Server VM
Vendor : Oracle Corporation
Version : 25.60-b23
Uptime : 3357
Input -> 
BootClassPathSupported : true

	at java.util.zip.ZipFile.getInputStream(ZipFile.java:346)
	at org.pitest.classpath.ArchiveClassPathRoot.getData(ArchiveClassPathRoot.java:28)
	at org.pitest.classpath.CompoundClassPathRoot.getData(CompoundClassPathRoot.java:27)
	at org.pitest.classpath.ClassPath.getClassData(ClassPath.java:101)
	at org.pitest.mutationtest.execute.DefaultPITClassloader.findClass(DefaultPITClassloader.java:37)
	at java.lang.ClassLoader.loadClass(ClassLoader.java:424)
	at java.lang.ClassLoader.loadClass(ClassLoader.java:357)
	at java.lang.Class.getDeclaredFields0(Native Method)
	at java.lang.Class.privateGetDeclaredFields(Class.java:2583)
	at java.lang.Class.getDeclaredFields(Class.java:1916)
	at com.thoughtworks.xstream.converters.reflection.FieldDictionary.buildMap(FieldDictionary.java:136)
	at com.thoughtworks.xstream.converters.reflection.FieldDictionary.fieldOrNull(FieldDictionary.java:113)
	at com.thoughtworks.xstream.converters.reflection.PureJavaReflectionProvider.getFieldOrNull(PureJavaReflectionProvider.java:193)
	at com.thoughtworks.xstream.converters.reflection.AbstractReflectionConverter.canAccess(AbstractReflectionConverter.java:67)
	at com.thoughtworks.xstream.converters.reflection.ReflectionConverter.canConvert(ReflectionConverter.java:42)
	at com.thoughtworks.xstream.core.DefaultConverterLookup.lookupConverterForType(DefaultConverterLookup.java:56)
	at com.thoughtworks.xstream.XStream$1.lookupConverterForType(XStream.java:498)
	at com.thoughtworks.xstream.core.TreeUnmarshaller.convertAnother(TreeUnmarshaller.java:56)
	at com.thoughtworks.xstream.converters.reflection.AbstractReflectionConverter.unmarshallField(AbstractReflectionConverter.java:480)
	at com.thoughtworks.xstream.converters.reflection.AbstractReflectionConverter.doUnmarshal(AbstractReflectionConverter.java:412)
	at com.thoughtworks.xstream.converters.reflection.AbstractReflectionConverter.unmarshal(AbstractReflectionConverter.java:263)
	at com.thoughtworks.xstream.core.TreeUnmarshaller.convert(TreeUnmarshaller.java:72)
	at com.thoughtworks.xstream.core.AbstractReferenceUnmarshaller.convert(AbstractReferenceUnmarshaller.java:65)
	at com.thoughtworks.xstream.core.TreeUnmarshaller.convertAnother(TreeUnmarshaller.java:66)
	at com.thoughtworks.xstream.core.TreeUnmarshaller.convertAnother(TreeUnmarshaller.java:50)
	at com.thoughtworks.xstream.core.TreeUnmarshaller.start(TreeUnmarshaller.java:134)
	at com.thoughtworks.xstream.core.AbstractTreeMarshallingStrategy.unmarshal(AbstractTreeMarshallingStrategy.java:32)
	at com.thoughtworks.xstream.XStream.unmarshal(XStream.java:1206)
	at com.thoughtworks.xstream.XStream.unmarshal(XStream.java:1190)
	at com.thoughtworks.xstream.XStream.fromXML(XStream.java:1061)
	at com.thoughtworks.xstream.XStream.fromXML(XStream.java:1052)
	at org.pitest.util.IsolationUtils.cloneForLoader(IsolationUtils.java:58)
	at org.pitest.mutationtest.engine.gregor.MutatorTestBase.runInClassLoader(MutatorTestBase.java:152)
	at org.pitest.mutationtest.engine.gregor.MutatorTestBase.mutateAndCall(MutatorTestBase.java:119)
	at org.pitest.mutationtest.engine.gregor.MutatorTestBase.assertMutantCallableReturns(MutatorTestBase.java:108)
	at org.pitest.mutationtest.engine.gregor.mutators.ArgumentPropagationMutatorTest.usesLastArgumentOfMatchingTypeToReplaceMethod(ArgumentPropagationMutatorTest.java:157)

Running org.pitest.mutationtest.engine.gregor.mutators.ConditionalsBoundaryMutatorTest
Tests run: 9, Failures: 0, Errors: 4, Skipped: 0, Time elapsed: 0.099 sec <<< FAILURE! - in org.pitest.mutationtest.engine.gregor.mutators.ConditionalsBoundaryMutatorTest
shouldReplaceIF_ICMPLTwithIF_ICMPGT(org.pitest.mutationtest.engine.gregor.mutators.ConditionalsBoundaryMutatorTest)  Time elapsed: 0.007 sec  <<< ERROR!
java.lang.NullPointerException: entry
	at java.util.zip.ZipFile.getInputStream(ZipFile.java:346)
	at org.pitest.classpath.ArchiveClassPathRoot.getData(ArchiveClassPathRoot.java:28)
	at org.pitest.classpath.CompoundClassPathRoot.getData(CompoundClassPathRoot.java:27)
	at org.pitest.classpath.ClassPath.getClassData(ClassPath.java:101)
	at org.pitest.mutationtest.execute.DefaultPITClassloader.findClass(DefaultPITClassloader.java:37)
	at java.lang.ClassLoader.loadClass(ClassLoader.java:424)
	at java.lang.ClassLoader.loadClass(ClassLoader.java:357)
	at org.pitest.mutationtest.engine.gregor.mutators.ConditionalsBoundaryMutatorTest$HasIF_ICMPLT.call(ConditionalsBoundaryMutatorTest.java:230)
	at org.pitest.mutationtest.engine.gregor.mutators.ConditionalsBoundaryMutatorTest$HasIF_ICMPLT.call(ConditionalsBoundaryMutatorTest.java:221)
	at org.pitest.mutationtest.engine.gregor.MutatorTestBase.runInClassLoader(MutatorTestBase.java:154)
	at org.pitest.mutationtest.engine.gregor.MutatorTestBase.mutateAndCall(MutatorTestBase.java:119)
	at org.pitest.mutationtest.engine.gregor.MutatorTestBase.assertMutantCallableReturns(MutatorTestBase.java:108)
	at org.pitest.mutationtest.engine.gregor.mutators.ConditionalsBoundaryMutatorTest.shouldReplaceIF_ICMPLTwithIF_ICMPGT(ConditionalsBoundaryMutatorTest.java:242)

shouldReplaceIF_ICMPGEwithIF_ICMPGT(org.pitest.mutationtest.engine.gregor.mutators.ConditionalsBoundaryMutatorTest)  Time elapsed: 0.007 sec  <<< ERROR!
java.lang.NullPointerException: entry
	at java.util.zip.ZipFile.getInputStream(ZipFile.java:346)
	at org.pitest.classpath.ArchiveClassPathRoot.getData(ArchiveClassPathRoot.java:28)
	at org.pitest.classpath.CompoundClassPathRoot.getData(CompoundClassPathRoot.java:27)
	at org.pitest.classpath.ClassPath.getClassData(ClassPath.java:101)
	at org.pitest.mutationtest.execute.DefaultPITClassloader.findClass(DefaultPITClassloader.java:37)
	at java.lang.ClassLoader.loadClass(ClassLoader.java:424)
	at java.lang.ClassLoader.loadClass(ClassLoader.java:357)
	at org.pitest.mutationtest.engine.gregor.mutators.ConditionalsBoundaryMutatorTest$HasIF_ICMPGE.call(ConditionalsBoundaryMutatorTest.java:178)
	at org.pitest.mutationtest.engine.gregor.mutators.ConditionalsBoundaryMutatorTest$HasIF_ICMPGE.call(ConditionalsBoundaryMutatorTest.java:169)
	at org.pitest.mutationtest.engine.gregor.MutatorTestBase.runInClassLoader(MutatorTestBase.java:154)
	at org.pitest.mutationtest.engine.gregor.MutatorTestBase.mutateAndCall(MutatorTestBase.java:119)
	at org.pitest.mutationtest.engine.gregor.MutatorTestBase.assertMutantCallableReturns(MutatorTestBase.java:108)
	at org.pitest.mutationtest.engine.gregor.mutators.ConditionalsBoundaryMutatorTest.shouldReplaceIF_ICMPGEwithIF_ICMPGT(ConditionalsBoundaryMutatorTest.java:190)

shouldReplaceIF_ICMPGTwithIF_ICMPGE(org.pitest.mutationtest.engine.gregor.mutators.ConditionalsBoundaryMutatorTest)  Time elapsed: 0.007 sec  <<< ERROR!
java.lang.NullPointerException: entry
	at java.util.zip.ZipFile.getInputStream(ZipFile.java:346)
	at org.pitest.classpath.ArchiveClassPathRoot.getData(ArchiveClassPathRoot.java:28)
	at org.pitest.classpath.CompoundClassPathRoot.getData(CompoundClassPathRoot.java:27)
	at org.pitest.classpath.ClassPath.getClassData(ClassPath.java:101)
	at org.pitest.mutationtest.execute.DefaultPITClassloader.findClass(DefaultPITClassloader.java:37)
	at java.lang.ClassLoader.loadClass(ClassLoader.java:424)
	at java.lang.ClassLoader.loadClass(ClassLoader.java:357)
	at org.pitest.mutationtest.engine.gregor.mutators.ConditionalsBoundaryMutatorTest$HasIF_ICMPGT.call(ConditionalsBoundaryMutatorTest.java:204)
	at org.pitest.mutationtest.engine.gregor.mutators.ConditionalsBoundaryMutatorTest$HasIF_ICMPGT.call(ConditionalsBoundaryMutatorTest.java:195)
	at org.pitest.mutationtest.engine.gregor.MutatorTestBase.runInClassLoader(MutatorTestBase.java:154)
	at org.pitest.mutationtest.engine.gregor.MutatorTestBase.mutateAndCall(MutatorTestBase.java:119)
	at org.pitest.mutationtest.engine.gregor.MutatorTestBase.assertMutantCallableReturns(MutatorTestBase.java:108)
	at org.pitest.mutationtest.engine.gregor.mutators.ConditionalsBoundaryMutatorTest.shouldReplaceIF_ICMPGTwithIF_ICMPGE(ConditionalsBoundaryMutatorTest.java:216)

shouldReplaceICMPLEwithIF_ICMPLT(org.pitest.mutationtest.engine.gregor.mutators.ConditionalsBoundaryMutatorTest)  Time elapsed: 0.008 sec  <<< ERROR!
java.lang.NullPointerException: entry
	at java.util.zip.ZipFile.getInputStream(ZipFile.java:346)
	at org.pitest.classpath.ArchiveClassPathRoot.getData(ArchiveClassPathRoot.java:28)
	at org.pitest.classpath.CompoundClassPathRoot.getData(CompoundClassPathRoot.java:27)
	at org.pitest.classpath.ClassPath.getClassData(ClassPath.java:101)
	at org.pitest.mutationtest.execute.DefaultPITClassloader.findClass(DefaultPITClassloader.java:37)
	at java.lang.ClassLoader.loadClass(ClassLoader.java:424)
	at java.lang.ClassLoader.loadClass(ClassLoader.java:357)
	at org.pitest.mutationtest.engine.gregor.mutators.ConditionalsBoundaryMutatorTest$HasIF_ICMPLE.call(ConditionalsBoundaryMutatorTest.java:152)
	at org.pitest.mutationtest.engine.gregor.mutators.ConditionalsBoundaryMutatorTest$HasIF_ICMPLE.call(ConditionalsBoundaryMutatorTest.java:143)
	at org.pitest.mutationtest.engine.gregor.MutatorTestBase.runInClassLoader(MutatorTestBase.java:154)
	at org.pitest.mutationtest.engine.gregor.MutatorTestBase.mutateAndCall(MutatorTestBase.java:119)
	at org.pitest.mutationtest.engine.gregor.MutatorTestBase.assertMutantCallableReturns(MutatorTestBase.java:108)
	at org.pitest.mutationtest.engine.gregor.mutators.ConditionalsBoundaryMutatorTest.shouldReplaceICMPLEwithIF_ICMPLT(ConditionalsBoundaryMutatorTest.java:164)

Running org.pitest.mutationtest.engine.gregor.mutators.ConstructorCallMutatorTest
Tests run: 6, Failures: 0, Errors: 0, Skipped: 0, Time elapsed: 0.021 sec - in org.pitest.mutationtest.engine.gregor.mutators.ConstructorCallMutatorTest
Running org.pitest.mutationtest.engine.gregor.mutators.experimental.MemberVariableMutatorTest
Tests run: 8, Failures: 0, Errors: 1, Skipped: 0, Time elapsed: 0.039 sec <<< FAILURE! - in org.pitest.mutationtest.engine.gregor.mutators.experimental.MemberVariableMutatorTest
shouldRemoveAssignmentToMemberVariable(org.pitest.mutationtest.engine.gregor.mutators.experimental.MemberVariableMutatorTest)  Time elapsed: 0.008 sec  <<< ERROR!
java.lang.NullPointerException: entry
	at java.util.zip.ZipFile.getInputStream(ZipFile.java:346)
	at org.pitest.classpath.ArchiveClassPathRoot.getData(ArchiveClassPathRoot.java:28)
	at org.pitest.classpath.CompoundClassPathRoot.getData(CompoundClassPathRoot.java:27)
	at org.pitest.classpath.ClassPath.getClassData(ClassPath.java:101)
	at org.pitest.mutationtest.execute.DefaultPITClassloader.findClass(DefaultPITClassloader.java:37)
	at java.lang.ClassLoader.loadClass(ClassLoader.java:424)
	at java.lang.ClassLoader.loadClass(ClassLoader.java:357)
	at org.pitest.mutationtest.engine.gregor.mutators.experimental.MemberVariableMutatorTest$HasMemberVariable.call(MemberVariableMutatorTest.java:56)
	at org.pitest.mutationtest.engine.gregor.MutatorTestBase.runInClassLoader(MutatorTestBase.java:154)
	at org.pitest.mutationtest.engine.gregor.MutatorTestBase.mutateAndCall(MutatorTestBase.java:119)
	at org.pitest.mutationtest.engine.gregor.MutatorTestBase.assertMutantCallableReturns(MutatorTestBase.java:108)
	at org.pitest.mutationtest.engine.gregor.mutators.experimental.MemberVariableMutatorTest.shouldRemoveAssignmentToMemberVariable(MemberVariableMutatorTest.java:65)

Running org.pitest.mutationtest.engine.gregor.mutators.experimental.MutantStarterTest
Tests run: 3, Failures: 0, Errors: 0, Skipped: 0, Time elapsed: 0.002 sec - in org.pitest.mutationtest.engine.gregor.mutators.experimental.MutantStarterTest
Running org.pitest.mutationtest.engine.gregor.mutators.experimental.RemoveIncrementsMutatorTest
Tests run: 3, Failures: 0, Errors: 0, Skipped: 0, Time elapsed: 0.01 sec - in org.pitest.mutationtest.engine.gregor.mutators.experimental.RemoveIncrementsMutatorTest
Running org.pitest.mutationtest.engine.gregor.mutators.experimental.RemoveSwitchMutatorTest
Tests run: 7, Failures: 0, Errors: 0, Skipped: 0, Time elapsed: 0.098 sec - in org.pitest.mutationtest.engine.gregor.mutators.experimental.RemoveSwitchMutatorTest
Running org.pitest.mutationtest.engine.gregor.mutators.experimental.ReturnValuesMutatorTest
Tests run: 26, Failures: 0, Errors: 14, Skipped: 0, Time elapsed: 0.168 sec <<< FAILURE! - in org.pitest.mutationtest.engine.gregor.mutators.experimental.ReturnValuesMutatorTest
shouldMutateReturnOfBooleanTrueToFalse(org.pitest.mutationtest.engine.gregor.mutators.experimental.ReturnValuesMutatorTest)  Time elapsed: 0.023 sec  <<< ERROR!
java.lang.NullPointerException: entry
	at java.util.zip.ZipFile.getInputStream(ZipFile.java:346)
	at org.pitest.classpath.ArchiveClassPathRoot.getData(ArchiveClassPathRoot.java:28)
	at org.pitest.classpath.CompoundClassPathRoot.getData(CompoundClassPathRoot.java:27)
	at org.pitest.classpath.ClassPath.getClassData(ClassPath.java:101)
	at org.pitest.mutationtest.execute.DefaultPITClassloader.findClass(DefaultPITClassloader.java:37)
	at java.lang.ClassLoader.loadClass(ClassLoader.java:424)
	at java.lang.ClassLoader.loadClass(ClassLoader.java:357)
	at org.pitest.mutationtest.engine.gregor.mutators.experimental.ReturnValuesMutatorTest$HasBooleanReturn.call(ReturnValuesMutatorTest.java:216)
	at org.pitest.mutationtest.engine.gregor.mutators.experimental.ReturnValuesMutatorTest$HasBooleanReturn.call(ReturnValuesMutatorTest.java:206)
	at org.pitest.mutationtest.engine.gregor.MutatorTestBase.runInClassLoader(MutatorTestBase.java:154)
	at org.pitest.mutationtest.engine.gregor.MutatorTestBase.mutateAndCall(MutatorTestBase.java:119)
	at org.pitest.mutationtest.engine.gregor.MutatorTestBase.assertMutantCallableReturns(MutatorTestBase.java:108)
	at org.pitest.mutationtest.engine.gregor.mutators.experimental.ReturnValuesMutatorTest.shouldMutateReturnOfBooleanTrueToFalse(ReturnValuesMutatorTest.java:223)

shouldMutateReturnOfLongToValuePlus1(org.pitest.mutationtest.engine.gregor.mutators.experimental.ReturnValuesMutatorTest)  Time elapsed: 0.009 sec  <<< ERROR!
java.lang.NullPointerException: entry
	at java.util.zip.ZipFile.getInputStream(ZipFile.java:346)
	at org.pitest.classpath.ArchiveClassPathRoot.getData(ArchiveClassPathRoot.java:28)
	at org.pitest.classpath.CompoundClassPathRoot.getData(CompoundClassPathRoot.java:27)
	at org.pitest.classpath.ClassPath.getClassData(ClassPath.java:101)
	at org.pitest.mutationtest.execute.DefaultPITClassloader.findClass(DefaultPITClassloader.java:37)
	at java.lang.ClassLoader.loadClass(ClassLoader.java:424)
	at java.lang.ClassLoader.loadClass(ClassLoader.java:357)
	at org.pitest.mutationtest.engine.gregor.mutators.experimental.ReturnValuesMutatorTest$HasLongReturn.call(ReturnValuesMutatorTest.java:292)
	at org.pitest.mutationtest.engine.gregor.mutators.experimental.ReturnValuesMutatorTest$HasLongReturn.call(ReturnValuesMutatorTest.java:282)
	at org.pitest.mutationtest.engine.gregor.MutatorTestBase.runInClassLoader(MutatorTestBase.java:154)
	at org.pitest.mutationtest.engine.gregor.MutatorTestBase.mutateAndCall(MutatorTestBase.java:119)
	at org.pitest.mutationtest.engine.gregor.MutatorTestBase.assertMutantCallableReturns(MutatorTestBase.java:108)
	at org.pitest.mutationtest.engine.gregor.mutators.experimental.ReturnValuesMutatorTest.shouldMutateReturnOfLongToValuePlus1(ReturnValuesMutatorTest.java:299)

shouldMutateReturnOfInteger1To0(org.pitest.mutationtest.engine.gregor.mutators.experimental.ReturnValuesMutatorTest)  Time elapsed: 0.007 sec  <<< ERROR!
java.lang.NullPointerException: entry
	at java.util.zip.ZipFile.getInputStream(ZipFile.java:346)
	at org.pitest.classpath.ArchiveClassPathRoot.getData(ArchiveClassPathRoot.java:28)
	at org.pitest.classpath.CompoundClassPathRoot.getData(CompoundClassPathRoot.java:27)
	at org.pitest.classpath.ClassPath.getClassData(ClassPath.java:101)
	at org.pitest.mutationtest.execute.DefaultPITClassloader.findClass(DefaultPITClassloader.java:37)
	at java.lang.ClassLoader.loadClass(ClassLoader.java:424)
	at java.lang.ClassLoader.loadClass(ClassLoader.java:357)
	at org.pitest.mutationtest.engine.gregor.mutators.experimental.ReturnValuesMutatorTest$HasIntegerReturn.call(ReturnValuesMutatorTest.java:257)
	at org.pitest.mutationtest.engine.gregor.mutators.experimental.ReturnValuesMutatorTest$HasIntegerReturn.call(ReturnValuesMutatorTest.java:247)
	at org.pitest.mutationtest.engine.gregor.MutatorTestBase.runInClassLoader(MutatorTestBase.java:154)
	at org.pitest.mutationtest.engine.gregor.MutatorTestBase.mutateAndCall(MutatorTestBase.java:119)
	at org.pitest.mutationtest.engine.gregor.MutatorTestBase.assertMutantCallableReturns(MutatorTestBase.java:108)
	at org.pitest.mutationtest.engine.gregor.mutators.experimental.ReturnValuesMutatorTest.shouldMutateReturnOfInteger1To0(ReturnValuesMutatorTest.java:271)

shouldMutateReturnsOfNonNullObjectsToNull(org.pitest.mutationtest.engine.gregor.mutators.experimental.ReturnValuesMutatorTest)  Time elapsed: 0.008 sec  <<< ERROR!
java.lang.NullPointerException: entry
	at java.util.zip.ZipFile.getInputStream(ZipFile.java:346)
	at org.pitest.classpath.ArchiveClassPathRoot.getData(ArchiveClassPathRoot.java:28)
	at org.pitest.classpath.CompoundClassPathRoot.getData(CompoundClassPathRoot.java:27)
	at org.pitest.classpath.ClassPath.getClassData(ClassPath.java:101)
	at org.pitest.mutationtest.execute.DefaultPITClassloader.findClass(DefaultPITClassloader.java:37)
	at java.lang.ClassLoader.loadClass(ClassLoader.java:424)
	at java.lang.ClassLoader.loadClass(ClassLoader.java:357)
	at org.pitest.mutationtest.engine.gregor.mutators.experimental.ReturnValuesMutatorTest$HasObjectReturn.call(ReturnValuesMutatorTest.java:328)
	at org.pitest.mutationtest.engine.gregor.MutatorTestBase.runInClassLoader(MutatorTestBase.java:154)
	at org.pitest.mutationtest.engine.gregor.MutatorTestBase.mutateAndCall(MutatorTestBase.java:119)
	at org.pitest.mutationtest.engine.gregor.MutatorTestBase.assertMutantCallableReturns(MutatorTestBase.java:108)
	at org.pitest.mutationtest.engine.gregor.mutators.experimental.ReturnValuesMutatorTest.shouldMutateReturnsOfNonNullObjectsToNull(ReturnValuesMutatorTest.java:335)

cannotMutateReturnOfBooleanIfDeclaredAsObject(org.pitest.mutationtest.engine.gregor.mutators.experimental.ReturnValuesMutatorTest)  Time elapsed: 0.006 sec  <<< ERROR!
java.lang.NullPointerException: entry
	at java.util.zip.ZipFile.getInputStream(ZipFile.java:346)
	at org.pitest.classpath.ArchiveClassPathRoot.getData(ArchiveClassPathRoot.java:28)
	at org.pitest.classpath.CompoundClassPathRoot.getData(CompoundClassPathRoot.java:27)
	at org.pitest.classpath.ClassPath.getClassData(ClassPath.java:101)
	at org.pitest.mutationtest.execute.DefaultPITClassloader.findClass(DefaultPITClassloader.java:37)
	at java.lang.ClassLoader.loadClass(ClassLoader.java:424)
	at java.lang.ClassLoader.loadClass(ClassLoader.java:357)
	at org.pitest.mutationtest.engine.gregor.mutators.experimental.ReturnValuesMutatorTest$HasObjectReturn.call(ReturnValuesMutatorTest.java:328)
	at org.pitest.mutationtest.engine.gregor.MutatorTestBase.runInClassLoader(MutatorTestBase.java:154)
	at org.pitest.mutationtest.engine.gregor.MutatorTestBase.mutateAndCall(MutatorTestBase.java:119)
	at org.pitest.mutationtest.engine.gregor.MutatorTestBase.assertMutantCallableReturns(MutatorTestBase.java:108)
	at org.pitest.mutationtest.engine.gregor.mutators.experimental.ReturnValuesMutatorTest.cannotMutateReturnOfBooleanIfDeclaredAsObject(ReturnValuesMutatorTest.java:244)

shouldMutateReturnOfIntegerToValuePlus1(org.pitest.mutationtest.engine.gregor.mutators.experimental.ReturnValuesMutatorTest)  Time elapsed: 0.007 sec  <<< ERROR!
java.lang.NullPointerException: entry
	at java.util.zip.ZipFile.getInputStream(ZipFile.java:346)
	at org.pitest.classpath.ArchiveClassPathRoot.getData(ArchiveClassPathRoot.java:28)
	at org.pitest.classpath.CompoundClassPathRoot.getData(CompoundClassPathRoot.java:27)
	at org.pitest.classpath.ClassPath.getClassData(ClassPath.java:101)
	at org.pitest.mutationtest.execute.DefaultPITClassloader.findClass(DefaultPITClassloader.java:37)
	at java.lang.ClassLoader.loadClass(ClassLoader.java:424)
	at java.lang.ClassLoader.loadClass(ClassLoader.java:357)
	at org.pitest.mutationtest.engine.gregor.mutators.experimental.ReturnValuesMutatorTest$HasIntegerReturn.call(ReturnValuesMutatorTest.java:257)
	at org.pitest.mutationtest.engine.gregor.mutators.experimental.ReturnValuesMutatorTest$HasIntegerReturn.call(ReturnValuesMutatorTest.java:247)
	at org.pitest.mutationtest.engine.gregor.MutatorTestBase.runInClassLoader(MutatorTestBase.java:154)
	at org.pitest.mutationtest.engine.gregor.MutatorTestBase.mutateAndCall(MutatorTestBase.java:119)
	at org.pitest.mutationtest.engine.gregor.MutatorTestBase.assertMutantCallableReturns(MutatorTestBase.java:108)
	at org.pitest.mutationtest.engine.gregor.mutators.experimental.ReturnValuesMutatorTest.shouldMutateReturnOfIntegerToValuePlus1(ReturnValuesMutatorTest.java:264)

shouldMutateReturnOfBooleanNullToTrue(org.pitest.mutationtest.engine.gregor.mutators.experimental.ReturnValuesMutatorTest)  Time elapsed: 0.006 sec  <<< ERROR!
java.lang.NullPointerException: entry
	at java.util.zip.ZipFile.getInputStream(ZipFile.java:346)
	at org.pitest.classpath.ArchiveClassPathRoot.getData(ArchiveClassPathRoot.java:28)
	at org.pitest.classpath.CompoundClassPathRoot.getData(CompoundClassPathRoot.java:27)
	at org.pitest.classpath.ClassPath.getClassData(ClassPath.java:101)
	at org.pitest.mutationtest.execute.DefaultPITClassloader.findClass(DefaultPITClassloader.java:37)
	at java.lang.ClassLoader.loadClass(ClassLoader.java:424)
	at java.lang.ClassLoader.loadClass(ClassLoader.java:357)
	at org.pitest.mutationtest.engine.gregor.mutators.experimental.ReturnValuesMutatorTest$HasBooleanReturn.call(ReturnValuesMutatorTest.java:216)
	at org.pitest.mutationtest.engine.gregor.mutators.experimental.ReturnValuesMutatorTest$HasBooleanReturn.call(ReturnValuesMutatorTest.java:206)
	at org.pitest.mutationtest.engine.gregor.MutatorTestBase.runInClassLoader(MutatorTestBase.java:154)
	at org.pitest.mutationtest.engine.gregor.MutatorTestBase.mutateAndCall(MutatorTestBase.java:119)
	at org.pitest.mutationtest.engine.gregor.MutatorTestBase.assertMutantCallableReturns(MutatorTestBase.java:108)
	at org.pitest.mutationtest.engine.gregor.mutators.experimental.ReturnValuesMutatorTest.shouldMutateReturnOfBooleanNullToTrue(ReturnValuesMutatorTest.java:237)

cannotDetectGenericsStuff(org.pitest.mutationtest.engine.gregor.mutators.experimental.ReturnValuesMutatorTest)  Time elapsed: 0.007 sec  <<< ERROR!
java.lang.Exception: Unexpected exception, expected<java.lang.ClassCastException> but was<java.lang.NullPointerException>
	at java.util.zip.ZipFile.getInputStream(ZipFile.java:346)
	at org.pitest.classpath.ArchiveClassPathRoot.getData(ArchiveClassPathRoot.java:28)
	at org.pitest.classpath.CompoundClassPathRoot.getData(CompoundClassPathRoot.java:27)
	at org.pitest.classpath.ClassPath.getClassData(ClassPath.java:101)
	at org.pitest.mutationtest.execute.DefaultPITClassloader.findClass(DefaultPITClassloader.java:37)
	at java.lang.ClassLoader.loadClass(ClassLoader.java:424)
	at java.lang.ClassLoader.loadClass(ClassLoader.java:357)
	at org.pitest.mutationtest.engine.gregor.mutators.experimental.ReturnValuesMutatorTest$HasGenericStuff.call(ReturnValuesMutatorTest.java:386)
	at org.pitest.mutationtest.engine.gregor.MutatorTestBase.runInClassLoader(MutatorTestBase.java:154)
	at org.pitest.mutationtest.engine.gregor.MutatorTestBase.mutateAndCall(MutatorTestBase.java:119)
	at org.pitest.mutationtest.engine.gregor.mutators.experimental.ReturnValuesMutatorTest.cannotDetectGenericsStuff(ReturnValuesMutatorTest.java:396)

shouldMutateReturnOfBooleanFalseToTrue(org.pitest.mutationtest.engine.gregor.mutators.experimental.ReturnValuesMutatorTest)  Time elapsed: 0.006 sec  <<< ERROR!
java.lang.NullPointerException: entry
	at java.util.zip.ZipFile.getInputStream(ZipFile.java:346)
	at org.pitest.classpath.ArchiveClassPathRoot.getData(ArchiveClassPathRoot.java:28)
	at org.pitest.classpath.CompoundClassPathRoot.getData(CompoundClassPathRoot.java:27)
	at org.pitest.classpath.ClassPath.getClassData(ClassPath.java:101)
	at org.pitest.mutationtest.execute.DefaultPITClassloader.findClass(DefaultPITClassloader.java:37)
	at java.lang.ClassLoader.loadClass(ClassLoader.java:424)
	at java.lang.ClassLoader.loadClass(ClassLoader.java:357)
	at org.pitest.mutationtest.engine.gregor.mutators.experimental.ReturnValuesMutatorTest$HasBooleanReturn.call(ReturnValuesMutatorTest.java:216)
	at org.pitest.mutationtest.engine.gregor.mutators.experimental.ReturnValuesMutatorTest$HasBooleanReturn.call(ReturnValuesMutatorTest.java:206)
	at org.pitest.mutationtest.engine.gregor.MutatorTestBase.runInClassLoader(MutatorTestBase.java:154)
	at org.pitest.mutationtest.engine.gregor.MutatorTestBase.mutateAndCall(MutatorTestBase.java:119)
	at org.pitest.mutationtest.engine.gregor.MutatorTestBase.assertMutantCallableReturns(MutatorTestBase.java:108)
	at org.pitest.mutationtest.engine.gregor.mutators.experimental.ReturnValuesMutatorTest.shouldMutateReturnOfBooleanFalseToTrue(ReturnValuesMutatorTest.java:230)

cannotMutateReturnOfIntegerIfDeclaredAsObject(org.pitest.mutationtest.engine.gregor.mutators.experimental.ReturnValuesMutatorTest)  Time elapsed: 0.005 sec  <<< ERROR!
java.lang.NullPointerException: entry
	at java.util.zip.ZipFile.getInputStream(ZipFile.java:346)
	at org.pitest.classpath.ArchiveClassPathRoot.getData(ArchiveClassPathRoot.java:28)
	at org.pitest.classpath.CompoundClassPathRoot.getData(CompoundClassPathRoot.java:27)
	at org.pitest.classpath.ClassPath.getClassData(ClassPath.java:101)
	at org.pitest.mutationtest.execute.DefaultPITClassloader.findClass(DefaultPITClassloader.java:37)
	at java.lang.ClassLoader.loadClass(ClassLoader.java:424)
	at java.lang.ClassLoader.loadClass(ClassLoader.java:357)
	at org.pitest.mutationtest.engine.gregor.mutators.experimental.ReturnValuesMutatorTest$HasObjectReturn.call(ReturnValuesMutatorTest.java:328)
	at org.pitest.mutationtest.engine.gregor.MutatorTestBase.runInClassLoader(MutatorTestBase.java:154)
	at org.pitest.mutationtest.engine.gregor.MutatorTestBase.mutateAndCall(MutatorTestBase.java:119)
	at org.pitest.mutationtest.engine.gregor.MutatorTestBase.assertMutantCallableReturns(MutatorTestBase.java:108)
	at org.pitest.mutationtest.engine.gregor.mutators.experimental.ReturnValuesMutatorTest.cannotMutateReturnOfIntegerIfDeclaredAsObject(ReturnValuesMutatorTest.java:314)

shouldMutateReturnOfLongNullToOne(org.pitest.mutationtest.engine.gregor.mutators.experimental.ReturnValuesMutatorTest)  Time elapsed: 0.005 sec  <<< ERROR!
java.lang.NullPointerException: entry
	at java.util.zip.ZipFile.getInputStream(ZipFile.java:346)
	at org.pitest.classpath.ArchiveClassPathRoot.getData(ArchiveClassPathRoot.java:28)
	at org.pitest.classpath.CompoundClassPathRoot.getData(CompoundClassPathRoot.java:27)
	at org.pitest.classpath.ClassPath.getClassData(ClassPath.java:101)
	at org.pitest.mutationtest.execute.DefaultPITClassloader.findClass(DefaultPITClassloader.java:37)
	at java.lang.ClassLoader.loadClass(ClassLoader.java:424)
	at java.lang.ClassLoader.loadClass(ClassLoader.java:357)
	at org.pitest.mutationtest.engine.gregor.mutators.experimental.ReturnValuesMutatorTest$HasLongReturn.call(ReturnValuesMutatorTest.java:292)
	at org.pitest.mutationtest.engine.gregor.mutators.experimental.ReturnValuesMutatorTest$HasLongReturn.call(ReturnValuesMutatorTest.java:282)
	at org.pitest.mutationtest.engine.gregor.MutatorTestBase.runInClassLoader(MutatorTestBase.java:154)
	at org.pitest.mutationtest.engine.gregor.MutatorTestBase.mutateAndCall(MutatorTestBase.java:119)
	at org.pitest.mutationtest.engine.gregor.MutatorTestBase.assertMutantCallableReturns(MutatorTestBase.java:108)
	at org.pitest.mutationtest.engine.gregor.mutators.experimental.ReturnValuesMutatorTest.shouldMutateReturnOfLongNullToOne(ReturnValuesMutatorTest.java:307)

shouldMutateReturnsOfNonNullCustomObjectsToNull(org.pitest.mutationtest.engine.gregor.mutators.experimental.ReturnValuesMutatorTest)  Time elapsed: 0.009 sec  <<< ERROR!
java.lang.NullPointerException: entry
	at java.util.zip.ZipFile.getInputStream(ZipFile.java:346)
	at org.pitest.classpath.ArchiveClassPathRoot.getData(ArchiveClassPathRoot.java:28)
	at org.pitest.classpath.CompoundClassPathRoot.getData(CompoundClassPathRoot.java:27)
	at org.pitest.classpath.ClassPath.getClassData(ClassPath.java:101)
	at org.pitest.mutationtest.execute.DefaultPITClassloader.findClass(DefaultPITClassloader.java:37)
	at java.lang.ClassLoader.loadClass(ClassLoader.java:424)
	at java.lang.ClassLoader.loadClass(ClassLoader.java:357)
	at org.pitest.mutationtest.engine.gregor.mutators.experimental.ReturnValuesMutatorTest$HasCustomObjectReturn.call(ReturnValuesMutatorTest.java:357)
	at org.pitest.mutationtest.engine.gregor.mutators.experimental.ReturnValuesMutatorTest$HasCustomObjectReturn.call(ReturnValuesMutatorTest.java:347)
	at org.pitest.mutationtest.engine.gregor.MutatorTestBase.runInClassLoader(MutatorTestBase.java:154)
	at org.pitest.mutationtest.engine.gregor.MutatorTestBase.mutateAndCall(MutatorTestBase.java:119)
	at org.pitest.mutationtest.engine.gregor.MutatorTestBase.assertMutantCallableReturns(MutatorTestBase.java:108)
	at org.pitest.mutationtest.engine.gregor.mutators.experimental.ReturnValuesMutatorTest.shouldMutateReturnsOfNonNullCustomObjectsToNull(ReturnValuesMutatorTest.java:365)

shouldMutateReturnOfIntegerNullToOne(org.pitest.mutationtest.engine.gregor.mutators.experimental.ReturnValuesMutatorTest)  Time elapsed: 0.006 sec  <<< ERROR!
java.lang.NullPointerException: entry
	at java.util.zip.ZipFile.getInputStream(ZipFile.java:346)
	at org.pitest.classpath.ArchiveClassPathRoot.getData(ArchiveClassPathRoot.java:28)
	at org.pitest.classpath.CompoundClassPathRoot.getData(CompoundClassPathRoot.java:27)
	at org.pitest.classpath.ClassPath.getClassData(ClassPath.java:101)
	at org.pitest.mutationtest.execute.DefaultPITClassloader.findClass(DefaultPITClassloader.java:37)
	at java.lang.ClassLoader.loadClass(ClassLoader.java:424)
	at java.lang.ClassLoader.loadClass(ClassLoader.java:357)
	at org.pitest.mutationtest.engine.gregor.mutators.experimental.ReturnValuesMutatorTest$HasIntegerReturn.call(ReturnValuesMutatorTest.java:257)
	at org.pitest.mutationtest.engine.gregor.mutators.experimental.ReturnValuesMutatorTest$HasIntegerReturn.call(ReturnValuesMutatorTest.java:247)
	at org.pitest.mutationtest.engine.gregor.MutatorTestBase.runInClassLoader(MutatorTestBase.java:154)
	at org.pitest.mutationtest.engine.gregor.MutatorTestBase.mutateAndCall(MutatorTestBase.java:119)
	at org.pitest.mutationtest.engine.gregor.MutatorTestBase.assertMutantCallableReturns(MutatorTestBase.java:108)
	at org.pitest.mutationtest.engine.gregor.mutators.experimental.ReturnValuesMutatorTest.shouldMutateReturnOfIntegerNullToOne(ReturnValuesMutatorTest.java:278)

shouldMutateReturnsOfNullObjectsToNewObject(org.pitest.mutationtest.engine.gregor.mutators.experimental.ReturnValuesMutatorTest)  Time elapsed: 0.006 sec  <<< ERROR!
java.lang.NullPointerException: entry
	at java.util.zip.ZipFile.getInputStream(ZipFile.java:346)
	at org.pitest.classpath.ArchiveClassPathRoot.getData(ArchiveClassPathRoot.java:28)
	at org.pitest.classpath.CompoundClassPathRoot.getData(CompoundClassPathRoot.java:27)
	at org.pitest.classpath.ClassPath.getClassData(ClassPath.java:101)
	at org.pitest.mutationtest.execute.DefaultPITClassloader.findClass(DefaultPITClassloader.java:37)
	at java.lang.ClassLoader.loadClass(ClassLoader.java:424)
	at java.lang.ClassLoader.loadClass(ClassLoader.java:357)
	at org.pitest.mutationtest.engine.gregor.mutators.experimental.ReturnValuesMutatorTest$HasObjectReturn.call(ReturnValuesMutatorTest.java:328)
	at org.pitest.mutationtest.engine.gregor.MutatorTestBase.runInClassLoader(MutatorTestBase.java:154)
	at org.pitest.mutationtest.engine.gregor.MutatorTestBase.mutateAndCall(MutatorTestBase.java:119)
	at org.pitest.mutationtest.engine.gregor.mutators.experimental.ReturnValuesMutatorTest.shouldMutateReturnsOfNullObjectsToNewObject(ReturnValuesMutatorTest.java:341)

Running org.pitest.mutationtest.engine.gregor.mutators.experimental.SwitchMutatorTest
Tests run: 8, Failures: 0, Errors: 0, Skipped: 0, Time elapsed: 0.18 sec - in org.pitest.mutationtest.engine.gregor.mutators.experimental.SwitchMutatorTest
Running org.pitest.mutationtest.engine.gregor.mutators.IncrementsMutatorTest
Tests run: 2, Failures: 0, Errors: 0, Skipped: 0, Time elapsed: 0.007 sec - in org.pitest.mutationtest.engine.gregor.mutators.IncrementsMutatorTest
Running org.pitest.mutationtest.engine.gregor.mutators.InlineConstantMutatorTest
Tests run: 32, Failures: 0, Errors: 5, Skipped: 0, Time elapsed: 0.164 sec <<< FAILURE! - in org.pitest.mutationtest.engine.gregor.mutators.InlineConstantMutatorTest
shouldReplaceFirstDoubleMutationPointOnly(org.pitest.mutationtest.engine.gregor.mutators.InlineConstantMutatorTest)  Time elapsed: 0.009 sec  <<< ERROR!
java.lang.NullPointerException: entry
	at java.util.zip.ZipFile.getInputStream(ZipFile.java:346)
	at org.pitest.classpath.ArchiveClassPathRoot.getData(ArchiveClassPathRoot.java:28)
	at org.pitest.classpath.CompoundClassPathRoot.getData(CompoundClassPathRoot.java:27)
	at org.pitest.classpath.ClassPath.getClassData(ClassPath.java:101)
	at org.pitest.mutationtest.execute.DefaultPITClassloader.findClass(DefaultPITClassloader.java:37)
	at java.lang.ClassLoader.loadClass(ClassLoader.java:424)
	at java.lang.ClassLoader.loadClass(ClassLoader.java:357)
	at org.pitest.mutationtest.engine.gregor.mutators.InlineConstantMutatorTest$HasDoubleMultipleLDC.call(InlineConstantMutatorTest.java:564)
	at org.pitest.mutationtest.engine.gregor.mutators.InlineConstantMutatorTest$HasDoubleMultipleLDC.call(InlineConstantMutatorTest.java:558)
	at org.pitest.mutationtest.engine.gregor.MutatorTestBase.runInClassLoader(MutatorTestBase.java:154)
	at org.pitest.mutationtest.engine.gregor.MutatorTestBase.mutateAndCall(MutatorTestBase.java:119)
	at org.pitest.mutationtest.engine.gregor.MutatorTestBase.assertMutantCallableReturns(MutatorTestBase.java:108)
	at org.pitest.mutationtest.engine.gregor.mutators.InlineConstantMutatorTest.shouldReplaceFirstDoubleMutationPointOnly(InlineConstantMutatorTest.java:574)

shouldOverflowIntegerOnShortMaxValue(org.pitest.mutationtest.engine.gregor.mutators.InlineConstantMutatorTest)  Time elapsed: 0.009 sec  <<< ERROR!
java.lang.NullPointerException: entry
	at java.util.zip.ZipFile.getInputStream(ZipFile.java:346)
	at org.pitest.classpath.ArchiveClassPathRoot.getData(ArchiveClassPathRoot.java:28)
	at org.pitest.classpath.CompoundClassPathRoot.getData(CompoundClassPathRoot.java:27)
	at org.pitest.classpath.ClassPath.getClassData(ClassPath.java:101)
	at org.pitest.mutationtest.execute.DefaultPITClassloader.findClass(DefaultPITClassloader.java:37)
	at java.lang.ClassLoader.loadClass(ClassLoader.java:424)
	at java.lang.ClassLoader.loadClass(ClassLoader.java:357)
	at org.pitest.mutationtest.engine.gregor.mutators.InlineConstantMutatorTest$HasIntegerAtMaxShortValue.call(InlineConstantMutatorTest.java:297)
	at org.pitest.mutationtest.engine.gregor.mutators.InlineConstantMutatorTest$HasIntegerAtMaxShortValue.call(InlineConstantMutatorTest.java:292)
	at org.pitest.mutationtest.engine.gregor.MutatorTestBase.runInClassLoader(MutatorTestBase.java:154)
	at org.pitest.mutationtest.engine.gregor.MutatorTestBase.mutateAndCall(MutatorTestBase.java:119)
	at org.pitest.mutationtest.engine.gregor.MutatorTestBase.assertMutantCallableReturns(MutatorTestBase.java:108)
	at org.pitest.mutationtest.engine.gregor.mutators.InlineConstantMutatorTest.shouldOverflowIntegerOnShortMaxValue(InlineConstantMutatorTest.java:313)

shouldOverflowOnShortMaxValue(org.pitest.mutationtest.engine.gregor.mutators.InlineConstantMutatorTest)  Time elapsed: 0.005 sec  <<< ERROR!
java.lang.NullPointerException: entry
	at java.util.zip.ZipFile.getInputStream(ZipFile.java:346)
	at org.pitest.classpath.ArchiveClassPathRoot.getData(ArchiveClassPathRoot.java:28)
	at org.pitest.classpath.CompoundClassPathRoot.getData(CompoundClassPathRoot.java:27)
	at org.pitest.classpath.ClassPath.getClassData(ClassPath.java:101)
	at org.pitest.mutationtest.execute.DefaultPITClassloader.findClass(DefaultPITClassloader.java:37)
	at java.lang.ClassLoader.loadClass(ClassLoader.java:424)
	at java.lang.ClassLoader.loadClass(ClassLoader.java:357)
	at org.pitest.mutationtest.engine.gregor.mutators.InlineConstantMutatorTest$HasShortOverflow.call(InlineConstantMutatorTest.java:273)
	at org.pitest.mutationtest.engine.gregor.mutators.InlineConstantMutatorTest$HasShortOverflow.call(InlineConstantMutatorTest.java:268)
	at org.pitest.mutationtest.engine.gregor.MutatorTestBase.runInClassLoader(MutatorTestBase.java:154)
	at org.pitest.mutationtest.engine.gregor.MutatorTestBase.mutateAndCall(MutatorTestBase.java:119)
	at org.pitest.mutationtest.engine.gregor.MutatorTestBase.assertMutantCallableReturns(MutatorTestBase.java:108)
	at org.pitest.mutationtest.engine.gregor.mutators.InlineConstantMutatorTest.shouldOverflowOnShortMaxValue(InlineConstantMutatorTest.java:289)

shouldReplaceFirstFloatMutationPointOnly(org.pitest.mutationtest.engine.gregor.mutators.InlineConstantMutatorTest)  Time elapsed: 0.007 sec  <<< ERROR!
java.lang.NullPointerException: entry
	at java.util.zip.ZipFile.getInputStream(ZipFile.java:346)
	at org.pitest.classpath.ArchiveClassPathRoot.getData(ArchiveClassPathRoot.java:28)
	at org.pitest.classpath.CompoundClassPathRoot.getData(CompoundClassPathRoot.java:27)
	at org.pitest.classpath.ClassPath.getClassData(ClassPath.java:101)
	at org.pitest.mutationtest.execute.DefaultPITClassloader.findClass(DefaultPITClassloader.java:37)
	at java.lang.ClassLoader.loadClass(ClassLoader.java:424)
	at java.lang.ClassLoader.loadClass(ClassLoader.java:357)
	at org.pitest.mutationtest.engine.gregor.mutators.InlineConstantMutatorTest$HasFloatMultipleLDC.call(InlineConstantMutatorTest.java:497)
	at org.pitest.mutationtest.engine.gregor.mutators.InlineConstantMutatorTest$HasFloatMultipleLDC.call(InlineConstantMutatorTest.java:491)
	at org.pitest.mutationtest.engine.gregor.MutatorTestBase.runInClassLoader(MutatorTestBase.java:154)
	at org.pitest.mutationtest.engine.gregor.MutatorTestBase.mutateAndCall(MutatorTestBase.java:119)
	at org.pitest.mutationtest.engine.gregor.MutatorTestBase.assertMutantCallableReturns(MutatorTestBase.java:108)
	at org.pitest.mutationtest.engine.gregor.mutators.InlineConstantMutatorTest.shouldReplaceFirstFloatMutationPointOnly(InlineConstantMutatorTest.java:510)

shouldOverflowOnByteMaxValue(org.pitest.mutationtest.engine.gregor.mutators.InlineConstantMutatorTest)  Time elapsed: 0.008 sec  <<< ERROR!
java.lang.NullPointerException: entry
	at java.util.zip.ZipFile.getInputStream(ZipFile.java:346)
	at org.pitest.classpath.ArchiveClassPathRoot.getData(ArchiveClassPathRoot.java:28)
	at org.pitest.classpath.CompoundClassPathRoot.getData(CompoundClassPathRoot.java:27)
	at org.pitest.classpath.ClassPath.getClassData(ClassPath.java:101)
	at org.pitest.mutationtest.execute.DefaultPITClassloader.findClass(DefaultPITClassloader.java:37)
	at java.lang.ClassLoader.loadClass(ClassLoader.java:424)
	at java.lang.ClassLoader.loadClass(ClassLoader.java:357)
	at org.pitest.mutationtest.engine.gregor.mutators.InlineConstantMutatorTest$HasByteOverflow.call(InlineConstantMutatorTest.java:326)
	at org.pitest.mutationtest.engine.gregor.mutators.InlineConstantMutatorTest$HasByteOverflow.call(InlineConstantMutatorTest.java:321)
	at org.pitest.mutationtest.engine.gregor.MutatorTestBase.runInClassLoader(MutatorTestBase.java:154)
	at org.pitest.mutationtest.engine.gregor.MutatorTestBase.mutateAndCall(MutatorTestBase.java:119)
	at org.pitest.mutationtest.engine.gregor.MutatorTestBase.assertMutantCallableReturns(MutatorTestBase.java:108)
	at org.pitest.mutationtest.engine.gregor.mutators.InlineConstantMutatorTest.shouldOverflowOnByteMaxValue(InlineConstantMutatorTest.java:348)

Running org.pitest.mutationtest.engine.gregor.mutators.InvertNegsMutatorTest
Tests run: 4, Failures: 0, Errors: 0, Skipped: 0, Time elapsed: 0.018 sec - in org.pitest.mutationtest.engine.gregor.mutators.InvertNegsMutatorTest
Running org.pitest.mutationtest.engine.gregor.mutators.MathMutatorTest
Tests run: 32, Failures: 0, Errors: 0, Skipped: 0, Time elapsed: 0.263 sec - in org.pitest.mutationtest.engine.gregor.mutators.MathMutatorTest
Running org.pitest.mutationtest.engine.gregor.mutators.NegateConditionalsMutatorTest
package asm.org.pitest.mutationtest.engine.gregor.mutators;
import java.util.*;
import org.objectweb.asm.*;
public class NegateConditionalsMutatorTest$HasIF_ACMPNEDump implements Opcodes {

public static byte[] dump () throws Exception {

ClassWriter cw = new ClassWriter(0);
FieldVisitor fv;
MethodVisitor mv;
AnnotationVisitor av0;

cw.visit(V1_6, ACC_SUPER, "org/pitest/mutationtest/engine/gregor/mutators/NegateConditionalsMutatorTest$HasIF_ACMPNE", "Ljava/lang/Object;Ljava/util/concurrent/Callable<Ljava/lang/String;>;", "java/lang/Object", new String[] { "java/util/concurrent/Callable" });

cw.visitSource("NegateConditionalsMutatorTest.java", null);

cw.visitInnerClass("org/pitest/mutationtest/engine/gregor/mutators/NegateConditionalsMutatorTest$HasIF_ACMPNE", "org/pitest/mutationtest/engine/gregor/mutators/NegateConditionalsMutatorTest", "HasIF_ACMPNE", ACC_PRIVATE + ACC_STATIC);

{
fv = cw.visitField(ACC_PRIVATE + ACC_FINAL, "i", "Ljava/lang/Object;", null, null);
fv.visitEnd();
}
{
mv = cw.visitMethod(0, "<init>", "(Ljava/lang/Object;)V", null, null);
mv.visitCode();
Label l0 = new Label();
mv.visitLabel(l0);
mv.visitLineNumber(388, l0);
mv.visitVarInsn(ALOAD, 0);
mv.visitMethodInsn(INVOKESPECIAL, "java/lang/Object", "<init>", "()V", false);
Label l1 = new Label();
mv.visitLabel(l1);
mv.visitLineNumber(389, l1);
mv.visitVarInsn(ALOAD, 0);
mv.visitVarInsn(ALOAD, 1);
mv.visitFieldInsn(PUTFIELD, "org/pitest/mutationtest/engine/gregor/mutators/NegateConditionalsMutatorTest$HasIF_ACMPNE", "i", "Ljava/lang/Object;");
Label l2 = new Label();
mv.visitLabel(l2);
mv.visitLineNumber(390, l2);
mv.visitInsn(RETURN);
Label l3 = new Label();
mv.visitLabel(l3);
mv.visitLocalVariable("this", "Lorg/pitest/mutationtest/engine/gregor/mutators/NegateConditionalsMutatorTest$HasIF_ACMPNE;", null, l0, l3, 0);
mv.visitLocalVariable("i", "Ljava/lang/Object;", null, l0, l3, 1);
mv.visitMaxs(2, 2);
mv.visitEnd();
}
{
mv = cw.visitMethod(ACC_PUBLIC, "call", "()Ljava/lang/String;", null, null);
mv.visitCode();
Label l0 = new Label();
mv.visitLabel(l0);
mv.visitLineNumber(394, l0);
mv.visitLdcInsn(Type.getType("Ljava/lang/Integer;"));
mv.visitVarInsn(ASTORE, 1);
Label l1 = new Label();
mv.visitLabel(l1);
mv.visitLineNumber(395, l1);
mv.visitVarInsn(ALOAD, 0);
mv.visitFieldInsn(GETFIELD, "org/pitest/mutationtest/engine/gregor/mutators/NegateConditionalsMutatorTest$HasIF_ACMPNE", "i", "Ljava/lang/Object;");
mv.visitVarInsn(ALOAD, 1);
Label l2 = new Label();
mv.visitJumpInsn(IF_ACMPEQ, l2);
Label l3 = new Label();
mv.visitLabel(l3);
mv.visitLineNumber(396, l3);
mv.visitLdcInsn("was integer");
mv.visitInsn(ARETURN);
mv.visitLabel(l2);
mv.visitLineNumber(398, l2);
mv.visitFrame(Opcodes.F_NEW, 2, new Object[] {"org/pitest/mutationtest/engine/gregor/mutators/NegateConditionalsMutatorTest$HasIF_ACMPNE", "java/lang/Object"}, 0, new Object[] {});
mv.visitLdcInsn("was not integer");
mv.visitInsn(ARETURN);
Label l4 = new Label();
mv.visitLabel(l4);
mv.visitLocalVariable("this", "Lorg/pitest/mutationtest/engine/gregor/mutators/NegateConditionalsMutatorTest$HasIF_ACMPNE;", null, l0, l4, 0);
mv.visitLocalVariable("integer", "Ljava/lang/Object;", null, l1, l4, 1);
mv.visitMaxs(2, 2);
mv.visitEnd();
}
{
mv = cw.visitMethod(ACC_PUBLIC + ACC_BRIDGE + ACC_SYNTHETIC, "call", "()Ljava/lang/Object;", null, new String[] { "java/lang/Exception" });
mv.visitCode();
Label l0 = new Label();
mv.visitLabel(l0);
mv.visitLineNumber(385, l0);
mv.visitVarInsn(ALOAD, 0);
mv.visitMethodInsn(INVOKEVIRTUAL, "org/pitest/mutationtest/engine/gregor/mutators/NegateConditionalsMutatorTest$HasIF_ACMPNE", "call", "()Ljava/lang/String;", false);
mv.visitInsn(ARETURN);
Label l1 = new Label();
mv.visitLabel(l1);
mv.visitLocalVariable("this", "Lorg/pitest/mutationtest/engine/gregor/mutators/NegateConditionalsMutatorTest$HasIF_ACMPNE;", null, l0, l1, 0);
mv.visitMaxs(1, 1);
mv.visitEnd();
}
cw.visitEnd();

return cw.toByteArray();
}
}
Tests run: 16, Failures: 0, Errors: 6, Skipped: 0, Time elapsed: 0.175 sec <<< FAILURE! - in org.pitest.mutationtest.engine.gregor.mutators.NegateConditionalsMutatorTest
shouldReplaceHasIF_ICMPLTWithHasIF_ICMPGE(org.pitest.mutationtest.engine.gregor.mutators.NegateConditionalsMutatorTest)  Time elapsed: 0.008 sec  <<< ERROR!
java.lang.NullPointerException: entry
	at java.util.zip.ZipFile.getInputStream(ZipFile.java:346)
	at org.pitest.classpath.ArchiveClassPathRoot.getData(ArchiveClassPathRoot.java:28)
	at org.pitest.classpath.CompoundClassPathRoot.getData(CompoundClassPathRoot.java:27)
	at org.pitest.classpath.ClassPath.getClassData(ClassPath.java:101)
	at org.pitest.mutationtest.execute.DefaultPITClassloader.findClass(DefaultPITClassloader.java:37)
	at java.lang.ClassLoader.loadClass(ClassLoader.java:424)
	at java.lang.ClassLoader.loadClass(ClassLoader.java:357)
	at org.pitest.mutationtest.engine.gregor.mutators.NegateConditionalsMutatorTest$HasIF_ICMPLT.call(NegateConditionalsMutatorTest.java:368)
	at org.pitest.mutationtest.engine.gregor.mutators.NegateConditionalsMutatorTest$HasIF_ICMPLT.call(NegateConditionalsMutatorTest.java:359)
	at org.pitest.mutationtest.engine.gregor.MutatorTestBase.runInClassLoader(MutatorTestBase.java:154)
	at org.pitest.mutationtest.engine.gregor.MutatorTestBase.mutateAndCall(MutatorTestBase.java:119)
	at org.pitest.mutationtest.engine.gregor.MutatorTestBase.assertMutantCallableReturns(MutatorTestBase.java:108)
	at org.pitest.mutationtest.engine.gregor.mutators.NegateConditionalsMutatorTest.shouldReplaceHasIF_ICMPLTWithHasIF_ICMPGE(NegateConditionalsMutatorTest.java:380)

shouldReplaceIF_ICMPGEWithHasIF_ICMPLT(org.pitest.mutationtest.engine.gregor.mutators.NegateConditionalsMutatorTest)  Time elapsed: 0.008 sec  <<< ERROR!
java.lang.NullPointerException: entry
	at java.util.zip.ZipFile.getInputStream(ZipFile.java:346)
	at org.pitest.classpath.ArchiveClassPathRoot.getData(ArchiveClassPathRoot.java:28)
	at org.pitest.classpath.CompoundClassPathRoot.getData(CompoundClassPathRoot.java:27)
	at org.pitest.classpath.ClassPath.getClassData(ClassPath.java:101)
	at org.pitest.mutationtest.execute.DefaultPITClassloader.findClass(DefaultPITClassloader.java:37)
	at java.lang.ClassLoader.loadClass(ClassLoader.java:424)
	at java.lang.ClassLoader.loadClass(ClassLoader.java:357)
	at org.pitest.mutationtest.engine.gregor.mutators.NegateConditionalsMutatorTest$HasIF_ICMPGE.call(NegateConditionalsMutatorTest.java:316)
	at org.pitest.mutationtest.engine.gregor.mutators.NegateConditionalsMutatorTest$HasIF_ICMPGE.call(NegateConditionalsMutatorTest.java:307)
	at org.pitest.mutationtest.engine.gregor.MutatorTestBase.runInClassLoader(MutatorTestBase.java:154)
	at org.pitest.mutationtest.engine.gregor.MutatorTestBase.mutateAndCall(MutatorTestBase.java:119)
	at org.pitest.mutationtest.engine.gregor.MutatorTestBase.assertMutantCallableReturns(MutatorTestBase.java:108)
	at org.pitest.mutationtest.engine.gregor.mutators.NegateConditionalsMutatorTest.shouldReplaceIF_ICMPGEWithHasIF_ICMPLT(NegateConditionalsMutatorTest.java:328)

shouldReplaceHasIF_ICMPGTWithHasIF_ICMPLE(org.pitest.mutationtest.engine.gregor.mutators.NegateConditionalsMutatorTest)  Time elapsed: 0.008 sec  <<< ERROR!
java.lang.NullPointerException: entry
	at java.util.zip.ZipFile.getInputStream(ZipFile.java:346)
	at org.pitest.classpath.ArchiveClassPathRoot.getData(ArchiveClassPathRoot.java:28)
	at org.pitest.classpath.CompoundClassPathRoot.getData(CompoundClassPathRoot.java:27)
	at org.pitest.classpath.ClassPath.getClassData(ClassPath.java:101)
	at org.pitest.mutationtest.execute.DefaultPITClassloader.findClass(DefaultPITClassloader.java:37)
	at java.lang.ClassLoader.loadClass(ClassLoader.java:424)
	at java.lang.ClassLoader.loadClass(ClassLoader.java:357)
	at org.pitest.mutationtest.engine.gregor.mutators.NegateConditionalsMutatorTest$HasIF_ICMPGT.call(NegateConditionalsMutatorTest.java:342)
	at org.pitest.mutationtest.engine.gregor.mutators.NegateConditionalsMutatorTest$HasIF_ICMPGT.call(NegateConditionalsMutatorTest.java:333)
	at org.pitest.mutationtest.engine.gregor.MutatorTestBase.runInClassLoader(MutatorTestBase.java:154)
	at org.pitest.mutationtest.engine.gregor.MutatorTestBase.mutateAndCall(MutatorTestBase.java:119)
	at org.pitest.mutationtest.engine.gregor.MutatorTestBase.assertMutantCallableReturns(MutatorTestBase.java:108)
	at org.pitest.mutationtest.engine.gregor.mutators.NegateConditionalsMutatorTest.shouldReplaceHasIF_ICMPGTWithHasIF_ICMPLE(NegateConditionalsMutatorTest.java:354)

shouldReplaceHasIF_ICMPLEWithHasIF_ICMPGT(org.pitest.mutationtest.engine.gregor.mutators.NegateConditionalsMutatorTest)  Time elapsed: 0.007 sec  <<< ERROR!
java.lang.NullPointerException: entry
	at java.util.zip.ZipFile.getInputStream(ZipFile.java:346)
	at org.pitest.classpath.ArchiveClassPathRoot.getData(ArchiveClassPathRoot.java:28)
	at org.pitest.classpath.CompoundClassPathRoot.getData(CompoundClassPathRoot.java:27)
	at org.pitest.classpath.ClassPath.getClassData(ClassPath.java:101)
	at org.pitest.mutationtest.execute.DefaultPITClassloader.findClass(DefaultPITClassloader.java:37)
	at java.lang.ClassLoader.loadClass(ClassLoader.java:424)
	at java.lang.ClassLoader.loadClass(ClassLoader.java:357)
	at org.pitest.mutationtest.engine.gregor.mutators.NegateConditionalsMutatorTest$HasIF_ICMPLE.call(NegateConditionalsMutatorTest.java:290)
	at org.pitest.mutationtest.engine.gregor.mutators.NegateConditionalsMutatorTest$HasIF_ICMPLE.call(NegateConditionalsMutatorTest.java:281)
	at org.pitest.mutationtest.engine.gregor.MutatorTestBase.runInClassLoader(MutatorTestBase.java:154)
	at org.pitest.mutationtest.engine.gregor.MutatorTestBase.mutateAndCall(MutatorTestBase.java:119)
	at org.pitest.mutationtest.engine.gregor.MutatorTestBase.assertMutantCallableReturns(MutatorTestBase.java:108)
	at org.pitest.mutationtest.engine.gregor.mutators.NegateConditionalsMutatorTest.shouldReplaceHasIF_ICMPLEWithHasIF_ICMPGT(NegateConditionalsMutatorTest.java:302)

shouldReplaceIF_ICMPNEWithIF_CMPEQ(org.pitest.mutationtest.engine.gregor.mutators.NegateConditionalsMutatorTest)  Time elapsed: 0.007 sec  <<< ERROR!
java.lang.NullPointerException: entry
	at java.util.zip.ZipFile.getInputStream(ZipFile.java:346)
	at org.pitest.classpath.ArchiveClassPathRoot.getData(ArchiveClassPathRoot.java:28)
	at org.pitest.classpath.CompoundClassPathRoot.getData(CompoundClassPathRoot.java:27)
	at org.pitest.classpath.ClassPath.getClassData(ClassPath.java:101)
	at org.pitest.mutationtest.execute.DefaultPITClassloader.findClass(DefaultPITClassloader.java:37)
	at java.lang.ClassLoader.loadClass(ClassLoader.java:424)
	at java.lang.ClassLoader.loadClass(ClassLoader.java:357)
	at org.pitest.mutationtest.engine.gregor.mutators.NegateConditionalsMutatorTest$HasIF_ICMPNE.call(NegateConditionalsMutatorTest.java:240)
	at org.pitest.mutationtest.engine.gregor.mutators.NegateConditionalsMutatorTest$HasIF_ICMPNE.call(NegateConditionalsMutatorTest.java:231)
	at org.pitest.mutationtest.engine.gregor.MutatorTestBase.runInClassLoader(MutatorTestBase.java:154)
	at org.pitest.mutationtest.engine.gregor.MutatorTestBase.mutateAndCall(MutatorTestBase.java:119)
	at org.pitest.mutationtest.engine.gregor.MutatorTestBase.assertMutantCallableReturns(MutatorTestBase.java:108)
	at org.pitest.mutationtest.engine.gregor.mutators.NegateConditionalsMutatorTest.shouldReplaceIF_ICMPNEWithIF_CMPEQ(NegateConditionalsMutatorTest.java:252)

shouldReplaceIF_ICMPEQWithIF_CMPNE(org.pitest.mutationtest.engine.gregor.mutators.NegateConditionalsMutatorTest)  Time elapsed: 0.01 sec  <<< ERROR!
java.lang.NullPointerException: entry
	at java.util.zip.ZipFile.getInputStream(ZipFile.java:346)
	at org.pitest.classpath.ArchiveClassPathRoot.getData(ArchiveClassPathRoot.java:28)
	at org.pitest.classpath.CompoundClassPathRoot.getData(CompoundClassPathRoot.java:27)
	at org.pitest.classpath.ClassPath.getClassData(ClassPath.java:101)
	at org.pitest.mutationtest.execute.DefaultPITClassloader.findClass(DefaultPITClassloader.java:37)
	at java.lang.ClassLoader.loadClass(ClassLoader.java:424)
	at java.lang.ClassLoader.loadClass(ClassLoader.java:357)
	at org.pitest.mutationtest.engine.gregor.mutators.NegateConditionalsMutatorTest$HasIF_ICMPEQ.call(NegateConditionalsMutatorTest.java:265)
	at org.pitest.mutationtest.engine.gregor.mutators.NegateConditionalsMutatorTest$HasIF_ICMPEQ.call(NegateConditionalsMutatorTest.java:256)
	at org.pitest.mutationtest.engine.gregor.MutatorTestBase.runInClassLoader(MutatorTestBase.java:154)
	at org.pitest.mutationtest.engine.gregor.MutatorTestBase.mutateAndCall(MutatorTestBase.java:119)
	at org.pitest.mutationtest.engine.gregor.MutatorTestBase.assertMutantCallableReturns(MutatorTestBase.java:108)
	at org.pitest.mutationtest.engine.gregor.mutators.NegateConditionalsMutatorTest.shouldReplaceIF_ICMPEQWithIF_CMPNE(NegateConditionalsMutatorTest.java:277)

Running org.pitest.mutationtest.engine.gregor.mutators.NonVoidMethodCallMutatorTest
Tests run: 14, Failures: 0, Errors: 0, Skipped: 0, Time elapsed: 0.062 sec - in org.pitest.mutationtest.engine.gregor.mutators.NonVoidMethodCallMutatorTest
Running org.pitest.mutationtest.engine.gregor.mutators.RemoveConditionalMutatorTest
Tests run: 69, Failures: 0, Errors: 12, Skipped: 0, Time elapsed: 0.262 sec <<< FAILURE! - in org.pitest.mutationtest.engine.gregor.mutators.RemoveConditionalMutatorTest
shouldReplaceIF_ICMPNE_EQUAL_F(org.pitest.mutationtest.engine.gregor.mutators.RemoveConditionalMutatorTest)  Time elapsed: 0.008 sec  <<< ERROR!
java.lang.NullPointerException: entry
	at java.util.zip.ZipFile.getInputStream(ZipFile.java:346)
	at org.pitest.classpath.ArchiveClassPathRoot.getData(ArchiveClassPathRoot.java:28)
	at org.pitest.classpath.CompoundClassPathRoot.getData(CompoundClassPathRoot.java:27)
	at org.pitest.classpath.ClassPath.getClassData(ClassPath.java:101)
	at org.pitest.mutationtest.execute.DefaultPITClassloader.findClass(DefaultPITClassloader.java:37)
	at java.lang.ClassLoader.loadClass(ClassLoader.java:424)
	at java.lang.ClassLoader.loadClass(ClassLoader.java:357)
	at org.pitest.mutationtest.engine.gregor.mutators.RemoveConditionalMutatorTest$HasIF_ICMPNE.call(RemoveConditionalMutatorTest.java:244)
	at org.pitest.mutationtest.engine.gregor.mutators.RemoveConditionalMutatorTest$HasIF_ICMPNE.call(RemoveConditionalMutatorTest.java:235)
	at org.pitest.mutationtest.engine.gregor.MutatorTestBase.runInClassLoader(MutatorTestBase.java:154)
	at org.pitest.mutationtest.engine.gregor.MutatorTestBase.mutateAndCall(MutatorTestBase.java:119)
	at org.pitest.mutationtest.engine.gregor.MutatorTestBase.assertMutantCallableReturns(MutatorTestBase.java:108)
	at org.pitest.mutationtest.engine.gregor.mutators.RemoveConditionalMutatorTest.shouldReplaceIF_ICMPNE_EQUAL_F(RemoveConditionalMutatorTest.java:267)

shouldReplaceIF_ICMPNE_EQUAL_T(org.pitest.mutationtest.engine.gregor.mutators.RemoveConditionalMutatorTest)  Time elapsed: 0.007 sec  <<< ERROR!
java.lang.NullPointerException: entry
	at java.util.zip.ZipFile.getInputStream(ZipFile.java:346)
	at org.pitest.classpath.ArchiveClassPathRoot.getData(ArchiveClassPathRoot.java:28)
	at org.pitest.classpath.CompoundClassPathRoot.getData(CompoundClassPathRoot.java:27)
	at org.pitest.classpath.ClassPath.getClassData(ClassPath.java:101)
	at org.pitest.mutationtest.execute.DefaultPITClassloader.findClass(DefaultPITClassloader.java:37)
	at java.lang.ClassLoader.loadClass(ClassLoader.java:424)
	at java.lang.ClassLoader.loadClass(ClassLoader.java:357)
	at org.pitest.mutationtest.engine.gregor.mutators.RemoveConditionalMutatorTest$HasIF_ICMPNE.call(RemoveConditionalMutatorTest.java:244)
	at org.pitest.mutationtest.engine.gregor.mutators.RemoveConditionalMutatorTest$HasIF_ICMPNE.call(RemoveConditionalMutatorTest.java:235)
	at org.pitest.mutationtest.engine.gregor.MutatorTestBase.runInClassLoader(MutatorTestBase.java:154)
	at org.pitest.mutationtest.engine.gregor.MutatorTestBase.mutateAndCall(MutatorTestBase.java:119)
	at org.pitest.mutationtest.engine.gregor.MutatorTestBase.assertMutantCallableReturns(MutatorTestBase.java:108)
	at org.pitest.mutationtest.engine.gregor.mutators.RemoveConditionalMutatorTest.shouldReplaceIF_ICMPNE_EQUAL_T(RemoveConditionalMutatorTest.java:258)

shouldReplaceIF_ICMPGT_ORDER_F(org.pitest.mutationtest.engine.gregor.mutators.RemoveConditionalMutatorTest)  Time elapsed: 0.008 sec  <<< ERROR!
java.lang.NullPointerException: entry
	at java.util.zip.ZipFile.getInputStream(ZipFile.java:346)
	at org.pitest.classpath.ArchiveClassPathRoot.getData(ArchiveClassPathRoot.java:28)
	at org.pitest.classpath.CompoundClassPathRoot.getData(CompoundClassPathRoot.java:27)
	at org.pitest.classpath.ClassPath.getClassData(ClassPath.java:101)
	at org.pitest.mutationtest.execute.DefaultPITClassloader.findClass(DefaultPITClassloader.java:37)
	at java.lang.ClassLoader.loadClass(ClassLoader.java:424)
	at java.lang.ClassLoader.loadClass(ClassLoader.java:357)
	at org.pitest.mutationtest.engine.gregor.mutators.RemoveConditionalMutatorTest$HasIF_ICMPGT.call(RemoveConditionalMutatorTest.java:734)
	at org.pitest.mutationtest.engine.gregor.mutators.RemoveConditionalMutatorTest$HasIF_ICMPGT.call(RemoveConditionalMutatorTest.java:725)
	at org.pitest.mutationtest.engine.gregor.MutatorTestBase.runInClassLoader(MutatorTestBase.java:154)
	at org.pitest.mutationtest.engine.gregor.MutatorTestBase.mutateAndCall(MutatorTestBase.java:119)
	at org.pitest.mutationtest.engine.gregor.MutatorTestBase.assertMutantCallableReturns(MutatorTestBase.java:108)
	at org.pitest.mutationtest.engine.gregor.mutators.RemoveConditionalMutatorTest.shouldReplaceIF_ICMPGT_ORDER_F(RemoveConditionalMutatorTest.java:769)

shouldReplaceIF_ICMPGT_ORDER_T(org.pitest.mutationtest.engine.gregor.mutators.RemoveConditionalMutatorTest)  Time elapsed: 0.006 sec  <<< ERROR!
java.lang.NullPointerException: entry
	at java.util.zip.ZipFile.getInputStream(ZipFile.java:346)
	at org.pitest.classpath.ArchiveClassPathRoot.getData(ArchiveClassPathRoot.java:28)
	at org.pitest.classpath.CompoundClassPathRoot.getData(CompoundClassPathRoot.java:27)
	at org.pitest.classpath.ClassPath.getClassData(ClassPath.java:101)
	at org.pitest.mutationtest.execute.DefaultPITClassloader.findClass(DefaultPITClassloader.java:37)
	at java.lang.ClassLoader.loadClass(ClassLoader.java:424)
	at java.lang.ClassLoader.loadClass(ClassLoader.java:357)
	at org.pitest.mutationtest.engine.gregor.mutators.RemoveConditionalMutatorTest$HasIF_ICMPGT.call(RemoveConditionalMutatorTest.java:734)
	at org.pitest.mutationtest.engine.gregor.mutators.RemoveConditionalMutatorTest$HasIF_ICMPGT.call(RemoveConditionalMutatorTest.java:725)
	at org.pitest.mutationtest.engine.gregor.MutatorTestBase.runInClassLoader(MutatorTestBase.java:154)
	at org.pitest.mutationtest.engine.gregor.MutatorTestBase.mutateAndCall(MutatorTestBase.java:119)
	at org.pitest.mutationtest.engine.gregor.MutatorTestBase.assertMutantCallableReturns(MutatorTestBase.java:108)
	at org.pitest.mutationtest.engine.gregor.mutators.RemoveConditionalMutatorTest.shouldReplaceIF_ICMPGT_ORDER_T(RemoveConditionalMutatorTest.java:760)

shouldReplaceIF_ICMPLE_ORDER_F(org.pitest.mutationtest.engine.gregor.mutators.RemoveConditionalMutatorTest)  Time elapsed: 0.008 sec  <<< ERROR!
java.lang.NullPointerException: entry
	at java.util.zip.ZipFile.getInputStream(ZipFile.java:346)
	at org.pitest.classpath.ArchiveClassPathRoot.getData(ArchiveClassPathRoot.java:28)
	at org.pitest.classpath.CompoundClassPathRoot.getData(CompoundClassPathRoot.java:27)
	at org.pitest.classpath.ClassPath.getClassData(ClassPath.java:101)
	at org.pitest.mutationtest.execute.DefaultPITClassloader.findClass(DefaultPITClassloader.java:37)
	at java.lang.ClassLoader.loadClass(ClassLoader.java:424)
	at java.lang.ClassLoader.loadClass(ClassLoader.java:357)
	at org.pitest.mutationtest.engine.gregor.mutators.RemoveConditionalMutatorTest$HasIF_ICMPLE.call(RemoveConditionalMutatorTest.java:638)
	at org.pitest.mutationtest.engine.gregor.mutators.RemoveConditionalMutatorTest$HasIF_ICMPLE.call(RemoveConditionalMutatorTest.java:629)
	at org.pitest.mutationtest.engine.gregor.MutatorTestBase.runInClassLoader(MutatorTestBase.java:154)
	at org.pitest.mutationtest.engine.gregor.MutatorTestBase.mutateAndCall(MutatorTestBase.java:119)
	at org.pitest.mutationtest.engine.gregor.MutatorTestBase.assertMutantCallableReturns(MutatorTestBase.java:108)
	at org.pitest.mutationtest.engine.gregor.mutators.RemoveConditionalMutatorTest.shouldReplaceIF_ICMPLE_ORDER_F(RemoveConditionalMutatorTest.java:673)

shouldReplaceIF_ICMPLE_ORDER_T(org.pitest.mutationtest.engine.gregor.mutators.RemoveConditionalMutatorTest)  Time elapsed: 0.008 sec  <<< ERROR!
java.lang.NullPointerException: entry
	at java.util.zip.ZipFile.getInputStream(ZipFile.java:346)
	at org.pitest.classpath.ArchiveClassPathRoot.getData(ArchiveClassPathRoot.java:28)
	at org.pitest.classpath.CompoundClassPathRoot.getData(CompoundClassPathRoot.java:27)
	at org.pitest.classpath.ClassPath.getClassData(ClassPath.java:101)
	at org.pitest.mutationtest.execute.DefaultPITClassloader.findClass(DefaultPITClassloader.java:37)
	at java.lang.ClassLoader.loadClass(ClassLoader.java:424)
	at java.lang.ClassLoader.loadClass(ClassLoader.java:357)
	at org.pitest.mutationtest.engine.gregor.mutators.RemoveConditionalMutatorTest$HasIF_ICMPLE.call(RemoveConditionalMutatorTest.java:638)
	at org.pitest.mutationtest.engine.gregor.mutators.RemoveConditionalMutatorTest$HasIF_ICMPLE.call(RemoveConditionalMutatorTest.java:629)
	at org.pitest.mutationtest.engine.gregor.MutatorTestBase.runInClassLoader(MutatorTestBase.java:154)
	at org.pitest.mutationtest.engine.gregor.MutatorTestBase.mutateAndCall(MutatorTestBase.java:119)
	at org.pitest.mutationtest.engine.gregor.MutatorTestBase.assertMutantCallableReturns(MutatorTestBase.java:108)
	at org.pitest.mutationtest.engine.gregor.mutators.RemoveConditionalMutatorTest.shouldReplaceIF_ICMPLE_ORDER_T(RemoveConditionalMutatorTest.java:664)

shouldReplaceIF_ICMPEQ_EQUAL_F(org.pitest.mutationtest.engine.gregor.mutators.RemoveConditionalMutatorTest)  Time elapsed: 0.006 sec  <<< ERROR!
java.lang.NullPointerException: entry
	at java.util.zip.ZipFile.getInputStream(ZipFile.java:346)
	at org.pitest.classpath.ArchiveClassPathRoot.getData(ArchiveClassPathRoot.java:28)
	at org.pitest.classpath.CompoundClassPathRoot.getData(CompoundClassPathRoot.java:27)
	at org.pitest.classpath.ClassPath.getClassData(ClassPath.java:101)
	at org.pitest.mutationtest.execute.DefaultPITClassloader.findClass(DefaultPITClassloader.java:37)
	at java.lang.ClassLoader.loadClass(ClassLoader.java:424)
	at java.lang.ClassLoader.loadClass(ClassLoader.java:357)
	at org.pitest.mutationtest.engine.gregor.mutators.RemoveConditionalMutatorTest$HasIF_ICMPEQ.call(RemoveConditionalMutatorTest.java:292)
	at org.pitest.mutationtest.engine.gregor.mutators.RemoveConditionalMutatorTest$HasIF_ICMPEQ.call(RemoveConditionalMutatorTest.java:283)
	at org.pitest.mutationtest.engine.gregor.MutatorTestBase.runInClassLoader(MutatorTestBase.java:154)
	at org.pitest.mutationtest.engine.gregor.MutatorTestBase.mutateAndCall(MutatorTestBase.java:119)
	at org.pitest.mutationtest.engine.gregor.MutatorTestBase.assertMutantCallableReturns(MutatorTestBase.java:108)
	at org.pitest.mutationtest.engine.gregor.mutators.RemoveConditionalMutatorTest.shouldReplaceIF_ICMPEQ_EQUAL_F(RemoveConditionalMutatorTest.java:315)

shouldReplaceIF_ICMPEQ_EQUAL_T(org.pitest.mutationtest.engine.gregor.mutators.RemoveConditionalMutatorTest)  Time elapsed: 0.005 sec  <<< ERROR!
java.lang.NullPointerException: entry
	at java.util.zip.ZipFile.getInputStream(ZipFile.java:346)
	at org.pitest.classpath.ArchiveClassPathRoot.getData(ArchiveClassPathRoot.java:28)
	at org.pitest.classpath.CompoundClassPathRoot.getData(CompoundClassPathRoot.java:27)
	at org.pitest.classpath.ClassPath.getClassData(ClassPath.java:101)
	at org.pitest.mutationtest.execute.DefaultPITClassloader.findClass(DefaultPITClassloader.java:37)
	at java.lang.ClassLoader.loadClass(ClassLoader.java:424)
	at java.lang.ClassLoader.loadClass(ClassLoader.java:357)
	at org.pitest.mutationtest.engine.gregor.mutators.RemoveConditionalMutatorTest$HasIF_ICMPEQ.call(RemoveConditionalMutatorTest.java:292)
	at org.pitest.mutationtest.engine.gregor.mutators.RemoveConditionalMutatorTest$HasIF_ICMPEQ.call(RemoveConditionalMutatorTest.java:283)
	at org.pitest.mutationtest.engine.gregor.MutatorTestBase.runInClassLoader(MutatorTestBase.java:154)
	at org.pitest.mutationtest.engine.gregor.MutatorTestBase.mutateAndCall(MutatorTestBase.java:119)
	at org.pitest.mutationtest.engine.gregor.MutatorTestBase.assertMutantCallableReturns(MutatorTestBase.java:108)
	at org.pitest.mutationtest.engine.gregor.mutators.RemoveConditionalMutatorTest.shouldReplaceIF_ICMPEQ_EQUAL_T(RemoveConditionalMutatorTest.java:306)

shouldReplaceIF_ICMPGE_ORDER_F(org.pitest.mutationtest.engine.gregor.mutators.RemoveConditionalMutatorTest)  Time elapsed: 0.005 sec  <<< ERROR!
java.lang.NullPointerException: entry
	at java.util.zip.ZipFile.getInputStream(ZipFile.java:346)
	at org.pitest.classpath.ArchiveClassPathRoot.getData(ArchiveClassPathRoot.java:28)
	at org.pitest.classpath.CompoundClassPathRoot.getData(CompoundClassPathRoot.java:27)
	at org.pitest.classpath.ClassPath.getClassData(ClassPath.java:101)
	at org.pitest.mutationtest.execute.DefaultPITClassloader.findClass(DefaultPITClassloader.java:37)
	at java.lang.ClassLoader.loadClass(ClassLoader.java:424)
	at java.lang.ClassLoader.loadClass(ClassLoader.java:357)
	at org.pitest.mutationtest.engine.gregor.mutators.RemoveConditionalMutatorTest$HasIF_ICMPGE.call(RemoveConditionalMutatorTest.java:686)
	at org.pitest.mutationtest.engine.gregor.mutators.RemoveConditionalMutatorTest$HasIF_ICMPGE.call(RemoveConditionalMutatorTest.java:677)
	at org.pitest.mutationtest.engine.gregor.MutatorTestBase.runInClassLoader(MutatorTestBase.java:154)
	at org.pitest.mutationtest.engine.gregor.MutatorTestBase.mutateAndCall(MutatorTestBase.java:119)
	at org.pitest.mutationtest.engine.gregor.MutatorTestBase.assertMutantCallableReturns(MutatorTestBase.java:108)
	at org.pitest.mutationtest.engine.gregor.mutators.RemoveConditionalMutatorTest.shouldReplaceIF_ICMPGE_ORDER_F(RemoveConditionalMutatorTest.java:721)

shouldReplaceIF_ICMPGE_ORDER_T(org.pitest.mutationtest.engine.gregor.mutators.RemoveConditionalMutatorTest)  Time elapsed: 0.007 sec  <<< ERROR!
java.lang.NullPointerException: entry
	at java.util.zip.ZipFile.getInputStream(ZipFile.java:346)
	at org.pitest.classpath.ArchiveClassPathRoot.getData(ArchiveClassPathRoot.java:28)
	at org.pitest.classpath.CompoundClassPathRoot.getData(CompoundClassPathRoot.java:27)
	at org.pitest.classpath.ClassPath.getClassData(ClassPath.java:101)
	at org.pitest.mutationtest.execute.DefaultPITClassloader.findClass(DefaultPITClassloader.java:37)
	at java.lang.ClassLoader.loadClass(ClassLoader.java:424)
	at java.lang.ClassLoader.loadClass(ClassLoader.java:357)
	at org.pitest.mutationtest.engine.gregor.mutators.RemoveConditionalMutatorTest$HasIF_ICMPGE.call(RemoveConditionalMutatorTest.java:686)
	at org.pitest.mutationtest.engine.gregor.mutators.RemoveConditionalMutatorTest$HasIF_ICMPGE.call(RemoveConditionalMutatorTest.java:677)
	at org.pitest.mutationtest.engine.gregor.MutatorTestBase.runInClassLoader(MutatorTestBase.java:154)
	at org.pitest.mutationtest.engine.gregor.MutatorTestBase.mutateAndCall(MutatorTestBase.java:119)
	at org.pitest.mutationtest.engine.gregor.MutatorTestBase.assertMutantCallableReturns(MutatorTestBase.java:108)
	at org.pitest.mutationtest.engine.gregor.mutators.RemoveConditionalMutatorTest.shouldReplaceIF_ICMPGE_ORDER_T(RemoveConditionalMutatorTest.java:712)

shouldReplaceIF_ICMPLT_ORDER_F(org.pitest.mutationtest.engine.gregor.mutators.RemoveConditionalMutatorTest)  Time elapsed: 0.007 sec  <<< ERROR!
java.lang.NullPointerException: entry
	at java.util.zip.ZipFile.getInputStream(ZipFile.java:346)
	at org.pitest.classpath.ArchiveClassPathRoot.getData(ArchiveClassPathRoot.java:28)
	at org.pitest.classpath.CompoundClassPathRoot.getData(CompoundClassPathRoot.java:27)
	at org.pitest.classpath.ClassPath.getClassData(ClassPath.java:101)
	at org.pitest.mutationtest.execute.DefaultPITClassloader.findClass(DefaultPITClassloader.java:37)
	at java.lang.ClassLoader.loadClass(ClassLoader.java:424)
	at java.lang.ClassLoader.loadClass(ClassLoader.java:357)
	at org.pitest.mutationtest.engine.gregor.mutators.RemoveConditionalMutatorTest$HasIF_ICMPLT.call(RemoveConditionalMutatorTest.java:782)
	at org.pitest.mutationtest.engine.gregor.mutators.RemoveConditionalMutatorTest$HasIF_ICMPLT.call(RemoveConditionalMutatorTest.java:773)
	at org.pitest.mutationtest.engine.gregor.MutatorTestBase.runInClassLoader(MutatorTestBase.java:154)
	at org.pitest.mutationtest.engine.gregor.MutatorTestBase.mutateAndCall(MutatorTestBase.java:119)
	at org.pitest.mutationtest.engine.gregor.MutatorTestBase.assertMutantCallableReturns(MutatorTestBase.java:108)
	at org.pitest.mutationtest.engine.gregor.mutators.RemoveConditionalMutatorTest.shouldReplaceIF_ICMPLT_ORDER_F(RemoveConditionalMutatorTest.java:817)

shouldReplaceIF_ICMPLT_ORDER_T(org.pitest.mutationtest.engine.gregor.mutators.RemoveConditionalMutatorTest)  Time elapsed: 0.007 sec  <<< ERROR!
java.lang.NullPointerException: entry
	at java.util.zip.ZipFile.getInputStream(ZipFile.java:346)
	at org.pitest.classpath.ArchiveClassPathRoot.getData(ArchiveClassPathRoot.java:28)
	at org.pitest.classpath.CompoundClassPathRoot.getData(CompoundClassPathRoot.java:27)
	at org.pitest.classpath.ClassPath.getClassData(ClassPath.java:101)
	at org.pitest.mutationtest.execute.DefaultPITClassloader.findClass(DefaultPITClassloader.java:37)
	at java.lang.ClassLoader.loadClass(ClassLoader.java:424)
	at java.lang.ClassLoader.loadClass(ClassLoader.java:357)
	at org.pitest.mutationtest.engine.gregor.mutators.RemoveConditionalMutatorTest$HasIF_ICMPLT.call(RemoveConditionalMutatorTest.java:782)
	at org.pitest.mutationtest.engine.gregor.mutators.RemoveConditionalMutatorTest$HasIF_ICMPLT.call(RemoveConditionalMutatorTest.java:773)
	at org.pitest.mutationtest.engine.gregor.MutatorTestBase.runInClassLoader(MutatorTestBase.java:154)
	at org.pitest.mutationtest.engine.gregor.MutatorTestBase.mutateAndCall(MutatorTestBase.java:119)
	at org.pitest.mutationtest.engine.gregor.MutatorTestBase.assertMutantCallableReturns(MutatorTestBase.java:108)
	at org.pitest.mutationtest.engine.gregor.mutators.RemoveConditionalMutatorTest.shouldReplaceIF_ICMPLT_ORDER_T(RemoveConditionalMutatorTest.java:808)

Running org.pitest.mutationtest.engine.gregor.mutators.ReturnValsMutatorTest
Tests run: 12, Failures: 0, Errors: 0, Skipped: 0, Time elapsed: 0.062 sec - in org.pitest.mutationtest.engine.gregor.mutators.ReturnValsMutatorTest
Running org.pitest.mutationtest.engine.gregor.mutators.VoidMethodCallMutatorTest
Tests run: 5, Failures: 0, Errors: 0, Skipped: 0, Time elapsed: 0.019 sec - in org.pitest.mutationtest.engine.gregor.mutators.VoidMethodCallMutatorTest
Running org.pitest.mutationtest.engine.gregor.TestGregorMutater
Tests run: 18, Failures: 0, Errors: 0, Skipped: 0, Time elapsed: 0.048 sec - in org.pitest.mutationtest.engine.gregor.TestGregorMutater
Running org.pitest.mutationtest.engine.gregor.TestTryWithResources
Tests run: 1, Failures: 0, Errors: 0, Skipped: 0, Time elapsed: 0.027 sec - in org.pitest.mutationtest.engine.gregor.TestTryWithResources
Running org.pitest.mutationtest.engine.LocationTest
Tests run: 2, Failures: 0, Errors: 0, Skipped: 0, Time elapsed: 0.016 sec - in org.pitest.mutationtest.engine.LocationTest
Running org.pitest.mutationtest.engine.MutationDetailsTest
Tests run: 1, Failures: 0, Errors: 0, Skipped: 0, Time elapsed: 0.021 sec - in org.pitest.mutationtest.engine.MutationDetailsTest
Running org.pitest.mutationtest.engine.MutationIdentifierTest
Tests run: 13, Failures: 0, Errors: 0, Skipped: 0, Time elapsed: 0.019 sec - in org.pitest.mutationtest.engine.MutationIdentifierTest
Running org.pitest.mutationtest.execute.CheckTestHasFailedResultListenerTest
Tests run: 4, Failures: 0, Errors: 0, Skipped: 0, Time elapsed: 0.001 sec - in org.pitest.mutationtest.execute.CheckTestHasFailedResultListenerTest
Running org.pitest.mutationtest.execute.DefaultReporterTest
Tests run: 3, Failures: 0, Errors: 0, Skipped: 0, Time elapsed: 0.003 sec - in org.pitest.mutationtest.execute.DefaultReporterTest
Running org.pitest.mutationtest.execute.MutationTestSlaveTest
9:45:33 AM PIT >> WARNING : Error during mutation test
org.pitest.util.PitError: foo

Please copy and paste the information and the complete stacktrace below when reporting an issue
VM : Java HotSpot(TM) 64-Bit Server VM
Vendor : Oracle Corporation
Version : 25.60-b23
Uptime : 5193
Input -> 
BootClassPathSupported : true

	at org.pitest.mutationtest.execute.MutationTestWorker.processMutation(MutationTestWorker.java:91)
	at org.pitest.mutationtest.execute.MutationTestWorker.run(MutationTestWorker.java:77)
	at org.pitest.mutationtest.execute.MutationTestSlave.run(MutationTestSlave.java:84)
	at org.pitest.mutationtest.execute.MutationTestSlaveTest.shouldReportErrorWhenOneOccursDuringAnalysis(MutationTestSlaveTest.java:83)
	at sun.reflect.NativeMethodAccessorImpl.invoke0(Native Method)
	at sun.reflect.NativeMethodAccessorImpl.invoke(NativeMethodAccessorImpl.java:62)
	at sun.reflect.DelegatingMethodAccessorImpl.invoke(DelegatingMethodAccessorImpl.java:43)
	at java.lang.reflect.Method.invoke(Method.java:497)
	at org.junit.runners.model.FrameworkMethod$1.runReflectiveCall(FrameworkMethod.java:47)
	at org.junit.internal.runners.model.ReflectiveCallable.run(ReflectiveCallable.java:12)
	at org.junit.runners.model.FrameworkMethod.invokeExplosively(FrameworkMethod.java:44)
	at org.junit.internal.runners.statements.InvokeMethod.evaluate(InvokeMethod.java:17)
	at org.junit.internal.runners.statements.RunBefores.evaluate(RunBefores.java:26)
	at org.junit.runners.ParentRunner.runLeaf(ParentRunner.java:271)
	at org.junit.runners.BlockJUnit4ClassRunner.runChild(BlockJUnit4ClassRunner.java:70)
	at org.junit.runners.BlockJUnit4ClassRunner.runChild(BlockJUnit4ClassRunner.java:50)
	at org.junit.runners.ParentRunner$3.run(ParentRunner.java:238)
	at org.junit.runners.ParentRunner$1.schedule(ParentRunner.java:63)
	at org.junit.runners.ParentRunner.runChildren(ParentRunner.java:236)
	at org.junit.runners.ParentRunner.access$000(ParentRunner.java:53)
	at org.junit.runners.ParentRunner$2.evaluate(ParentRunner.java:229)
	at org.junit.runners.ParentRunner.run(ParentRunner.java:309)
	at org.junit.runners.Suite.runChild(Suite.java:127)
	at org.junit.runners.Suite.runChild(Suite.java:26)
	at org.junit.runners.ParentRunner$3.run(ParentRunner.java:238)
	at org.junit.runners.ParentRunner$1.schedule(ParentRunner.java:63)
	at org.junit.runners.ParentRunner.runChildren(ParentRunner.java:236)
	at org.junit.runners.ParentRunner.access$000(ParentRunner.java:53)
	at org.junit.runners.ParentRunner$2.evaluate(ParentRunner.java:229)
	at org.junit.runners.ParentRunner.run(ParentRunner.java:309)
	at org.junit.runner.JUnitCore.run(JUnitCore.java:160)
	at org.junit.runner.JUnitCore.run(JUnitCore.java:138)
	at org.apache.maven.surefire.junitcore.JUnitCoreWrapper.createRequestAndRun(JUnitCoreWrapper.java:113)
	at org.apache.maven.surefire.junitcore.JUnitCoreWrapper.executeEager(JUnitCoreWrapper.java:85)
	at org.apache.maven.surefire.junitcore.JUnitCoreWrapper.execute(JUnitCoreWrapper.java:54)
	at org.apache.maven.surefire.junitcore.JUnitCoreProvider.invoke(JUnitCoreProvider.java:134)
	at org.apache.maven.surefire.booter.ForkedBooter.invokeProviderInSameClassLoader(ForkedBooter.java:200)
	at org.apache.maven.surefire.booter.ForkedBooter.runSuitesInProcess(ForkedBooter.java:153)
	at org.apache.maven.surefire.booter.ForkedBooter.main(ForkedBooter.java:103)
Tests run: 2, Failures: 0, Errors: 0, Skipped: 0, Time elapsed: 0.01 sec - in org.pitest.mutationtest.execute.MutationTestSlaveTest
Running org.pitest.mutationtest.execute.MutationTestWorkerTest
9:45:33 AM PIT >> WARNING : Mutation MutationDetails [id=MutationIdentifier [location=Location [clazz=foo, method=method, methodDesc=()I], indexes=[1], mutator=mutator], filename=sourceFile, block=0, lineNumber=42, description=desc, testsInOrder=[]] was not viable 
9:45:33 AM PIT >> INFO : No test coverage for mutation  MutationDetails [id=MutationIdentifier [location=Location [clazz=foo, method=method, methodDesc=()I], indexes=[1], mutator=mutator], filename=sourceFile, block=0, lineNumber=42, description=desc, testsInOrder=[]] in method
9:45:33 AM PIT >> INFO : No test coverage for mutation  MutationDetails [id=MutationIdentifier [location=Location [clazz=foo, method=method, methodDesc=()I], indexes=[2], mutator=mutator], filename=sourceFile, block=0, lineNumber=42, description=desc, testsInOrder=[]] in method
Tests run: 5, Failures: 0, Errors: 0, Skipped: 1, Time elapsed: 0.021 sec - in org.pitest.mutationtest.execute.MutationTestWorkerTest
Running org.pitest.mutationtest.execute.MutationTimeoutDecoratorTest
Tests run: 2, Failures: 0, Errors: 0, Skipped: 0, Time elapsed: 0.057 sec - in org.pitest.mutationtest.execute.MutationTimeoutDecoratorTest
Running org.pitest.mutationtest.execute.TimeOutDecoratedTestSourceTest
Tests run: 3, Failures: 0, Errors: 0, Skipped: 0, Time elapsed: 0.002 sec - in org.pitest.mutationtest.execute.TimeOutDecoratedTestSourceTest
Running org.pitest.mutationtest.execute.TimeOutSystemExitSideEffectTest
Tests run: 1, Failures: 0, Errors: 0, Skipped: 0, Time elapsed: 0 sec - in org.pitest.mutationtest.execute.TimeOutSystemExitSideEffectTest
Running org.pitest.mutationtest.filter.LimitNumberOfMutationPerClassFilterTest
Tests run: 4, Failures: 0, Errors: 0, Skipped: 0, Time elapsed: 0.001 sec - in org.pitest.mutationtest.filter.LimitNumberOfMutationPerClassFilterTest
Running org.pitest.mutationtest.filter.LimitNumberOfMutationsPerClassFilterFactoryTest
Tests run: 3, Failures: 0, Errors: 0, Skipped: 0, Time elapsed: 0 sec - in org.pitest.mutationtest.filter.LimitNumberOfMutationsPerClassFilterFactoryTest
Running org.pitest.mutationtest.incremental.DefaultCodeHistoryTest
Tests run: 6, Failures: 0, Errors: 0, Skipped: 0, Time elapsed: 0.008 sec - in org.pitest.mutationtest.incremental.DefaultCodeHistoryTest
Running org.pitest.mutationtest.incremental.FileWriterFactoryTest
Tests run: 3, Failures: 0, Errors: 0, Skipped: 0, Time elapsed: 0.035 sec - in org.pitest.mutationtest.incremental.FileWriterFactoryTest
Running org.pitest.mutationtest.incremental.HistoryListenerTest
Tests run: 1, Failures: 0, Errors: 0, Skipped: 0, Time elapsed: 0 sec - in org.pitest.mutationtest.incremental.HistoryListenerTest
Running org.pitest.mutationtest.incremental.IncrementalAnalyserTest
Tests run: 7, Failures: 0, Errors: 0, Skipped: 0, Time elapsed: 0.009 sec - in org.pitest.mutationtest.incremental.IncrementalAnalyserTest
Running org.pitest.mutationtest.incremental.NullHistoryStoreTest
Tests run: 2, Failures: 0, Errors: 0, Skipped: 0, Time elapsed: 0 sec - in org.pitest.mutationtest.incremental.NullHistoryStoreTest
Running org.pitest.mutationtest.incremental.NullWriterFactoryTest
Tests run: 1, Failures: 0, Errors: 0, Skipped: 0, Time elapsed: 0 sec - in org.pitest.mutationtest.incremental.NullWriterFactoryTest
Running org.pitest.mutationtest.incremental.XStreamHistoryStoreTest
9:45:33 AM PIT >> WARNING : Could not read previous results
Tests run: 4, Failures: 0, Errors: 0, Skipped: 0, Time elapsed: 0.011 sec - in org.pitest.mutationtest.incremental.XStreamHistoryStoreTest
Running org.pitest.mutationtest.mocksupport.BendJavassistToMyWillTransformerTest
Tests run: 2, Failures: 0, Errors: 0, Skipped: 0, Time elapsed: 0.011 sec - in org.pitest.mutationtest.mocksupport.BendJavassistToMyWillTransformerTest
Running org.pitest.mutationtest.mocksupport.JavassistInputStreamInterceptorAdapaterTest
Tests run: 4, Failures: 0, Errors: 0, Skipped: 0, Time elapsed: 0.001 sec - in org.pitest.mutationtest.mocksupport.JavassistInputStreamInterceptorAdapaterTest
Running org.pitest.mutationtest.mocksupport.JavassistInterceptorTest
Tests run: 3, Failures: 0, Errors: 0, Skipped: 0, Time elapsed: 0.003 sec - in org.pitest.mutationtest.mocksupport.JavassistInterceptorTest
Running org.pitest.mutationtest.MutationMetaDataTest
Tests run: 3, Failures: 0, Errors: 0, Skipped: 0, Time elapsed: 0.01 sec - in org.pitest.mutationtest.MutationMetaDataTest
Running org.pitest.mutationtest.MutationResultTest
Tests run: 4, Failures: 0, Errors: 0, Skipped: 0, Time elapsed: 0.031 sec - in org.pitest.mutationtest.MutationResultTest
Running org.pitest.mutationtest.MutationStatusMapTest
Tests run: 8, Failures: 0, Errors: 0, Skipped: 0, Time elapsed: 0.003 sec - in org.pitest.mutationtest.MutationStatusMapTest
Running org.pitest.mutationtest.MutationStatusTestPairTest
Tests run: 1, Failures: 0, Errors: 0, Skipped: 0, Time elapsed: 0.019 sec - in org.pitest.mutationtest.MutationStatusTestPairTest
Running org.pitest.mutationtest.report.csv.CSVReportListenerTest
Tests run: 2, Failures: 0, Errors: 0, Skipped: 0, Time elapsed: 0.006 sec - in org.pitest.mutationtest.report.csv.CSVReportListenerTest
Running org.pitest.mutationtest.report.xml.XMLReportListenerTest
Tests run: 4, Failures: 0, Errors: 0, Skipped: 0, Time elapsed: 0.001 sec - in org.pitest.mutationtest.report.xml.XMLReportListenerTest
Running org.pitest.mutationtest.statistics.MutationStatisticsListenerTest
Tests run: 1, Failures: 0, Errors: 0, Skipped: 0, Time elapsed: 0 sec - in org.pitest.mutationtest.statistics.MutationStatisticsListenerTest
Running org.pitest.mutationtest.statistics.MutationStatisticsTest
Tests run: 10, Failures: 0, Errors: 0, Skipped: 0, Time elapsed: 0.009 sec - in org.pitest.mutationtest.statistics.MutationStatisticsTest
Running org.pitest.mutationtest.statistics.ScoreTest
Tests run: 13, Failures: 0, Errors: 0, Skipped: 0, Time elapsed: 0.002 sec - in org.pitest.mutationtest.statistics.ScoreTest
Running org.pitest.mutationtest.tooling.DirectorySourceLocatorTest
Tests run: 2, Failures: 0, Errors: 0, Skipped: 0, Time elapsed: 0.004 sec - in org.pitest.mutationtest.tooling.DirectorySourceLocatorTest
Running org.pitest.mutationtest.tooling.JarCreatingJarFinderTest
Tests run: 9, Failures: 0, Errors: 0, Skipped: 0, Time elapsed: 0.031 sec - in org.pitest.mutationtest.tooling.JarCreatingJarFinderTest
Running org.pitest.mutationtest.tooling.SpinnerListenerTest
Tests run: 1, Failures: 0, Errors: 0, Skipped: 0, Time elapsed: 0 sec - in org.pitest.mutationtest.tooling.SpinnerListenerTest
Running org.pitest.mutationtest.verify.DefaultBuildVerifierTest
Tests run: 4, Failures: 0, Errors: 0, Skipped: 0, Time elapsed: 0.003 sec - in org.pitest.mutationtest.verify.DefaultBuildVerifierTest
Running org.pitest.process.KnownLocationJavaExecutableLocatorTest
Tests run: 1, Failures: 0, Errors: 0, Skipped: 0, Time elapsed: 0 sec - in org.pitest.process.KnownLocationJavaExecutableLocatorTest
Running org.pitest.process.WrappingProcessTest
Tests run: 1, Failures: 0, Errors: 0, Skipped: 0, Time elapsed: 0.265 sec - in org.pitest.process.WrappingProcessTest
Running org.pitest.reflection.ReflectionTest
Tests run: 4, Failures: 0, Errors: 0, Skipped: 0, Time elapsed: 0.001 sec - in org.pitest.reflection.ReflectionTest
Running org.pitest.simpletest.EqualitySetTest
Tests run: 8, Failures: 0, Errors: 0, Skipped: 0, Time elapsed: 0.001 sec - in org.pitest.simpletest.EqualitySetTest
Running org.pitest.simpletest.NoArgsConstructorInstantiationStrategyTest
Tests run: 2, Failures: 0, Errors: 0, Skipped: 0, Time elapsed: 0 sec - in org.pitest.simpletest.NoArgsConstructorInstantiationStrategyTest
Running org.pitest.simpletest.SignatureEqualityStrategyTest
Tests run: 3, Failures: 0, Errors: 0, Skipped: 0, Time elapsed: 0.003 sec - in org.pitest.simpletest.SignatureEqualityStrategyTest
Running org.pitest.simpletest.steps.CallStepTest
Tests run: 1, Failures: 0, Errors: 0, Skipped: 0, Time elapsed: 0.001 sec - in org.pitest.simpletest.steps.CallStepTest
Running org.pitest.simpletest.steps.NoArgsInstantiateStepTest
Tests run: 2, Failures: 0, Errors: 0, Skipped: 0, Time elapsed: 0.001 sec - in org.pitest.simpletest.steps.NoArgsInstantiateStepTest
Running org.pitest.simpletest.TestMethodTest
Tests run: 1, Failures: 0, Errors: 0, Skipped: 0, Time elapsed: 0.001 sec - in org.pitest.simpletest.TestMethodTest
Running org.pitest.testapi.DescriptionTest
Tests run: 1, Failures: 0, Errors: 0, Skipped: 0, Time elapsed: 0 sec - in org.pitest.testapi.DescriptionTest
Running org.pitest.testapi.execute.ExitingResultCollectorTest
Tests run: 5, Failures: 0, Errors: 0, Skipped: 0, Time elapsed: 0.002 sec - in org.pitest.testapi.execute.ExitingResultCollectorTest
Running org.pitest.testapi.execute.MultipleTestGroupTest
Tests run: 3, Failures: 0, Errors: 0, Skipped: 0, Time elapsed: 0.017 sec - in org.pitest.testapi.execute.MultipleTestGroupTest
Running org.pitest.testapi.execute.ResultTypeTest
Tests run: 4, Failures: 0, Errors: 0, Skipped: 0, Time elapsed: 0.003 sec - in org.pitest.testapi.execute.ResultTypeTest
Running org.pitest.testapi.execute.TestPitest
Tests run: 12, Failures: 0, Errors: 0, Skipped: 0, Time elapsed: 0.014 sec - in org.pitest.testapi.execute.TestPitest
Running org.pitest.TestJUnitConfiguration
1
> 1
2
> 2
3
> 3
[AdaptedJUnitTestUnit [clazz=class org.pitest.TestJUnitConfiguration$MarkerTest1, filter=Some(one(org.pitest.TestJUnitConfiguration$MarkerTest1))], AdaptedJUnitTestUnit [clazz=class org.pitest.TestJUnitConfiguration$MarkerTest1, filter=Some(two(org.pitest.TestJUnitConfiguration$MarkerTest1))], AdaptedJUnitTestUnit [clazz=class org.pitest.TestJUnitConfiguration$MarkerTest2, filter=Some(one(org.pitest.TestJUnitConfiguration$MarkerTest2))], AdaptedJUnitTestUnit [clazz=class org.pitest.TestJUnitConfiguration$MarkerTest2, filter=Some(two(org.pitest.TestJUnitConfiguration$MarkerTest2))]]
java.lang.InterruptedException: sleep interrupted
	at java.lang.Thread.sleep(Native Method)
	at org.pitest.TestJUnitConfiguration$TestWithTimeout.testBar(TestJUnitConfiguration.java:262)
	at sun.reflect.NativeMethodAccessorImpl.invoke0(Native Method)
	at sun.reflect.NativeMethodAccessorImpl.invoke(NativeMethodAccessorImpl.java:62)
	at sun.reflect.DelegatingMethodAccessorImpl.invoke(DelegatingMethodAccessorImpl.java:43)
	at java.lang.reflect.Method.invoke(Method.java:497)
	at org.junit.runners.model.FrameworkMethod$1.runReflectiveCall(FrameworkMethod.java:47)
	at org.junit.internal.runners.model.ReflectiveCallable.run(ReflectiveCallable.java:12)
	at org.junit.runners.model.FrameworkMethod.invokeExplosively(FrameworkMethod.java:44)
	at org.junit.internal.runners.statements.InvokeMethod.evaluate(InvokeMethod.java:17)
	at org.junit.internal.runners.statements.FailOnTimeout$StatementThread.run(FailOnTimeout.java:74)
Tests run: 25, Failures: 0, Errors: 0, Skipped: 0, Time elapsed: 0.114 sec - in org.pitest.TestJUnitConfiguration
Running org.pitest.testng.TestNGAdapterTest
Tests run: 6, Failures: 0, Errors: 0, Skipped: 0, Time elapsed: 0.022 sec - in org.pitest.testng.TestNGAdapterTest
Running org.pitest.testng.TestNGConfigurationTest
Tests run: 1, Failures: 0, Errors: 0, Skipped: 0, Time elapsed: 0.001 sec - in org.pitest.testng.TestNGConfigurationTest
Running org.pitest.testng.TestNGTestClassIdentifierTest
Tests run: 4, Failures: 0, Errors: 0, Skipped: 0, Time elapsed: 0.005 sec - in org.pitest.testng.TestNGTestClassIdentifierTest
Running org.pitest.testng.TestNGTestUnitFinderTest
Tests run: 3, Failures: 0, Errors: 0, Skipped: 0, Time elapsed: 0.002 sec - in org.pitest.testng.TestNGTestUnitFinderTest
Running org.pitest.testng.TestNGTestUnitTest
[TestNG] Running:
  com.example.testng.HasGroups


===============================================
com.example.testng.HasGroups
Total tests run: 2, Failures: 0, Skips: 0
===============================================

[TestNG] Running:
  com.example.testng.HasGroups


===============================================
com.example.testng.HasGroups
Total tests run: 2, Failures: 0, Skips: 0
===============================================

[TestNG] Running:
  com.example.testng.Passes


===============================================
com.example.testng.Passes
Total tests run: 1, Failures: 0, Skips: 0
===============================================

[TestNG] Running:
  com.example.testng.Passes


===============================================
com.example.testng.Passes
Total tests run: 1, Failures: 0, Skips: 0
===============================================

[TestNG] Running:
  com.example.testng.Passes


===============================================
com.example.testng.Passes
Total tests run: 1, Failures: 0, Skips: 0
===============================================

[TestNG] Running:
  com.example.testng.Fails


===============================================
com.example.testng.Fails
Total tests run: 2, Failures: 1, Skips: 1
===============================================

[TestNG] Running:
  com.example.testng.Passes


===============================================
com.example.testng.Passes
Total tests run: 1, Failures: 0, Skips: 0
===============================================

[TestNG] Running:
  com.example.testng.Fails


===============================================
com.example.testng.Fails
Total tests run: 2, Failures: 1, Skips: 1
===============================================

[TestNG] Running:
  com.example.testng.Fails


===============================================
com.example.testng.Fails
Total tests run: 2, Failures: 1, Skips: 1
===============================================

[TestNG] Running:
  com.example.testng.Passes


===============================================
com.example.testng.Passes
Total tests run: 1, Failures: 0, Skips: 0
===============================================

[TestNG] Running:
  com.example.testng.Fails


===============================================
com.example.testng.Fails
Total tests run: 2, Failures: 1, Skips: 1
===============================================

[TestNG] Running:
  com.example.testng.Passes


===============================================
com.example.testng.Passes
Total tests run: 1, Failures: 0, Skips: 0
===============================================

[TestNG] Running:
  com.example.testng.Skips


===============================================
com.example.testng.Skips
Total tests run: 1, Failures: 0, Skips: 1
===============================================

[TestNG] Running:
  com.example.testng.Skips


===============================================
com.example.testng.Skips
Total tests run: 1, Failures: 0, Skips: 1
===============================================

Tests run: 14, Failures: 0, Errors: 0, Skipped: 0, Time elapsed: 0.212 sec - in org.pitest.testng.TestNGTestUnitTest
Running org.pitest.TestResultTest
Tests run: 1, Failures: 0, Errors: 0, Skipped: 0, Time elapsed: 0 sec - in org.pitest.TestResultTest
Running org.pitest.util.FunctionsTest
Tests run: 6, Failures: 0, Errors: 0, Skipped: 0, Time elapsed: 0.002 sec - in org.pitest.util.FunctionsTest
Running org.pitest.util.GlobTest
Tests run: 9, Failures: 0, Errors: 0, Skipped: 0, Time elapsed: 0.001 sec - in org.pitest.util.GlobTest
Running org.pitest.util.InputStreamLineIterableTest
Tests run: 6, Failures: 0, Errors: 0, Skipped: 0, Time elapsed: 0.002 sec - in org.pitest.util.InputStreamLineIterableTest
Running org.pitest.util.IsolationUtilsTest
Tests run: 4, Failures: 0, Errors: 0, Skipped: 0, Time elapsed: 0.005 sec - in org.pitest.util.IsolationUtilsTest
Running org.pitest.util.MemoryMonitorTest

DUMPING MEMORY INFO

Heap Memory Usage: init = 134217728(131072K) used = 32141240(31387K) committed = 275775488(269312K) max = 1908932608(1864192K)
Non-Heap Memory Usage: init = 2555904(2496K) used = 39465360(38540K) committed = 45875200(44800K) max = -1(-1K)

Name: PS Scavenge
Collection count: 6
Collection time: 83
Memory Pools: 
	PS Eden Space
	PS Survivor Space

Name: PS MarkSweep
Collection count: 1
Collection time: 65
Memory Pools: 
	PS Eden Space
	PS Survivor Space
	PS Old Gen
Memory Pools Info

Name: Code Cache
Usage: init = 2555904(2496K) used = 12006720(11725K) committed = 13893632(13568K) max = 251658240(245760K)
Collection Usage: null
Peak Usage: init = 2555904(2496K) used = 13828224(13504K) committed = 13893632(13568K) max = 251658240(245760K)
Type: Non-heap memory
Memory Manager Names: 
	CodeCacheManager



Name: Metaspace
Usage: init = 0(0K) used = 24322896(23752K) committed = 28180480(27520K) max = -1(-1K)
Collection Usage: null
Peak Usage: init = 0(0K) used = 24322896(23752K) committed = 28180480(27520K) max = -1(-1K)
Type: Non-heap memory
Memory Manager Names: 
	Metaspace Manager



Name: Compressed Class Space
Usage: init = 0(0K) used = 3190944(3116K) committed = 3801088(3712K) max = 1073741824(1048576K)
Collection Usage: null
Peak Usage: init = 0(0K) used = 3190944(3116K) committed = 3801088(3712K) max = 1073741824(1048576K)
Type: Non-heap memory
Memory Manager Names: 
	Metaspace Manager



Name: PS Eden Space
Usage: init = 34078720(33280K) used = 12581416(12286K) committed = 198705152(194048K) max = 692584448(676352K)
Collection Usage: init = 34078720(33280K) used = 0(0K) committed = 198705152(194048K) max = 692584448(676352K)
Peak Usage: init = 34078720(33280K) used = 136314880(133120K) committed = 198705152(194048K) max = 705167360(688640K)
Type: Heap memory
Memory Manager Names: 
	PS MarkSweep
	PS Scavenge



Name: PS Survivor Space
Usage: init = 5242880(5120K) used = 10034792(9799K) committed = 10485760(10240K) max = 10485760(10240K)
Collection Usage: init = 5242880(5120K) used = 10034792(9799K) committed = 10485760(10240K) max = 10485760(10240K)
Peak Usage: init = 5242880(5120K) used = 10034792(9799K) committed = 10485760(10240K) max = 10485760(10240K)
Type: Heap memory
Memory Manager Names: 
	PS MarkSweep
	PS Scavenge



Name: PS Old Gen
Usage: init = 89653248(87552K) used = 9525032(9301K) committed = 66584576(65024K) max = 1431830528(1398272K)
Collection Usage: init = 89653248(87552K) used = 9525032(9301K) committed = 66584576(65024K) max = 1431830528(1398272K)
Peak Usage: init = 89653248(87552K) used = 11397936(11130K) committed = 89653248(87552K) max = 1431830528(1398272K)
Type: Heap memory
Memory Manager Names: 
	PS MarkSweep


Tests run: 1, Failures: 0, Errors: 0, Skipped: 0, Time elapsed: 0.013 sec - in org.pitest.util.MemoryMonitorTest
Running org.pitest.util.SafeDataInputStreamTest
Tests run: 1, Failures: 0, Errors: 0, Skipped: 0, Time elapsed: 0.001 sec - in org.pitest.util.SafeDataInputStreamTest
Running org.pitest.util.ServiceLoaderTest
Tests run: 2, Failures: 0, Errors: 0, Skipped: 0, Time elapsed: 0 sec - in org.pitest.util.ServiceLoaderTest
Running org.pitest.util.SocketFinderTest
Tests run: 1, Failures: 0, Errors: 0, Skipped: 0, Time elapsed: 0.012 sec - in org.pitest.util.SocketFinderTest
Running org.pitest.util.SocketReadingCallableTest
Tests run: 4, Failures: 0, Errors: 0, Skipped: 0, Time elapsed: 0.021 sec - in org.pitest.util.SocketReadingCallableTest
Running org.pitest.util.StreamUtilTest
Tests run: 2, Failures: 0, Errors: 0, Skipped: 0, Time elapsed: 0 sec - in org.pitest.util.StreamUtilTest
Running org.pitest.util.StringUtilTest
Tests run: 4, Failures: 0, Errors: 0, Skipped: 0, Time elapsed: 0 sec - in org.pitest.util.StringUtilTest
Running org.pitest.util.TimeSpanTest
Tests run: 4, Failures: 0, Errors: 0, Skipped: 0, Time elapsed: 0 sec - in org.pitest.util.TimeSpanTest

Results :

Failed tests: 
  ArchiveClassPathRootTest.getDataShouldReturnInputStreamForAKnownClass:59 null

Tests in error: 
  ArchiveClassPathRootTest.getDataShouldReturnNullForUnknownClass:54 » NullPointer
  ArchiveClassPathRootTest.shouldReturnAReadableInputStream:67 NullPointer
  SettingsFactoryTest.shouldNotAllowUserToCalculateCoverageForCoverageImplementation:102 » NullPointer
  SettingsFactoryTest.shouldReturnTheLegacyTestFrameworkPluginWhenNoOtherOnClasspath:36 » NullPointer
  SettingsFactoryTest.shouldNotAllowUserToCalculateCoverageForCoreClasses:94 » NullPointer
  ArgumentPropagationMutatorTest.alsoReplaceCallToMethodWhenReturnValueIsNotUsed:185->MutatorTestBase.assertMutantCallableReturns:108->MutatorTestBase.mutateAndCall:119->MutatorTestBase.runInClassLoader:152 » Pit
  ArgumentPropagationMutatorTest.shouldReplaceInstanceMethodCallThatIsUsedAsArgumentForCallToOtherObject:268->MutatorTestBase.assertMutantCallableReturns:108->MutatorTestBase.mutateAndCall:119->MutatorTestBase.runInClassLoader:152 » Pit
  ArgumentPropagationMutatorTest.continuesUntilMatchingArgumentTypeIsFound:128->MutatorTestBase.assertMutantCallableReturns:108->MutatorTestBase.mutateAndCall:119->MutatorTestBase.runInClassLoader:152 » Pit
  ArgumentPropagationMutatorTest.usesLastArgumentOfMatchingTypeToReplaceMethod:157->MutatorTestBase.assertMutantCallableReturns:108->MutatorTestBase.mutateAndCall:119->MutatorTestBase.runInClassLoader:152 » Pit
  ConditionalsBoundaryMutatorTest.shouldReplaceIF_ICMPLTwithIF_ICMPGT:242->MutatorTestBase.assertMutantCallableReturns:108->MutatorTestBase.mutateAndCall:119->MutatorTestBase.runInClassLoader:154 » NullPointer
  ConditionalsBoundaryMutatorTest.shouldReplaceIF_ICMPGEwithIF_ICMPGT:190->MutatorTestBase.assertMutantCallableReturns:108->MutatorTestBase.mutateAndCall:119->MutatorTestBase.runInClassLoader:154 » NullPointer
  ConditionalsBoundaryMutatorTest.shouldReplaceIF_ICMPGTwithIF_ICMPGE:216->MutatorTestBase.assertMutantCallableReturns:108->MutatorTestBase.mutateAndCall:119->MutatorTestBase.runInClassLoader:154 » NullPointer
  ConditionalsBoundaryMutatorTest.shouldReplaceICMPLEwithIF_ICMPLT:164->MutatorTestBase.assertMutantCallableReturns:108->MutatorTestBase.mutateAndCall:119->MutatorTestBase.runInClassLoader:154 » NullPointer
  MemberVariableMutatorTest.shouldRemoveAssignmentToMemberVariable:65->MutatorTestBase.assertMutantCallableReturns:108->MutatorTestBase.mutateAndCall:119->MutatorTestBase.runInClassLoader:154 » NullPointer
  ReturnValuesMutatorTest.shouldMutateReturnOfBooleanTrueToFalse:223->MutatorTestBase.assertMutantCallableReturns:108->MutatorTestBase.mutateAndCall:119->MutatorTestBase.runInClassLoader:154 » NullPointer
  ReturnValuesMutatorTest.shouldMutateReturnOfLongToValuePlus1:299->MutatorTestBase.assertMutantCallableReturns:108->MutatorTestBase.mutateAndCall:119->MutatorTestBase.runInClassLoader:154 » NullPointer
  ReturnValuesMutatorTest.shouldMutateReturnOfInteger1To0:271->MutatorTestBase.assertMutantCallableReturns:108->MutatorTestBase.mutateAndCall:119->MutatorTestBase.runInClassLoader:154 » NullPointer
  ReturnValuesMutatorTest.shouldMutateReturnsOfNonNullObjectsToNull:335->MutatorTestBase.assertMutantCallableReturns:108->MutatorTestBase.mutateAndCall:119->MutatorTestBase.runInClassLoader:154 » NullPointer
  ReturnValuesMutatorTest.cannotMutateReturnOfBooleanIfDeclaredAsObject:244->MutatorTestBase.assertMutantCallableReturns:108->MutatorTestBase.mutateAndCall:119->MutatorTestBase.runInClassLoader:154 » NullPointer
  ReturnValuesMutatorTest.shouldMutateReturnOfIntegerToValuePlus1:264->MutatorTestBase.assertMutantCallableReturns:108->MutatorTestBase.mutateAndCall:119->MutatorTestBase.runInClassLoader:154 » NullPointer
  ReturnValuesMutatorTest.shouldMutateReturnOfBooleanNullToTrue:237->MutatorTestBase.assertMutantCallableReturns:108->MutatorTestBase.mutateAndCall:119->MutatorTestBase.runInClassLoader:154 » NullPointer
  ReturnValuesMutatorTest.cannotDetectGenericsStuff »  Unexpected exception, exp...
  ReturnValuesMutatorTest.shouldMutateReturnOfBooleanFalseToTrue:230->MutatorTestBase.assertMutantCallableReturns:108->MutatorTestBase.mutateAndCall:119->MutatorTestBase.runInClassLoader:154 » NullPointer
  ReturnValuesMutatorTest.cannotMutateReturnOfIntegerIfDeclaredAsObject:314->MutatorTestBase.assertMutantCallableReturns:108->MutatorTestBase.mutateAndCall:119->MutatorTestBase.runInClassLoader:154 » NullPointer
  ReturnValuesMutatorTest.shouldMutateReturnOfLongNullToOne:307->MutatorTestBase.assertMutantCallableReturns:108->MutatorTestBase.mutateAndCall:119->MutatorTestBase.runInClassLoader:154 » NullPointer
  ReturnValuesMutatorTest.shouldMutateReturnsOfNonNullCustomObjectsToNull:365->MutatorTestBase.assertMutantCallableReturns:108->MutatorTestBase.mutateAndCall:119->MutatorTestBase.runInClassLoader:154 » NullPointer
  ReturnValuesMutatorTest.shouldMutateReturnOfIntegerNullToOne:278->MutatorTestBase.assertMutantCallableReturns:108->MutatorTestBase.mutateAndCall:119->MutatorTestBase.runInClassLoader:154 » NullPointer
  ReturnValuesMutatorTest.shouldMutateReturnsOfNullObjectsToNewObject:341->MutatorTestBase.mutateAndCall:119->MutatorTestBase.runInClassLoader:154 » NullPointer
  InlineConstantMutatorTest.shouldReplaceFirstDoubleMutationPointOnly:574->MutatorTestBase.assertMutantCallableReturns:108->MutatorTestBase.mutateAndCall:119->MutatorTestBase.runInClassLoader:154 » NullPointer
  InlineConstantMutatorTest.shouldOverflowIntegerOnShortMaxValue:313->MutatorTestBase.assertMutantCallableReturns:108->MutatorTestBase.mutateAndCall:119->MutatorTestBase.runInClassLoader:154 » NullPointer
  InlineConstantMutatorTest.shouldOverflowOnShortMaxValue:289->MutatorTestBase.assertMutantCallableReturns:108->MutatorTestBase.mutateAndCall:119->MutatorTestBase.runInClassLoader:154 » NullPointer
  InlineConstantMutatorTest.shouldReplaceFirstFloatMutationPointOnly:510->MutatorTestBase.assertMutantCallableReturns:108->MutatorTestBase.mutateAndCall:119->MutatorTestBase.runInClassLoader:154 » NullPointer
  InlineConstantMutatorTest.shouldOverflowOnByteMaxValue:348->MutatorTestBase.assertMutantCallableReturns:108->MutatorTestBase.mutateAndCall:119->MutatorTestBase.runInClassLoader:154 » NullPointer
  NegateConditionalsMutatorTest.shouldReplaceHasIF_ICMPLTWithHasIF_ICMPGE:380->MutatorTestBase.assertMutantCallableReturns:108->MutatorTestBase.mutateAndCall:119->MutatorTestBase.runInClassLoader:154 » NullPointer
  NegateConditionalsMutatorTest.shouldReplaceIF_ICMPGEWithHasIF_ICMPLT:328->MutatorTestBase.assertMutantCallableReturns:108->MutatorTestBase.mutateAndCall:119->MutatorTestBase.runInClassLoader:154 » NullPointer
  NegateConditionalsMutatorTest.shouldReplaceHasIF_ICMPGTWithHasIF_ICMPLE:354->MutatorTestBase.assertMutantCallableReturns:108->MutatorTestBase.mutateAndCall:119->MutatorTestBase.runInClassLoader:154 » NullPointer
  NegateConditionalsMutatorTest.shouldReplaceHasIF_ICMPLEWithHasIF_ICMPGT:302->MutatorTestBase.assertMutantCallableReturns:108->MutatorTestBase.mutateAndCall:119->MutatorTestBase.runInClassLoader:154 » NullPointer
  NegateConditionalsMutatorTest.shouldReplaceIF_ICMPNEWithIF_CMPEQ:252->MutatorTestBase.assertMutantCallableReturns:108->MutatorTestBase.mutateAndCall:119->MutatorTestBase.runInClassLoader:154 » NullPointer
  NegateConditionalsMutatorTest.shouldReplaceIF_ICMPEQWithIF_CMPNE:277->MutatorTestBase.assertMutantCallableReturns:108->MutatorTestBase.mutateAndCall:119->MutatorTestBase.runInClassLoader:154 » NullPointer
  RemoveConditionalMutatorTest.shouldReplaceIF_ICMPNE_EQUAL_F:267->MutatorTestBase.assertMutantCallableReturns:108->MutatorTestBase.mutateAndCall:119->MutatorTestBase.runInClassLoader:154 » NullPointer
  RemoveConditionalMutatorTest.shouldReplaceIF_ICMPNE_EQUAL_T:258->MutatorTestBase.assertMutantCallableReturns:108->MutatorTestBase.mutateAndCall:119->MutatorTestBase.runInClassLoader:154 » NullPointer
  RemoveConditionalMutatorTest.shouldReplaceIF_ICMPGT_ORDER_F:769->MutatorTestBase.assertMutantCallableReturns:108->MutatorTestBase.mutateAndCall:119->MutatorTestBase.runInClassLoader:154 » NullPointer
  RemoveConditionalMutatorTest.shouldReplaceIF_ICMPGT_ORDER_T:760->MutatorTestBase.assertMutantCallableReturns:108->MutatorTestBase.mutateAndCall:119->MutatorTestBase.runInClassLoader:154 » NullPointer
  RemoveConditionalMutatorTest.shouldReplaceIF_ICMPLE_ORDER_F:673->MutatorTestBase.assertMutantCallableReturns:108->MutatorTestBase.mutateAndCall:119->MutatorTestBase.runInClassLoader:154 » NullPointer
  RemoveConditionalMutatorTest.shouldReplaceIF_ICMPLE_ORDER_T:664->MutatorTestBase.assertMutantCallableReturns:108->MutatorTestBase.mutateAndCall:119->MutatorTestBase.runInClassLoader:154 » NullPointer
  RemoveConditionalMutatorTest.shouldReplaceIF_ICMPEQ_EQUAL_F:315->MutatorTestBase.assertMutantCallableReturns:108->MutatorTestBase.mutateAndCall:119->MutatorTestBase.runInClassLoader:154 » NullPointer
  RemoveConditionalMutatorTest.shouldReplaceIF_ICMPEQ_EQUAL_T:306->MutatorTestBase.assertMutantCallableReturns:108->MutatorTestBase.mutateAndCall:119->MutatorTestBase.runInClassLoader:154 » NullPointer
  RemoveConditionalMutatorTest.shouldReplaceIF_ICMPGE_ORDER_F:721->MutatorTestBase.assertMutantCallableReturns:108->MutatorTestBase.mutateAndCall:119->MutatorTestBase.runInClassLoader:154 » NullPointer
  RemoveConditionalMutatorTest.shouldReplaceIF_ICMPGE_ORDER_T:712->MutatorTestBase.assertMutantCallableReturns:108->MutatorTestBase.mutateAndCall:119->MutatorTestBase.runInClassLoader:154 » NullPointer
  RemoveConditionalMutatorTest.shouldReplaceIF_ICMPLT_ORDER_F:817->MutatorTestBase.assertMutantCallableReturns:108->MutatorTestBase.mutateAndCall:119->MutatorTestBase.runInClassLoader:154 » NullPointer
  RemoveConditionalMutatorTest.shouldReplaceIF_ICMPLT_ORDER_T:808->MutatorTestBase.assertMutantCallableReturns:108->MutatorTestBase.mutateAndCall:119->MutatorTestBase.runInClassLoader:154 » NullPointer

Tests run: 1135, Failures: 1, Errors: 51, Skipped: 1

[INFO] ------------------------------------------------------------------------
[INFO] BUILD FAILURE
[INFO] ------------------------------------------------------------------------
[INFO] Total time: 14.574 s
[INFO] Finished at: 2015-10-06T09:45:34+02:00
[INFO] Final Memory: 24M/338M
[INFO] ------------------------------------------------------------------------
[ERROR] Failed to execute goal org.apache.maven.plugins:maven-surefire-plugin:2.17:test (default-test) on project pitest: There are test failures.
[ERROR] 
[ERROR] Please refer to /Users/aliparsai/Study/LittleDarwin/Cases/pitest-pitest-parent-1.1.7/pitest/target/surefire-reports for the individual test results.
[ERROR] -> [Help 1]
[ERROR] 
[ERROR] To see the full stack trace of the errors, re-run Maven with the -e switch.
[ERROR] Re-run Maven using the -X switch to enable full debug logging.
[ERROR] 
[ERROR] For more information about the errors and possible solutions, please read the following articles:
[ERROR] [Help 1] http://cwiki.apache.org/confluence/display/MAVEN/MojoFailureException
