-------------------------------------------------------------------------------
Test set: joptsimple.examples.OptionArgumentConverterTest
-------------------------------------------------------------------------------
Tests run: 1, Failures: 0, Errors: 1, Skipped: 0, Time elapsed: 0.003 sec <<< FAILURE!
usesConvertersOnOptionArgumentsWhenTold(joptsimple.examples.OptionArgumentConverterTest)  Time elapsed: 0.002 sec  <<< ERROR!
joptsimple.OptionArgumentConversionException: Cannot parse argument '123-45-6789' of option ssn
	at joptsimple.AbstractOptionSpec.convertWith(AbstractOptionSpec.java:97)
	at joptsimple.ArgumentAcceptingOptionSpec.convert(ArgumentAcceptingOptionSpec.java:274)
	at joptsimple.OptionSet.valuesOf(OptionSet.java:223)
	at joptsimple.OptionSet.valueOf(OptionSet.java:172)
	at joptsimple.OptionSet.valueOf(OptionSet.java:153)
	at joptsimple.examples.OptionArgumentConverterTest.usesConvertersOnOptionArgumentsWhenTold(OptionArgumentConverterTest.java:22)
	at sun.reflect.NativeMethodAccessorImpl.invoke0(Native Method)
	at java.lang.reflect.Method.invoke(Method.java:606)
	at java.lang.reflect.Method.invoke(Method.java:606)
	at org.apache.maven.surefire.junit4.JUnit4TestSet.execute(JUnit4TestSet.java:53)
	at org.apache.maven.surefire.junit4.JUnit4Provider.executeTestSet(JUnit4Provider.java:123)
	at org.apache.maven.surefire.junit4.JUnit4Provider.invoke(JUnit4Provider.java:104)
	at sun.reflect.NativeMethodAccessorImpl.invoke0(Native Method)
	at java.lang.reflect.Method.invoke(Method.java:606)
	at org.apache.maven.surefire.util.ReflectionUtils.invokeMethodWithArray(ReflectionUtils.java:164)
	at org.apache.maven.surefire.booter.ProviderFactory$ProviderProxy.invoke(ProviderFactory.java:110)
	at org.apache.maven.surefire.booter.SurefireStarter.invokeProvider(SurefireStarter.java:175)
	at org.apache.maven.surefire.booter.SurefireStarter.runSuitesInProcessWhenForked(SurefireStarter.java:107)
	at org.apache.maven.surefire.booter.ForkedBooter.main(ForkedBooter.java:68)
Caused by: joptsimple.ValueConversionException: Value [123-45-6789] did not match regex [\d{3}-\d{2}-\d{4}]
	at joptsimple.util.RegexMatcher.raiseValueConversionFailure(RegexMatcher.java:25)
	at joptsimple.util.RegexMatcher.convert(RegexMatcher.java:18)
	at joptsimple.util.RegexMatcher.convert(RegexMatcher.java:15)
	at joptsimple.internal.Reflection.convertWith(Reflection.java:128)
	at joptsimple.AbstractOptionSpec.convertWith(AbstractOptionSpec.java:91)
	... 18 more
