[INFO] Scanning for projects...
[INFO]                                                                         
[INFO] ------------------------------------------------------------------------
[INFO] Building JOpt Simple 4.8
[INFO] ------------------------------------------------------------------------
[WARNING] The POM for com.googlecode.jmockit:jmockit:jar:1.6 is invalid, transitive dependencies (if any) will not be available, enable debug logging for more details
[INFO] 
[INFO] --- maven-enforcer-plugin:1.0:enforce (enforce-maven) @ jopt-simple ---
[INFO] 
[INFO] --- maven-resources-plugin:2.3:resources (default-resources) @ jopt-simple ---
[INFO] Using 'UTF-8' encoding to copy filtered resources.
[INFO] Copying 1 resource
[INFO] 
[INFO] --- maven-compiler-plugin:3.1:compile (default-compile) @ jopt-simple ---
[INFO] Changes detected - recompiling the module!
[INFO] Compiling 44 source files to /home/perham/Study/LittleDarwin/Cases/jopt-simple-4.8/target/classes
[WARNING] /home/perham/Study/LittleDarwin/Cases/jopt-simple-4.8/src/main/java/joptsimple/OptionMissingRequiredArgumentException.java: /home/perham/Study/LittleDarwin/Cases/jopt-simple-4.8/src/main/java/joptsimple/OptionMissingRequiredArgumentException.java uses unchecked or unsafe operations.
[WARNING] /home/perham/Study/LittleDarwin/Cases/jopt-simple-4.8/src/main/java/joptsimple/OptionMissingRequiredArgumentException.java: Recompile with -Xlint:unchecked for details.
[INFO] 
[INFO] >>> maven-pmd-plugin:3.2:cpd-check (default) @ jopt-simple >>>
[INFO] 
[INFO] --- maven-pmd-plugin:3.2:cpd (cpd) @ jopt-simple ---
[WARNING] Unable to locate Source XRef to link to - DISABLED
[INFO] 
[INFO] <<< maven-pmd-plugin:3.2:cpd-check (default) @ jopt-simple <<<
[INFO] 
[INFO] --- maven-pmd-plugin:3.2:cpd-check (default) @ jopt-simple ---
[INFO] 
[INFO] 
[INFO] --- animal-sniffer-maven-plugin:1.11:check (check-signature) @ jopt-simple ---
[INFO] Checking unresolved references to org.codehaus.mojo.signature:java15:1.0
[INFO] 
[INFO] --- maven-resources-plugin:2.3:testResources (default-testResources) @ jopt-simple ---
[INFO] Using 'UTF-8' encoding to copy filtered resources.
[INFO] skip non existing resourceDirectory /home/perham/Study/LittleDarwin/Cases/jopt-simple-4.8/src/test/resources
[INFO] 
[INFO] --- maven-compiler-plugin:3.1:testCompile (default-testCompile) @ jopt-simple ---
[INFO] Nothing to compile - all classes are up to date
[INFO] 
[INFO] --- maven-surefire-plugin:2.10:test (default-test) @ jopt-simple ---
[INFO] Surefire report directory: /home/perham/Study/LittleDarwin/Cases/jopt-simple-4.8/target/surefire-reports

-------------------------------------------------------
 T E S T S
-------------------------------------------------------
Running joptsimple.OptionSpecBuilderOptionsImmutabilityTest
Tests run: 12, Failures: 0, Errors: 0, Skipped: 0, Time elapsed: 0.477 sec
Running joptsimple.JVMSystemPropertiesArgumentParsingTest
Tests run: 1, Failures: 0, Errors: 0, Skipped: 0, Time elapsed: 0.011 sec
Running joptsimple.WAsShortOptionTest
Tests run: 2, Failures: 1, Errors: 0, Skipped: 0, Time elapsed: 0.014 sec <<< FAILURE!
Running joptsimple.OptionSetValuesOfOptionStringImmutabilityTest
Tests run: 12, Failures: 0, Errors: 0, Skipped: 0, Time elapsed: 0.017 sec
Running joptsimple.ArgumentListHasNoMoreArgsTest
Tests run: 3, Failures: 0, Errors: 0, Skipped: 0, Time elapsed: 0.006 sec
Running joptsimple.util.KeyValuePairUnequalValuesTest
Tests run: 8, Failures: 0, Errors: 0, Skipped: 0, Time elapsed: 0.012 sec
Running joptsimple.util.DateConverterTest
Tests run: 11, Failures: 0, Errors: 0, Skipped: 0, Time elapsed: 0.137 sec
Running joptsimple.util.KeyValuePairUnequalKeysTest
Tests run: 8, Failures: 0, Errors: 0, Skipped: 0, Time elapsed: 0.013 sec
Running joptsimple.util.InetAddressConverterTest
Tests run: 2, Failures: 0, Errors: 0, Skipped: 0, Time elapsed: 0.022 sec
Running joptsimple.util.KeyValuePairTest
Tests run: 7, Failures: 0, Errors: 0, Skipped: 0, Time elapsed: 0.011 sec
Running joptsimple.util.RegexMatcherTest
Tests run: 6, Failures: 0, Errors: 0, Skipped: 0, Time elapsed: 0.013 sec
Running joptsimple.OptionSetSpecsImmutabilityTest
Tests run: 12, Failures: 0, Errors: 0, Skipped: 0, Time elapsed: 0.019 sec
Running joptsimple.ArgumentAcceptingOptionSpecTest
Tests run: 16, Failures: 0, Errors: 0, Skipped: 0, Time elapsed: 0.018 sec
Running joptsimple.AlternativeLongOptionSpecValuesImmutabilityTest
Tests run: 12, Failures: 0, Errors: 0, Skipped: 0, Time elapsed: 0.013 sec
Running joptsimple.RequiredIfAnyTest
Tests run: 5, Failures: 0, Errors: 0, Skipped: 0, Time elapsed: 0.009 sec
Running joptsimple.ClusterWhereManyOptionsAcceptArgumentsTest
Tests run: 12, Failures: 0, Errors: 0, Skipped: 0, Time elapsed: 0.018 sec
Running joptsimple.OptionSpecsReportTheirOptionsSortedSpeciallyTest
Tests run: 1, Failures: 0, Errors: 0, Skipped: 0, Time elapsed: 0.001 sec
Running joptsimple.DefaultSettingsOptionParserHelpTest
Tests run: 39, Failures: 3, Errors: 33, Skipped: 0, Time elapsed: 0.098 sec <<< FAILURE!
Running joptsimple.WExtensionWithArgumentTest
Tests run: 7, Failures: 7, Errors: 0, Skipped: 0, Time elapsed: 0.01 sec <<< FAILURE!
Running joptsimple.PunctuationInShortOptionTest
Tests run: 4, Failures: 0, Errors: 0, Skipped: 0, Time elapsed: 0.002 sec
Running joptsimple.PunctuationInLongOptionTest
Tests run: 6, Failures: 0, Errors: 0, Skipped: 0, Time elapsed: 0.007 sec
Running joptsimple.LongOptionRequiredArgumentTest
Tests run: 6, Failures: 4, Errors: 0, Skipped: 0, Time elapsed: 0.011 sec <<< FAILURE!
Running joptsimple.ToStringTest
Tests run: 3, Failures: 0, Errors: 0, Skipped: 0, Time elapsed: 0.008 sec
Running joptsimple.OptionSetDetectedOptionsTest
Tests run: 1, Failures: 1, Errors: 0, Skipped: 0, Time elapsed: 0.003 sec <<< FAILURE!
Running joptsimple.OptionSpecBuilderValuesImmutabilityTest
Tests run: 12, Failures: 0, Errors: 0, Skipped: 0, Time elapsed: 0.013 sec
Running joptsimple.ShortOptionsNoArgumentTest
Tests run: 6, Failures: 0, Errors: 0, Skipped: 0, Time elapsed: 0.009 sec
Running joptsimple.OptionalArgumentOptionSpecValuesImmutabilityTest
Tests run: 12, Failures: 0, Errors: 0, Skipped: 0, Time elapsed: 0.015 sec
Running joptsimple.AlternativeLongOptionSpecOptionsImmutabilityTest
Tests run: 12, Failures: 0, Errors: 0, Skipped: 0, Time elapsed: 0.009 sec
Running joptsimple.ShortOptionsOptionalArgumentTest
Tests run: 6, Failures: 5, Errors: 0, Skipped: 0, Time elapsed: 0.012 sec <<< FAILURE!
Running joptsimple.ValueConverterAdmitsSubclassesOfValueTypeTest
Tests run: 1, Failures: 0, Errors: 0, Skipped: 0, Time elapsed: 0 sec
Running joptsimple.PopulatedOptionSetTest
Tests run: 4, Failures: 0, Errors: 0, Skipped: 0, Time elapsed: 0.004 sec
Running joptsimple.ParsingSeparatedTypedOptionValuesTest
Tests run: 4, Failures: 1, Errors: 0, Skipped: 0, Time elapsed: 0.01 sec <<< FAILURE!
Running joptsimple.OptionSynonymNoArgumentTest
Tests run: 3, Failures: 0, Errors: 0, Skipped: 0, Time elapsed: 0.002 sec
Running joptsimple.OptionParserOptionExceptionTest
Tests run: 5, Failures: 0, Errors: 0, Skipped: 0, Time elapsed: 0.008 sec
Running joptsimple.ClusterVersusLongOptionWithOptionalArgumentTest
Tests run: 9, Failures: 0, Errors: 0, Skipped: 0, Time elapsed: 0.012 sec
Running joptsimple.RequiredUnlessAnyTest
Tests run: 4, Failures: 0, Errors: 0, Skipped: 0, Time elapsed: 0.006 sec
Running joptsimple.OptionParserNewDeclarationTest
Tests run: 16, Failures: 2, Errors: 11, Skipped: 0, Time elapsed: 0.036 sec <<< FAILURE!
Running joptsimple.RequiredArgumentOptionSpecEqualsHashCodeTest
Tests run: 10, Failures: 0, Errors: 0, Skipped: 0, Time elapsed: 0.005 sec
Running joptsimple.OptionSynonymCommonPrefixesTest
Tests run: 7, Failures: 0, Errors: 0, Skipped: 0, Time elapsed: 0.014 sec
Running joptsimple.OptionalArgumentOptionSpecOptionsImmutabilityTest
Tests run: 12, Failures: 0, Errors: 0, Skipped: 0, Time elapsed: 0.015 sec
Running joptsimple.RequiredUnlessTest
Tests run: 8, Failures: 2, Errors: 0, Skipped: 0, Time elapsed: 0.024 sec <<< FAILURE!
Running joptsimple.ArgumentListTest
Tests run: 2, Failures: 0, Errors: 0, Skipped: 0, Time elapsed: 0.002 sec
Running joptsimple.NoArgumentOptionSpecTest
Tests run: 11, Failures: 0, Errors: 0, Skipped: 0, Time elapsed: 0.013 sec
Running joptsimple.RequiredArgumentOptionSpecValuesImmutabilityTest
Tests run: 12, Failures: 0, Errors: 0, Skipped: 0, Time elapsed: 0.012 sec
Running joptsimple.OptionParserTest
Tests run: 17, Failures: 4, Errors: 1, Skipped: 0, Time elapsed: 0.027 sec <<< FAILURE!
Running joptsimple.PlainOldOptionParserTest
Tests run: 1, Failures: 0, Errors: 0, Skipped: 0, Time elapsed: 0.001 sec
Running joptsimple.OptionExceptionOptionsImmutabilityTest
Tests run: 12, Failures: 0, Errors: 0, Skipped: 0, Time elapsed: 0.013 sec
Running joptsimple.ParsingSeparatedStringOptionValuesTest
Tests run: 6, Failures: 1, Errors: 0, Skipped: 0, Time elapsed: 0.008 sec <<< FAILURE!
Running joptsimple.OptionParserAlternateHelpFormatterTest
Tests run: 2, Failures: 0, Errors: 0, Skipped: 0, Time elapsed: 0.001 sec
Running joptsimple.InterleavedArgumentsTest
Tests run: 9, Failures: 6, Errors: 0, Skipped: 0, Time elapsed: 0.012 sec <<< FAILURE!
Running joptsimple.ClusterVersusLongOptionTest
Tests run: 5, Failures: 0, Errors: 0, Skipped: 0, Time elapsed: 0.006 sec
Running joptsimple.OptionSynonymOptionalArgumentTest
Tests run: 4, Failures: 4, Errors: 0, Skipped: 0, Time elapsed: 0.007 sec <<< FAILURE!
Running joptsimple.OptionSynonymRequiredArgumentTest
Tests run: 4, Failures: 0, Errors: 4, Skipped: 0, Time elapsed: 0.009 sec <<< FAILURE!
Running joptsimple.internal.ObjectsUtilityClassTest
Tests run: 1, Failures: 0, Errors: 0, Skipped: 0, Time elapsed: 0.002 sec
Running joptsimple.internal.RowEqualsHashCodeTest
Tests run: 9, Failures: 0, Errors: 0, Skipped: 0, Time elapsed: 0.009 sec
Running joptsimple.internal.RowsTest
Tests run: 3, Failures: 0, Errors: 0, Skipped: 0, Time elapsed: 0.005 sec
Running joptsimple.internal.AbbreviationMapTest
Tests run: 22, Failures: 0, Errors: 0, Skipped: 0, Time elapsed: 0.021 sec
Running joptsimple.internal.AbbreviationMapToJavaUtilMapTest
Tests run: 12, Failures: 0, Errors: 0, Skipped: 0, Time elapsed: 0.011 sec
Running joptsimple.internal.ReflectionUtilityClassTest
Tests run: 1, Failures: 0, Errors: 0, Skipped: 0, Time elapsed: 0.001 sec
Running joptsimple.internal.ClassesUtilityClassTest
Tests run: 1, Failures: 0, Errors: 0, Skipped: 0, Time elapsed: 0.001 sec
Running joptsimple.internal.StringsUtilityClassTest
Tests run: 1, Failures: 0, Errors: 0, Skipped: 0, Time elapsed: 0.002 sec
Running joptsimple.internal.ReflectionTest
Tests run: 6, Failures: 0, Errors: 0, Skipped: 0, Time elapsed: 0.008 sec
Running joptsimple.OptionSetAsMapTest
Tests run: 1, Failures: 1, Errors: 0, Skipped: 0, Time elapsed: 0.004 sec <<< FAILURE!
Running joptsimple.NoArgumentOptionSpecOptionsImmutabilityTest
Tests run: 12, Failures: 0, Errors: 0, Skipped: 0, Time elapsed: 0.018 sec
Running joptsimple.LongOptionOptionalArgumentTest
Tests run: 3, Failures: 2, Errors: 0, Skipped: 0, Time elapsed: 0.002 sec <<< FAILURE!
Running joptsimple.ClusterVersusLongOptionWithRequiredArgumentTest
Tests run: 9, Failures: 0, Errors: 0, Skipped: 0, Time elapsed: 0.01 sec
Running joptsimple.OptionalArgumentOptionSpecTest
Tests run: 11, Failures: 0, Errors: 0, Skipped: 0, Time elapsed: 0.01 sec
Running joptsimple.OptionSetValuesOfSpecImmutabilityTest
Tests run: 12, Failures: 0, Errors: 0, Skipped: 0, Time elapsed: 0.01 sec
Running joptsimple.OptionSpecTokenizerTest
Tests run: 17, Failures: 0, Errors: 0, Skipped: 0, Time elapsed: 0.017 sec
Running joptsimple.SingleHyphenTest
Tests run: 3, Failures: 1, Errors: 0, Skipped: 0, Time elapsed: 0.005 sec <<< FAILURE!
Running joptsimple.WExtensionNoArgumentTest
Tests run: 2, Failures: 1, Errors: 0, Skipped: 0, Time elapsed: 0.003 sec <<< FAILURE!
Running joptsimple.RequiredArgumentOptionSpecOptionsImmutabilityTest
Tests run: 12, Failures: 0, Errors: 0, Skipped: 0, Time elapsed: 0.011 sec
Running joptsimple.ParserRulesUtilityClassTest
Tests run: 1, Failures: 0, Errors: 0, Skipped: 0, Time elapsed: 0.001 sec
Running joptsimple.ConfigurableOptionParserHelpTest
Tests run: 27, Failures: 0, Errors: 27, Skipped: 0, Time elapsed: 0.041 sec <<< FAILURE!
Running joptsimple.NonOptionArgumentSpecTest
Tests run: 7, Failures: 0, Errors: 0, Skipped: 0, Time elapsed: 0.006 sec
Running joptsimple.OptionExceptionMessageTest
Tests run: 8, Failures: 0, Errors: 0, Skipped: 0, Time elapsed: 0.012 sec
Running joptsimple.LongOptionNoArgumentTest
Tests run: 4, Failures: 0, Errors: 0, Skipped: 0, Time elapsed: 0.006 sec
Running joptsimple.ArgumentAcceptingOptionSpecDefaultValuesImmutabilityTest
Tests run: 12, Failures: 0, Errors: 0, Skipped: 0, Time elapsed: 0.013 sec
Running joptsimple.ParsingSeparatedConvertedOptionValuesTest
Tests run: 4, Failures: 1, Errors: 0, Skipped: 0, Time elapsed: 0.007 sec <<< FAILURE!
Running joptsimple.HandlingDefaultValuesForOptionArgumentsTest
Tests run: 9, Failures: 2, Errors: 3, Skipped: 0, Time elapsed: 0.015 sec <<< FAILURE!
Running joptsimple.ShortOptionsRequiredArgumentTest
Tests run: 9, Failures: 6, Errors: 1, Skipped: 0, Time elapsed: 0.018 sec <<< FAILURE!
Running joptsimple.CreateWithOptionSpecificationStringTest
Tests run: 1, Failures: 0, Errors: 0, Skipped: 0, Time elapsed: 0.002 sec
Running joptsimple.EmptyOptionSetTest
Tests run: 8, Failures: 0, Errors: 0, Skipped: 0, Time elapsed: 0.009 sec
Running joptsimple.OptionParserArgumentExceptionTest
Tests run: 9, Failures: 0, Errors: 0, Skipped: 0, Time elapsed: 0.012 sec
Running joptsimple.RequiredIfTest
Tests run: 8, Failures: 2, Errors: 0, Skipped: 0, Time elapsed: 0.017 sec <<< FAILURE!
Running joptsimple.NoArgumentOptionSpecValuesImmutabilityTest
Tests run: 12, Failures: 0, Errors: 0, Skipped: 0, Time elapsed: 0.014 sec
Running joptsimple.WAsAbbreviationForLongOptionTest
Tests run: 2, Failures: 2, Errors: 0, Skipped: 0, Time elapsed: 0.005 sec <<< FAILURE!
Running joptsimple.OptionSynonymOverwritingTest
Tests run: 1, Failures: 0, Errors: 0, Skipped: 0, Time elapsed: 0.002 sec
Running joptsimple.OptionParserRecognizedOptionsTest
Tests run: 2, Failures: 0, Errors: 0, Skipped: 0, Time elapsed: 0.003 sec
Running joptsimple.OptionSetNonOptionArgumentsImmutabilityTest
Tests run: 12, Failures: 0, Errors: 0, Skipped: 0, Time elapsed: 0.019 sec
Running joptsimple.OptionParserUnrecognizedOptionsAllowedTest
Tests run: 2, Failures: 0, Errors: 0, Skipped: 0, Time elapsed: 0.003 sec
Running joptsimple.PosixlyCorrectOptionParserTest
Tests run: 2, Failures: 2, Errors: 0, Skipped: 0, Time elapsed: 0.006 sec <<< FAILURE!
Running joptsimple.examples.ShortOptionsWithArgumentPositioningTest
Tests run: 1, Failures: 1, Errors: 0, Skipped: 0, Time elapsed: 0.001 sec <<< FAILURE!
Running joptsimple.examples.OptionArgumentConverterTest
Tests run: 1, Failures: 1, Errors: 0, Skipped: 0, Time elapsed: 0.007 sec <<< FAILURE!
Running joptsimple.examples.RequiredOptionsTest
Tests run: 3, Failures: 0, Errors: 0, Skipped: 0, Time elapsed: 0.004 sec
Running joptsimple.examples.DefaultValuesForOptionArgumentsTest
Tests run: 1, Failures: 1, Errors: 0, Skipped: 0, Time elapsed: 0.025 sec <<< FAILURE!
Running joptsimple.examples.OptionSynonymTest
Tests run: 1, Failures: 1, Errors: 0, Skipped: 0, Time elapsed: 0.002 sec <<< FAILURE!
Running joptsimple.examples.ShortOptionsWithArgumentsTest
Tests run: 1, Failures: 1, Errors: 0, Skipped: 0, Time elapsed: 0.001 sec <<< FAILURE!
Running joptsimple.examples.AlternativeLongOptionsTest
Tests run: 1, Failures: 1, Errors: 0, Skipped: 0, Time elapsed: 0.001 sec <<< FAILURE!
Running joptsimple.examples.LongOptionsWithArgumentPositioningTest
Tests run: 1, Failures: 1, Errors: 0, Skipped: 0, Time elapsed: 0.002 sec <<< FAILURE!
Running joptsimple.examples.PosixlyCorrectTest
Tests run: 1, Failures: 1, Errors: 0, Skipped: 0, Time elapsed: 0.003 sec <<< FAILURE!
Running joptsimple.examples.OptionArgumentValueTypeTest
Tests run: 1, Failures: 0, Errors: 1, Skipped: 0, Time elapsed: 0.003 sec <<< FAILURE!
Running joptsimple.examples.UnrecognizedOptionsAllowedTest
Tests run: 1, Failures: 0, Errors: 0, Skipped: 0, Time elapsed: 0.001 sec
Running joptsimple.examples.LongOptionsTest
Tests run: 1, Failures: 0, Errors: 0, Skipped: 0, Time elapsed: 0.001 sec
Running joptsimple.examples.ShortOptionsClusteringTest
Tests run: 1, Failures: 0, Errors: 0, Skipped: 0, Time elapsed: 0.002 sec
Running joptsimple.examples.ShortOptionsClusteringWithArgumentTest
Tests run: 1, Failures: 0, Errors: 0, Skipped: 0, Time elapsed: 0.001 sec
Running joptsimple.examples.SignallingEndOfOptionsTest
Tests run: 1, Failures: 0, Errors: 0, Skipped: 0, Time elapsed: 0.003 sec
Running joptsimple.examples.MultipleDelimitedArgumentsTest
Tests run: 1, Failures: 1, Errors: 0, Skipped: 0, Time elapsed: 0.002 sec <<< FAILURE!
Running joptsimple.examples.SpecialOptionalArgumentHandlingTest
Tests run: 1, Failures: 1, Errors: 0, Skipped: 0, Time elapsed: 0.002 sec <<< FAILURE!
Running joptsimple.examples.ShortOptionsWithMultipleArgumentsForSingleOptionTest
Tests run: 1, Failures: 1, Errors: 0, Skipped: 0, Time elapsed: 0.002 sec <<< FAILURE!
Running joptsimple.examples.ShortOptionsTest
Tests run: 1, Failures: 0, Errors: 0, Skipped: 0, Time elapsed: 0.001 sec
Running joptsimple.examples.LongOptionsWithArgumentsTest
Tests run: 1, Failures: 1, Errors: 0, Skipped: 0, Time elapsed: 0.002 sec <<< FAILURE!
Running joptsimple.examples.ExportOptionsTest
Tests run: 1, Failures: 0, Errors: 1, Skipped: 0, Time elapsed: 0.003 sec <<< FAILURE!
Running joptsimple.examples.TypesafeOptionArgumentRetrievalTest
Tests run: 1, Failures: 0, Errors: 1, Skipped: 0, Time elapsed: 0.002 sec <<< FAILURE!
Running joptsimple.TypesafeOptionArgumentRetrievalTest
Tests run: 22, Failures: 3, Errors: 11, Skipped: 0, Time elapsed: 0.064 sec <<< FAILURE!
Running joptsimple.OptionSetEqualsHashCodeTest
Tests run: 9, Failures: 0, Errors: 0, Skipped: 0, Time elapsed: 0.008 sec

Results :

Failed tests:   recognizeLongOptionsTrumpsShortOptionW(joptsimple.WAsShortOptionTest): Expected test to throw (an instance of joptsimple.UnrecognizedOptionException and an OptionException indicating the option "silent")
  showsNonOptionArgumentTypeAndArgumentDescription(joptsimple.DefaultSettingsOptionParserHelpTest): expected:<...ents:
  showsNonOptionArgumentTypeAndDescription(joptsimple.DefaultSettingsOptionParserHelpTest): expected:<...uments:             [
  showsNonOptionArgumentType(joptsimple.DefaultSettingsOptionParserHelpTest): expected:<...ion arguments:
  separateArgument(joptsimple.WExtensionWithArgumentTest): option 'W' detected?
  typedTogetherArg(joptsimple.WExtensionWithArgumentTest): option 'W' detected?
  typedSeparateArg(joptsimple.WExtensionWithArgumentTest): option 'W' detected?
  abbreviationWithTogetherArgument(joptsimple.WExtensionWithArgumentTest): option 'W' detected?
  togetherArgument(joptsimple.WExtensionWithArgumentTest): option 'W' detected?
  illegalLongOption(joptsimple.WExtensionWithArgumentTest): Expected test to throw (an instance of joptsimple.UnrecognizedOptionException and an OptionException indicating the option "foo")
  noMoreArguments(joptsimple.WExtensionWithArgumentTest): Expected test to throw (an instance of joptsimple.OptionMissingRequiredArgumentException and an OptionException indicating the option "W")
  argumentSeparate(joptsimple.LongOptionRequiredArgumentTest): expected:<[23]> but was:<[]>
  argumentFollowedByLegalOption(joptsimple.LongOptionRequiredArgumentTest): option 'a' detected?
  argumentMissing(joptsimple.LongOptionRequiredArgumentTest): Expected test to throw (an instance of joptsimple.OptionMissingRequiredArgumentException and an OptionException indicating the option "quiet")
  whenEndOfOptionsMarkerIsInPlaceOfRequiredArgument(joptsimple.LongOptionRequiredArgumentTest): option 'y' not detected?
  givesSpecsInOrderOfCommandLinePresentation(joptsimple.OptionSetDetectedOptionsTest): expected:<[[a], [e], [c], [d], [b], [d], [e]]> but was:<[[a], [e], [c], [[arguments]], [d], [[arguments]], [b], [[arguments]], [d], [[arguments]], [e], [[arguments]]]>
  optionWithOptionalArgumentFollowedByLegalOption(joptsimple.ShortOptionsOptionalArgumentTest): expected: java.util.Collections$EmptyList<[]> but was: java.util.Collections$UnmodifiableRandomAccessList<[]>
  multipleOfSameOptionSomeWithArgsAndSomeWithout(joptsimple.ShortOptionsOptionalArgumentTest): expected:<[foo, bar]> but was:<[, , , , ]>
  optionWithOptionalArgumentPresent(joptsimple.ShortOptionsOptionalArgumentTest): expected:<[bar]> but was:<[]>
  optionWithOptionalArgumentNotPresent(joptsimple.ShortOptionsOptionalArgumentTest): expected: java.util.Collections$EmptyList<[]> but was: java.util.Collections$UnmodifiableRandomAccessList<[]>
  optionWithOptionalArgumentThatLooksLikeAValidOption(joptsimple.ShortOptionsOptionalArgumentTest): expected: java.util.Collections$EmptyList<[]> but was: java.util.Collections$UnmodifiableRandomAccessList<[]>
  parsesSeparatedValuesAsSeparateArgument(joptsimple.ParsingSeparatedTypedOptionValuesTest): expected:<[/usr, /opt, /var]> but was:<[]>
  booleanArgumentType(joptsimple.OptionParserNewDeclarationTest): expected:<true> but was:<false>
  optionsWithNegativeNumberArgumentsAndNonNumberOptions(joptsimple.OptionParserNewDeclarationTest): option '2' detected?
  acceptsOptionWithPrerequisiteAsNormal(joptsimple.RequiredUnlessTest): expected:<[secret]> but was:<[]>
  acceptsCommandLineWithConditionallyRequiredOptionsPresent(joptsimple.RequiredUnlessTest): expected:<[joe]> but was:<[]>
  allowsWhitespaceyStringAsArgumentOfOption(joptsimple.OptionParserTest): expected:<[     		
  allowsEmbeddedWhitespaceInArgumentOfOption(joptsimple.OptionParserTest): expected:<[   look at me, I'm flaunting the rules!   ]> but was:<[]>
  optionsAndNonOptionsInterspersed(joptsimple.OptionParserTest): expected:<[bar, junk]> but was:<[bar, ]>
  allowsMixingOfOptionsAndNonOptions(joptsimple.OptionParserTest): expected:<[boo]> but was:<[]>
  parsesSeparatedValuesAsSeparateArgument(joptsimple.ParsingSeparatedStringOptionValuesTest): expected:<[/usr, /opt, /var]> but was:<[]>
  optionalAbuttedArgumentVersusPosixlyCorrect(joptsimple.InterleavedArgumentsTest): expected:<[a, b]> but was:<[a, b, ]>
  optionalArgumentAndPosixlyCorrect(joptsimple.InterleavedArgumentsTest): expected: java.util.Collections$EmptyList<[]> but was: java.util.Collections$UnmodifiableRandomAccessList<[]>
  requiredArgumentAndPosixlyCorrect(joptsimple.InterleavedArgumentsTest): expected:<[a, b, c, d]> but was:<[]>
  requiredArgument(joptsimple.InterleavedArgumentsTest): expected:<[a, b, c, d]> but was:<[, , , ]>
  optionalKeyValuePairArgumentVersusPosixlyCorrect(joptsimple.InterleavedArgumentsTest): expected:<[a, b]> but was:<[a, b, ]>
  optionalArgument(joptsimple.InterleavedArgumentsTest): expected:<[a, b, c, d]> but was:<[, , , ]>
  hasAllSynonymsWhenSecondSynonymParsed(joptsimple.OptionSynonymOptionalArgumentTest): expected:<[tmp]> but was:<[]>
  hasAllSynonymsWhenFirstSynonymParsed(joptsimple.OptionSynonymOptionalArgumentTest): expected:<[tmp]> but was:<[]>
  hasAllSynonymsWhenThirdSynonymParsed(joptsimple.OptionSynonymOptionalArgumentTest): expected:<[tmp]> but was:<[]>
  reportsSameListOfArgumentsForEverySynonymOption(joptsimple.OptionSynonymOptionalArgumentTest): expected:<[opt, tmp, usr]> but was:<[, , ]>
  gives(joptsimple.OptionSetAsMapTest): 
  argumentSeparate(joptsimple.LongOptionOptionalArgumentTest): expected:<[opt]> but was:<[]>
  argumentMissingTrailedByAnotherOption(joptsimple.LongOptionOptionalArgumentTest): expected: java.util.Collections$EmptyList<[]> but was: java.util.Collections$UnmodifiableRandomAccessList<[]>
  asArgumentOfOption(joptsimple.SingleHyphenTest): expected:<[-]> but was:<[]>
  wExtensionWithLongOptionWithoutAnArgument(joptsimple.WExtensionNoArgumentTest): option 'W' detected?
  parsesSeparatedValuesAsSeparateArgument(joptsimple.ParsingSeparatedConvertedOptionValuesTest): expected:<[/usr, /opt, /var]> but was:<[]>
  optionalArgOptionWithDefaultGivesDefaultIfArgNotSpecifiedOnCommandLine(joptsimple.HandlingDefaultValuesForOptionArgumentsTest)
  requiredArgOptionWithDefaultStillsFailToParseIfArgNotSpecifiedOnCommandLine(joptsimple.HandlingDefaultValuesForOptionArgumentsTest): Expected exception: joptsimple.OptionMissingRequiredArgumentException
  argumentNotPresentFollowedByAnotherOption(joptsimple.ShortOptionsRequiredArgumentTest): option 'infile' detected?
  withArgument(joptsimple.ShortOptionsRequiredArgumentTest): expected:<[foo]> but was:<[]>
  argumentNotPresent(joptsimple.ShortOptionsRequiredArgumentTest): Expected test to throw (an instance of joptsimple.OptionMissingRequiredArgumentException and an OptionException indicating the option "d")
  appearingMultipleTimes(joptsimple.ShortOptionsRequiredArgumentTest): expected:<[foo, bar]> but was:<[, ]>
  clusteredOptionsWithLastOneAcceptingAnArgumentButMissing(joptsimple.ShortOptionsRequiredArgumentTest): 
  whenEndOfOptionsMarkerIsInPlaceOfRequiredArgument(joptsimple.ShortOptionsRequiredArgumentTest): expected:<[--]> but was:<[]>
  acceptsCommandLineWithConditionallyRequiredOptionsPresent(joptsimple.RequiredIfTest): expected:<[joe]> but was:<[]>
  acceptsOptionWithPrerequisiteAsNormalIfPrerequisiteNotInPlay(joptsimple.RequiredIfTest): expected:<[secret]> but was:<[]>
  recognizeLongOptionsTrumpsLongOptionAbbreviation(joptsimple.WAsAbbreviationForLongOptionTest): Expected test to throw (an instance of joptsimple.UnrecognizedOptionException and an OptionException indicating the option "silent")
  abbreviation(joptsimple.WAsAbbreviationForLongOptionTest): expected:<[silent]> but was:<[]>
  parseWithPosixlyCorrect[0](joptsimple.PosixlyCorrectOptionParserTest): args of i? expected:<[bar, junk]> but was:<[bar, ]>
  parseWithPosixlyCorrect[1](joptsimple.PosixlyCorrectOptionParserTest): args of i? expected:<[bar, junk]> but was:<[bar, ]>
  allowsDifferentFormsOfPairingArgumentWithOption(joptsimple.examples.ShortOptionsWithArgumentPositioningTest): expected:<[foo]> but was:<[]>
  usesConvertersOnOptionArgumentsWhenTold(joptsimple.examples.OptionArgumentConverterTest): expected:<Thu Feb 24 00:00:00 GMT 2005> but was:<null>
  allowsSpecificationOfDefaultValues(joptsimple.examples.DefaultValuesForOptionArgumentsTest): expected:</etc/passwd> but was:<>
  supportsOptionSynonyms(joptsimple.examples.OptionSynonymTest): message expected:<[Hello]> but was:<[]>
  allowsOptionsToAcceptArguments(joptsimple.examples.ShortOptionsWithArgumentsTest): expected:<[foo]> but was:<[]>
  handlesAlternativeLongOptions(joptsimple.examples.AlternativeLongOptionsTest)
  allowsDifferentFormsOfPairingArgumentWithOption(joptsimple.examples.LongOptionsWithArgumentPositioningTest): expected:<[4]> but was:<[]>
  supportsPosixlyCorrectBehavior(joptsimple.examples.PosixlyCorrectTest): expected:<[bar, junk]> but was:<[bar, ]>
  supportsMultipleDelimitedArguments(joptsimple.examples.MultipleDelimitedArgumentsTest): expected:<[/tmp, /var, /opt]> but was:<[]>
  handlesNegativeNumberOptionalArguments(joptsimple.examples.SpecialOptionalArgumentHandlingTest)
  allowsMultipleValuesForAnOption(joptsimple.examples.ShortOptionsWithMultipleArgumentsForSingleOptionTest): expected:<[foo, bar, baz]> but was:<[, bar, baz]>
  supportsLongOptionsWithArgumentsAndAbbreviations(joptsimple.examples.LongOptionsWithArgumentsTest): expected:<[3]> but was:<[]>
  retrievalOfUntypedRequiredArgumentsInATypesafeManner(joptsimple.TypesafeOptionArgumentRetrievalTest): expected:<[foo, bar]> but was:<[, ]>
  retrievalOfUntypedOptionalArgumentsInATypesafeManner(joptsimple.TypesafeOptionArgumentRetrievalTest): expected:<[foo, bar, baz]> but was:<[, , ]>
  canUseBooleanType(joptsimple.TypesafeOptionArgumentRetrievalTest)

Tests in error: 
  marksRequiredOptionsSpecially(joptsimple.DefaultSettingsOptionParserHelpTest)
  optionSynonymsWithOptionalArgument(joptsimple.DefaultSettingsOptionParserHelpTest)
  oneOptionRequiredArgNoDescriptionWithType(joptsimple.DefaultSettingsOptionParserHelpTest)
  includesDefaultValueForRequiredOptionArgument(joptsimple.DefaultSettingsOptionParserHelpTest)
  oneOptionOptionalArgNoDescription(joptsimple.DefaultSettingsOptionParserHelpTest)
  includesDefaultValueForArgumentWithDescription(joptsimple.DefaultSettingsOptionParserHelpTest)
  unconfiguredParser(joptsimple.DefaultSettingsOptionParserHelpTest)
  oneOptionOptionalArgNoDescriptionWithType(joptsimple.DefaultSettingsOptionParserHelpTest)
  oneOptionRequiredArgNoDescription(joptsimple.DefaultSettingsOptionParserHelpTest)
  oneOptionOptionalArgWithDescriptionAndType(joptsimple.DefaultSettingsOptionParserHelpTest)
  oneOptionRequiredArgWithDescriptionAndType(joptsimple.DefaultSettingsOptionParserHelpTest)
  dateConverterShowsDatePatternInCombinationWithDescription(joptsimple.DefaultSettingsOptionParserHelpTest)
  oneOptionNoArgNoDescription(joptsimple.DefaultSettingsOptionParserHelpTest)
  dateConverterShowsDatePattern(joptsimple.DefaultSettingsOptionParserHelpTest)
  twoOptionsNoArgWithDescription(joptsimple.DefaultSettingsOptionParserHelpTest)
  optionSynonymsSortedByShortOptionThenLexicographical(joptsimple.DefaultSettingsOptionParserHelpTest)
  gradleHelp(joptsimple.DefaultSettingsOptionParserHelpTest)
  alternativeLongOptions(joptsimple.DefaultSettingsOptionParserHelpTest)
  optionSynonymsWithoutArguments(joptsimple.DefaultSettingsOptionParserHelpTest)
  writingToOutputStream(joptsimple.DefaultSettingsOptionParserHelpTest)
  bothColumnsExceedingAllocatedWidths(joptsimple.DefaultSettingsOptionParserHelpTest)
  showsNonOptionArgumentTypeDescribedAs(joptsimple.DefaultSettingsOptionParserHelpTest)
  leavesEmbeddedNewlinesInDescriptionsAlone(joptsimple.DefaultSettingsOptionParserHelpTest)
  outputStreamFlushedButNotClosedWhenPrintingHelp(joptsimple.DefaultSettingsOptionParserHelpTest)
  optionSynonymsWithRequiredArgument(joptsimple.DefaultSettingsOptionParserHelpTest)
  fixForIssue56(joptsimple.DefaultSettingsOptionParserHelpTest)
  oneOptionOptionalArgWithDescription(joptsimple.DefaultSettingsOptionParserHelpTest)
  showsNonOptionArgumentDescription(joptsimple.DefaultSettingsOptionParserHelpTest)
  includesDefaultValueForOptionalOptionArgument(joptsimple.DefaultSettingsOptionParserHelpTest)
  inetAddressConverterShowsType(joptsimple.DefaultSettingsOptionParserHelpTest)
  oneOptionRequiredArgWithDescription(joptsimple.DefaultSettingsOptionParserHelpTest)
  includesListOfDefaultsForArgumentWithDescription(joptsimple.DefaultSettingsOptionParserHelpTest)
  oneOptionNoArgWithDescription(joptsimple.DefaultSettingsOptionParserHelpTest)
  optionsWithOptionalNegativeNumberArgumentsAndNumberOptions(joptsimple.OptionParserNewDeclarationTest): Cannot parse argument '' of option a
  shortArgumentType(joptsimple.OptionParserNewDeclarationTest): Cannot parse argument '' of option a
  sqlDateArgumentType(joptsimple.OptionParserNewDeclarationTest): Cannot parse argument '' of option a
  doubleArgumentType(joptsimple.OptionParserNewDeclarationTest): Cannot parse argument '' of option a
  integerArgumentType(joptsimple.OptionParserNewDeclarationTest): Cannot parse argument '' of option a
  floatArgumentType(joptsimple.OptionParserNewDeclarationTest): Cannot parse argument '' of option a
  sqlTimestampArgumentType(joptsimple.OptionParserNewDeclarationTest): Cannot parse argument '' of option a
  optionsWithOptionalNegativeNumberArguments(joptsimple.OptionParserNewDeclarationTest): Cannot parse argument '' of option a
  longArgumentType(joptsimple.OptionParserNewDeclarationTest): Cannot parse argument '' of option a
  byteArgumentType(joptsimple.OptionParserNewDeclarationTest): 1 is not a recognized option
  sqlTimeArgumentType(joptsimple.OptionParserNewDeclarationTest): Cannot parse argument '' of option a
  typedArguments(joptsimple.OptionParserTest): Cannot parse argument '' of option b
  hasAllSynonymsWhenSecondSynonymParsed(joptsimple.OptionSynonymRequiredArgumentTest): Cannot parse argument '' of option N/after-date/newer
  hasAllSynonymsWhenFirstSynonymParsed(joptsimple.OptionSynonymRequiredArgumentTest): Cannot parse argument '' of option N/after-date/newer
  hasAllSynonymsWhenThirdSynonymParsed(joptsimple.OptionSynonymRequiredArgumentTest): Cannot parse argument '' of option N/after-date/newer
  reportsSameListOfArgumentsForEverySynonymOption(joptsimple.OptionSynonymRequiredArgumentTest): Cannot parse argument '' of option N/after-date/newer
  marksRequiredOptionsSpecially(joptsimple.ConfigurableOptionParserHelpTest)
  optionSynonymsWithOptionalArgument(joptsimple.ConfigurableOptionParserHelpTest)
  oneOptionRequiredArgNoDescriptionWithType(joptsimple.ConfigurableOptionParserHelpTest)
  includesDefaultValueForRequiredOptionArgument(joptsimple.ConfigurableOptionParserHelpTest)
  oneOptionOptionalArgNoDescription(joptsimple.ConfigurableOptionParserHelpTest)
  includesDefaultValueForArgumentWithDescription(joptsimple.ConfigurableOptionParserHelpTest)
  unconfiguredParser(joptsimple.ConfigurableOptionParserHelpTest)
  oneOptionOptionalArgNoDescriptionWithType(joptsimple.ConfigurableOptionParserHelpTest)
  oneOptionRequiredArgNoDescription(joptsimple.ConfigurableOptionParserHelpTest)
  oneOptionOptionalArgWithDescriptionAndType(joptsimple.ConfigurableOptionParserHelpTest)
  oneOptionRequiredArgWithDescriptionAndType(joptsimple.ConfigurableOptionParserHelpTest)
  dateConverterShowsDatePatternInCombinationWithDescription(joptsimple.ConfigurableOptionParserHelpTest)
  oneOptionNoArgNoDescription(joptsimple.ConfigurableOptionParserHelpTest)
  dateConverterShowsDatePattern(joptsimple.ConfigurableOptionParserHelpTest)
  twoOptionsNoArgWithDescription(joptsimple.ConfigurableOptionParserHelpTest)
  optionSynonymsSortedByShortOptionThenLexicographical(joptsimple.ConfigurableOptionParserHelpTest)
  gradleHelp(joptsimple.ConfigurableOptionParserHelpTest)
  alternativeLongOptions(joptsimple.ConfigurableOptionParserHelpTest)
  optionSynonymsWithoutArguments(joptsimple.ConfigurableOptionParserHelpTest)
  bothColumnsExceedingAllocatedWidths(joptsimple.ConfigurableOptionParserHelpTest)
  leavesEmbeddedNewlinesInDescriptionsAlone(joptsimple.ConfigurableOptionParserHelpTest)
  optionSynonymsWithRequiredArgument(joptsimple.ConfigurableOptionParserHelpTest)
  oneOptionOptionalArgWithDescription(joptsimple.ConfigurableOptionParserHelpTest)
  includesDefaultValueForOptionalOptionArgument(joptsimple.ConfigurableOptionParserHelpTest)
  oneOptionRequiredArgWithDescription(joptsimple.ConfigurableOptionParserHelpTest)
  includesListOfDefaultsForArgumentWithDescription(joptsimple.ConfigurableOptionParserHelpTest)
  oneOptionNoArgWithDescription(joptsimple.ConfigurableOptionParserHelpTest)
  optionalArgOptionWithDefaultGivesArgIfSpecifiedOnCommandLine(joptsimple.HandlingDefaultValuesForOptionArgumentsTest): Cannot parse argument '' of option a
  specifiedOptionArgumentsTrumpsListOfDefaults(joptsimple.HandlingDefaultValuesForOptionArgumentsTest): Cannot parse argument '' of option c
  requiredArgOptionWithDefaultGivesArgIfArgSpecifiedOnCommandLine(joptsimple.HandlingDefaultValuesForOptionArgumentsTest): Cannot parse argument '' of option a
  clusteredOptionsWithLastOneAcceptingAnArgument(joptsimple.ShortOptionsRequiredArgumentTest)
  convertsArgumentsToJavaValueTypes(joptsimple.examples.OptionArgumentValueTypeTest): Cannot parse argument '' of option count
  allowsExportOfOptions(joptsimple.examples.ExportOptionsTest): Cannot parse argument '' of option count
  allowsTypesafeRetrievalOfOptionArguments(joptsimple.examples.TypesafeOptionArgumentRetrievalTest): Cannot parse argument '' of option count
  primitiveIntAllowedAsTypeSpecifier(joptsimple.TypesafeOptionArgumentRetrievalTest): Cannot parse argument '' of option F
  retrievalOfTypedOptionalArgumentsInATypesafeManner(joptsimple.TypesafeOptionArgumentRetrievalTest): Cannot parse argument '' of option b
  canSubvertTypeSafetyIfYouUseAnOptionSpecAsTheWrongType(joptsimple.TypesafeOptionArgumentRetrievalTest): Unexpected exception, expected<java.lang.ClassCastException> but was<joptsimple.OptionArgumentConversionException>
  primitiveLongAllowedAsTypeSpecifier(joptsimple.TypesafeOptionArgumentRetrievalTest): Cannot parse argument '' of option g
  canSubvertTypeSafetyIfYouGiveAnOptionSpecToOptionSetAsTheWrongType(joptsimple.TypesafeOptionArgumentRetrievalTest): Unexpected exception, expected<java.lang.ClassCastException> but was<joptsimple.OptionArgumentConversionException>
  retrievalOfTypedRequiredArgumentsInATypesafeManner(joptsimple.TypesafeOptionArgumentRetrievalTest): Cannot parse argument '' of option a
  primitiveShortAllowedAsTypeSpecifier(joptsimple.TypesafeOptionArgumentRetrievalTest): Cannot parse argument '' of option H
  usesConverterIfProvided(joptsimple.TypesafeOptionArgumentRetrievalTest): For input string: ""
  primitiveByteAllowedAsTypeSpecifier(joptsimple.TypesafeOptionArgumentRetrievalTest): Cannot parse argument '' of option b
  primitiveFloatAllowedAsTypeSpecifier(joptsimple.TypesafeOptionArgumentRetrievalTest): Cannot parse argument '' of option e
  primitiveDoubleAllowedAsTypeSpecifier(joptsimple.TypesafeOptionArgumentRetrievalTest): Cannot parse argument '' of option d

Tests run: 745, Failures: 76, Errors: 94, Skipped: 0

[INFO] ------------------------------------------------------------------------
[INFO] BUILD FAILURE
[INFO] ------------------------------------------------------------------------
[INFO] Total time: 7.861s
[INFO] Finished at: Sun Aug 02 00:28:28 BST 2015
[INFO] Final Memory: 20M/289M
[INFO] ------------------------------------------------------------------------
[ERROR] Failed to execute goal org.apache.maven.plugins:maven-surefire-plugin:2.10:test (default-test) on project jopt-simple: There are test failures.
[ERROR] 
[ERROR] Please refer to /home/perham/Study/LittleDarwin/Cases/jopt-simple-4.8/target/surefire-reports for the individual test results.
[ERROR] -> [Help 1]
[ERROR] 
[ERROR] To see the full stack trace of the errors, re-run Maven with the -e switch.
[ERROR] Re-run Maven using the -X switch to enable full debug logging.
[ERROR] 
[ERROR] For more information about the errors and possible solutions, please read the following articles:
[ERROR] [Help 1] http://cwiki.apache.org/confluence/display/MAVEN/MojoFailureException
