[INFO] Scanning for projects...
[INFO]                                                                         
[INFO] ------------------------------------------------------------------------
[INFO] Building JOpt Simple 4.8
[INFO] ------------------------------------------------------------------------
[WARNING] The POM for com.googlecode.jmockit:jmockit:jar:1.6 is invalid, transitive dependencies (if any) will not be available, enable debug logging for more details
[INFO] 
[INFO] --- maven-enforcer-plugin:1.0:enforce (enforce-maven) @ jopt-simple ---
[INFO] 
[INFO] --- maven-resources-plugin:2.3:resources (default-resources) @ jopt-simple ---
[INFO] Using 'UTF-8' encoding to copy filtered resources.
[INFO] Copying 1 resource
[INFO] 
[INFO] --- maven-compiler-plugin:3.1:compile (default-compile) @ jopt-simple ---
[INFO] Changes detected - recompiling the module!
[INFO] Compiling 44 source files to /home/perham/Study/LittleDarwin/Cases/jopt-simple-4.8/target/classes
[WARNING] /home/perham/Study/LittleDarwin/Cases/jopt-simple-4.8/src/main/java/joptsimple/OptionMissingRequiredArgumentException.java: /home/perham/Study/LittleDarwin/Cases/jopt-simple-4.8/src/main/java/joptsimple/OptionMissingRequiredArgumentException.java uses unchecked or unsafe operations.
[WARNING] /home/perham/Study/LittleDarwin/Cases/jopt-simple-4.8/src/main/java/joptsimple/OptionMissingRequiredArgumentException.java: Recompile with -Xlint:unchecked for details.
[INFO] 
[INFO] >>> maven-pmd-plugin:3.2:cpd-check (default) @ jopt-simple >>>
[INFO] 
[INFO] --- maven-pmd-plugin:3.2:cpd (cpd) @ jopt-simple ---
[WARNING] Unable to locate Source XRef to link to - DISABLED
[INFO] 
[INFO] <<< maven-pmd-plugin:3.2:cpd-check (default) @ jopt-simple <<<
[INFO] 
[INFO] --- maven-pmd-plugin:3.2:cpd-check (default) @ jopt-simple ---
[INFO] 
[INFO] 
[INFO] --- animal-sniffer-maven-plugin:1.11:check (check-signature) @ jopt-simple ---
[INFO] Checking unresolved references to org.codehaus.mojo.signature:java15:1.0
[INFO] 
[INFO] --- maven-resources-plugin:2.3:testResources (default-testResources) @ jopt-simple ---
[INFO] Using 'UTF-8' encoding to copy filtered resources.
[INFO] skip non existing resourceDirectory /home/perham/Study/LittleDarwin/Cases/jopt-simple-4.8/src/test/resources
[INFO] 
[INFO] --- maven-compiler-plugin:3.1:testCompile (default-testCompile) @ jopt-simple ---
[INFO] Nothing to compile - all classes are up to date
[INFO] 
[INFO] --- maven-surefire-plugin:2.10:test (default-test) @ jopt-simple ---
[INFO] Surefire report directory: /home/perham/Study/LittleDarwin/Cases/jopt-simple-4.8/target/surefire-reports

-------------------------------------------------------
 T E S T S
-------------------------------------------------------
Running joptsimple.OptionSpecBuilderOptionsImmutabilityTest
Tests run: 12, Failures: 0, Errors: 0, Skipped: 0, Time elapsed: 0.495 sec
Running joptsimple.JVMSystemPropertiesArgumentParsingTest
Tests run: 1, Failures: 0, Errors: 1, Skipped: 0, Time elapsed: 0.016 sec <<< FAILURE!
Running joptsimple.WAsShortOptionTest
Tests run: 2, Failures: 1, Errors: 1, Skipped: 0, Time elapsed: 0.026 sec <<< FAILURE!
Running joptsimple.OptionSetValuesOfOptionStringImmutabilityTest
Tests run: 12, Failures: 0, Errors: 0, Skipped: 0, Time elapsed: 0.02 sec
Running joptsimple.ArgumentListHasNoMoreArgsTest
Tests run: 3, Failures: 0, Errors: 0, Skipped: 0, Time elapsed: 0.009 sec
Running joptsimple.util.KeyValuePairUnequalValuesTest
Tests run: 8, Failures: 0, Errors: 0, Skipped: 0, Time elapsed: 0.006 sec
Running joptsimple.util.DateConverterTest
Tests run: 11, Failures: 0, Errors: 0, Skipped: 0, Time elapsed: 0.126 sec
Running joptsimple.util.KeyValuePairUnequalKeysTest
Tests run: 8, Failures: 0, Errors: 0, Skipped: 0, Time elapsed: 0.013 sec
Running joptsimple.util.InetAddressConverterTest
Tests run: 2, Failures: 0, Errors: 0, Skipped: 0, Time elapsed: 0.017 sec
Running joptsimple.util.KeyValuePairTest
Tests run: 7, Failures: 0, Errors: 0, Skipped: 0, Time elapsed: 0.014 sec
Running joptsimple.util.RegexMatcherTest
Tests run: 6, Failures: 0, Errors: 0, Skipped: 0, Time elapsed: 0.013 sec
Running joptsimple.OptionSetSpecsImmutabilityTest
Tests run: 12, Failures: 0, Errors: 0, Skipped: 0, Time elapsed: 0.021 sec
Running joptsimple.ArgumentAcceptingOptionSpecTest
Tests run: 16, Failures: 0, Errors: 0, Skipped: 0, Time elapsed: 0.024 sec
Running joptsimple.AlternativeLongOptionSpecValuesImmutabilityTest
Tests run: 12, Failures: 0, Errors: 0, Skipped: 0, Time elapsed: 0.011 sec
Running joptsimple.RequiredIfAnyTest
Tests run: 5, Failures: 0, Errors: 5, Skipped: 0, Time elapsed: 0.007 sec <<< FAILURE!
Running joptsimple.ClusterWhereManyOptionsAcceptArgumentsTest
Tests run: 12, Failures: 0, Errors: 12, Skipped: 0, Time elapsed: 0.021 sec <<< FAILURE!
Running joptsimple.OptionSpecsReportTheirOptionsSortedSpeciallyTest
Tests run: 1, Failures: 0, Errors: 0, Skipped: 0, Time elapsed: 0.001 sec
Running joptsimple.DefaultSettingsOptionParserHelpTest
Tests run: 39, Failures: 0, Errors: 0, Skipped: 0, Time elapsed: 0.091 sec
Running joptsimple.WExtensionWithArgumentTest
Tests run: 7, Failures: 2, Errors: 5, Skipped: 0, Time elapsed: 0.027 sec <<< FAILURE!
Running joptsimple.PunctuationInShortOptionTest
Tests run: 4, Failures: 0, Errors: 3, Skipped: 0, Time elapsed: 0.005 sec <<< FAILURE!
Running joptsimple.PunctuationInLongOptionTest
Tests run: 6, Failures: 0, Errors: 5, Skipped: 0, Time elapsed: 0.012 sec <<< FAILURE!
Running joptsimple.LongOptionRequiredArgumentTest
Tests run: 6, Failures: 1, Errors: 5, Skipped: 0, Time elapsed: 0.012 sec <<< FAILURE!
Running joptsimple.ToStringTest
Tests run: 3, Failures: 0, Errors: 0, Skipped: 0, Time elapsed: 0.009 sec
Running joptsimple.OptionSetDetectedOptionsTest
Tests run: 1, Failures: 0, Errors: 1, Skipped: 0, Time elapsed: 0.004 sec <<< FAILURE!
Running joptsimple.OptionSpecBuilderValuesImmutabilityTest
Tests run: 12, Failures: 0, Errors: 0, Skipped: 0, Time elapsed: 0.015 sec
Running joptsimple.ShortOptionsNoArgumentTest
Tests run: 6, Failures: 0, Errors: 6, Skipped: 0, Time elapsed: 0.011 sec <<< FAILURE!
Running joptsimple.OptionalArgumentOptionSpecValuesImmutabilityTest
Tests run: 12, Failures: 0, Errors: 0, Skipped: 0, Time elapsed: 0.011 sec
Running joptsimple.AlternativeLongOptionSpecOptionsImmutabilityTest
Tests run: 12, Failures: 0, Errors: 0, Skipped: 0, Time elapsed: 0.015 sec
Running joptsimple.ShortOptionsOptionalArgumentTest
Tests run: 6, Failures: 1, Errors: 5, Skipped: 0, Time elapsed: 0.01 sec <<< FAILURE!
Running joptsimple.ValueConverterAdmitsSubclassesOfValueTypeTest
Tests run: 1, Failures: 0, Errors: 0, Skipped: 0, Time elapsed: 0 sec
Running joptsimple.PopulatedOptionSetTest
Tests run: 4, Failures: 0, Errors: 0, Skipped: 0, Time elapsed: 0.003 sec
Running joptsimple.ParsingSeparatedTypedOptionValuesTest
Tests run: 4, Failures: 0, Errors: 4, Skipped: 0, Time elapsed: 0.006 sec <<< FAILURE!
Running joptsimple.OptionSynonymNoArgumentTest
Tests run: 3, Failures: 0, Errors: 3, Skipped: 0, Time elapsed: 0.006 sec <<< FAILURE!
Running joptsimple.OptionParserOptionExceptionTest
Tests run: 5, Failures: 2, Errors: 1, Skipped: 0, Time elapsed: 0.009 sec <<< FAILURE!
Running joptsimple.ClusterVersusLongOptionWithOptionalArgumentTest
Tests run: 9, Failures: 0, Errors: 9, Skipped: 0, Time elapsed: 0.015 sec <<< FAILURE!
Running joptsimple.RequiredUnlessAnyTest
Tests run: 4, Failures: 0, Errors: 4, Skipped: 0, Time elapsed: 0.006 sec <<< FAILURE!
Running joptsimple.OptionParserNewDeclarationTest
Tests run: 16, Failures: 0, Errors: 13, Skipped: 0, Time elapsed: 0.032 sec <<< FAILURE!
Running joptsimple.RequiredArgumentOptionSpecEqualsHashCodeTest
Tests run: 10, Failures: 0, Errors: 0, Skipped: 0, Time elapsed: 0.01 sec
Running joptsimple.OptionSynonymCommonPrefixesTest
Tests run: 7, Failures: 0, Errors: 7, Skipped: 0, Time elapsed: 0.017 sec <<< FAILURE!
Running joptsimple.OptionalArgumentOptionSpecOptionsImmutabilityTest
Tests run: 12, Failures: 0, Errors: 0, Skipped: 0, Time elapsed: 0.016 sec
Running joptsimple.RequiredUnlessTest
Tests run: 8, Failures: 0, Errors: 8, Skipped: 0, Time elapsed: 0.017 sec <<< FAILURE!
Running joptsimple.ArgumentListTest
Tests run: 2, Failures: 0, Errors: 0, Skipped: 0, Time elapsed: 0.002 sec
Running joptsimple.NoArgumentOptionSpecTest
Tests run: 11, Failures: 0, Errors: 0, Skipped: 0, Time elapsed: 0.014 sec
Running joptsimple.RequiredArgumentOptionSpecValuesImmutabilityTest
Tests run: 12, Failures: 0, Errors: 0, Skipped: 0, Time elapsed: 0.015 sec
Running joptsimple.OptionParserTest
Tests run: 17, Failures: 2, Errors: 13, Skipped: 0, Time elapsed: 0.028 sec <<< FAILURE!
Running joptsimple.PlainOldOptionParserTest
Tests run: 1, Failures: 0, Errors: 0, Skipped: 0, Time elapsed: 0 sec
Running joptsimple.OptionExceptionOptionsImmutabilityTest
Tests run: 12, Failures: 0, Errors: 0, Skipped: 0, Time elapsed: 0.009 sec
Running joptsimple.ParsingSeparatedStringOptionValuesTest
Tests run: 6, Failures: 0, Errors: 6, Skipped: 0, Time elapsed: 0.011 sec <<< FAILURE!
Running joptsimple.OptionParserAlternateHelpFormatterTest
Tests run: 2, Failures: 0, Errors: 0, Skipped: 0, Time elapsed: 0.003 sec
Running joptsimple.InterleavedArgumentsTest
Tests run: 9, Failures: 0, Errors: 8, Skipped: 0, Time elapsed: 0.011 sec <<< FAILURE!
Running joptsimple.ClusterVersusLongOptionTest
Tests run: 5, Failures: 0, Errors: 5, Skipped: 0, Time elapsed: 0.009 sec <<< FAILURE!
Running joptsimple.OptionSynonymOptionalArgumentTest
Tests run: 4, Failures: 0, Errors: 4, Skipped: 0, Time elapsed: 0.007 sec <<< FAILURE!
Running joptsimple.OptionSynonymRequiredArgumentTest
Tests run: 4, Failures: 0, Errors: 4, Skipped: 0, Time elapsed: 0.009 sec <<< FAILURE!
Running joptsimple.internal.ObjectsUtilityClassTest
Tests run: 1, Failures: 0, Errors: 0, Skipped: 0, Time elapsed: 0.002 sec
Running joptsimple.internal.RowEqualsHashCodeTest
Tests run: 9, Failures: 0, Errors: 0, Skipped: 0, Time elapsed: 0.013 sec
Running joptsimple.internal.RowsTest
Tests run: 3, Failures: 0, Errors: 0, Skipped: 0, Time elapsed: 0.005 sec
Running joptsimple.internal.AbbreviationMapTest
Tests run: 22, Failures: 16, Errors: 0, Skipped: 0, Time elapsed: 0.034 sec <<< FAILURE!
Running joptsimple.internal.AbbreviationMapToJavaUtilMapTest
Tests run: 12, Failures: 0, Errors: 0, Skipped: 0, Time elapsed: 0.01 sec
Running joptsimple.internal.ReflectionUtilityClassTest
Tests run: 1, Failures: 0, Errors: 0, Skipped: 0, Time elapsed: 0.001 sec
Running joptsimple.internal.ClassesUtilityClassTest
Tests run: 1, Failures: 0, Errors: 0, Skipped: 0, Time elapsed: 0.001 sec
Running joptsimple.internal.StringsUtilityClassTest
Tests run: 1, Failures: 0, Errors: 0, Skipped: 0, Time elapsed: 0.001 sec
Running joptsimple.internal.ReflectionTest
Tests run: 6, Failures: 0, Errors: 0, Skipped: 0, Time elapsed: 0.008 sec
Running joptsimple.OptionSetAsMapTest
Tests run: 1, Failures: 0, Errors: 1, Skipped: 0, Time elapsed: 0.003 sec <<< FAILURE!
Running joptsimple.NoArgumentOptionSpecOptionsImmutabilityTest
Tests run: 12, Failures: 0, Errors: 0, Skipped: 0, Time elapsed: 0.01 sec
Running joptsimple.LongOptionOptionalArgumentTest
Tests run: 3, Failures: 0, Errors: 3, Skipped: 0, Time elapsed: 0.006 sec <<< FAILURE!
Running joptsimple.ClusterVersusLongOptionWithRequiredArgumentTest
Tests run: 9, Failures: 0, Errors: 9, Skipped: 0, Time elapsed: 0.015 sec <<< FAILURE!
Running joptsimple.OptionalArgumentOptionSpecTest
Tests run: 11, Failures: 0, Errors: 0, Skipped: 0, Time elapsed: 0.009 sec
Running joptsimple.OptionSetValuesOfSpecImmutabilityTest
Tests run: 12, Failures: 0, Errors: 0, Skipped: 0, Time elapsed: 0.01 sec
Running joptsimple.OptionSpecTokenizerTest
Tests run: 17, Failures: 0, Errors: 0, Skipped: 0, Time elapsed: 0.016 sec
Running joptsimple.SingleHyphenTest
Tests run: 3, Failures: 0, Errors: 2, Skipped: 0, Time elapsed: 0.005 sec <<< FAILURE!
Running joptsimple.WExtensionNoArgumentTest
Tests run: 2, Failures: 1, Errors: 1, Skipped: 0, Time elapsed: 0.002 sec <<< FAILURE!
Running joptsimple.RequiredArgumentOptionSpecOptionsImmutabilityTest
Tests run: 12, Failures: 0, Errors: 0, Skipped: 0, Time elapsed: 0.011 sec
Running joptsimple.ParserRulesUtilityClassTest
Tests run: 1, Failures: 0, Errors: 0, Skipped: 0, Time elapsed: 0.001 sec
Running joptsimple.ConfigurableOptionParserHelpTest
Tests run: 27, Failures: 0, Errors: 0, Skipped: 0, Time elapsed: 0.045 sec
Running joptsimple.NonOptionArgumentSpecTest
Tests run: 7, Failures: 0, Errors: 0, Skipped: 0, Time elapsed: 0.009 sec
Running joptsimple.OptionExceptionMessageTest
Tests run: 8, Failures: 0, Errors: 0, Skipped: 0, Time elapsed: 0.011 sec
Running joptsimple.LongOptionNoArgumentTest
Tests run: 4, Failures: 1, Errors: 3, Skipped: 0, Time elapsed: 0.008 sec <<< FAILURE!
Running joptsimple.ArgumentAcceptingOptionSpecDefaultValuesImmutabilityTest
Tests run: 12, Failures: 0, Errors: 0, Skipped: 0, Time elapsed: 0.012 sec
Running joptsimple.ParsingSeparatedConvertedOptionValuesTest
Tests run: 4, Failures: 0, Errors: 4, Skipped: 0, Time elapsed: 0.008 sec <<< FAILURE!
Running joptsimple.HandlingDefaultValuesForOptionArgumentsTest
Tests run: 9, Failures: 0, Errors: 5, Skipped: 0, Time elapsed: 0.034 sec <<< FAILURE!
Running joptsimple.ShortOptionsRequiredArgumentTest
Tests run: 9, Failures: 2, Errors: 7, Skipped: 0, Time elapsed: 0.022 sec <<< FAILURE!
Running joptsimple.CreateWithOptionSpecificationStringTest
Tests run: 1, Failures: 0, Errors: 1, Skipped: 0, Time elapsed: 0.002 sec <<< FAILURE!
Running joptsimple.EmptyOptionSetTest
Tests run: 8, Failures: 0, Errors: 0, Skipped: 0, Time elapsed: 0.009 sec
Running joptsimple.OptionParserArgumentExceptionTest
Tests run: 9, Failures: 0, Errors: 0, Skipped: 0, Time elapsed: 0.015 sec
Running joptsimple.RequiredIfTest
Tests run: 8, Failures: 0, Errors: 8, Skipped: 0, Time elapsed: 0.016 sec <<< FAILURE!
Running joptsimple.NoArgumentOptionSpecValuesImmutabilityTest
Tests run: 12, Failures: 0, Errors: 0, Skipped: 0, Time elapsed: 0.015 sec
Running joptsimple.WAsAbbreviationForLongOptionTest
Tests run: 2, Failures: 1, Errors: 1, Skipped: 0, Time elapsed: 0.006 sec <<< FAILURE!
Running joptsimple.OptionSynonymOverwritingTest
Tests run: 1, Failures: 0, Errors: 1, Skipped: 0, Time elapsed: 0.003 sec <<< FAILURE!
Running joptsimple.OptionParserRecognizedOptionsTest
Tests run: 2, Failures: 0, Errors: 0, Skipped: 0, Time elapsed: 0.003 sec
Running joptsimple.OptionSetNonOptionArgumentsImmutabilityTest
Tests run: 12, Failures: 0, Errors: 0, Skipped: 0, Time elapsed: 0.016 sec
Running joptsimple.OptionParserUnrecognizedOptionsAllowedTest
Tests run: 2, Failures: 1, Errors: 1, Skipped: 0, Time elapsed: 0.003 sec <<< FAILURE!
Running joptsimple.PosixlyCorrectOptionParserTest
Tests run: 2, Failures: 0, Errors: 2, Skipped: 0, Time elapsed: 0.029 sec <<< FAILURE!
Running joptsimple.examples.ShortOptionsWithArgumentPositioningTest
Tests run: 1, Failures: 0, Errors: 1, Skipped: 0, Time elapsed: 0 sec <<< FAILURE!
Running joptsimple.examples.OptionArgumentConverterTest
Tests run: 1, Failures: 0, Errors: 1, Skipped: 0, Time elapsed: 0.001 sec <<< FAILURE!
Running joptsimple.examples.RequiredOptionsTest
Tests run: 3, Failures: 0, Errors: 1, Skipped: 0, Time elapsed: 0.001 sec <<< FAILURE!
Running joptsimple.examples.DefaultValuesForOptionArgumentsTest
Tests run: 1, Failures: 0, Errors: 1, Skipped: 0, Time elapsed: 0.006 sec <<< FAILURE!
Running joptsimple.examples.OptionSynonymTest
Tests run: 1, Failures: 0, Errors: 1, Skipped: 0, Time elapsed: 0.002 sec <<< FAILURE!
Running joptsimple.examples.ShortOptionsWithArgumentsTest
Tests run: 1, Failures: 0, Errors: 1, Skipped: 0, Time elapsed: 0.002 sec <<< FAILURE!
Running joptsimple.examples.AlternativeLongOptionsTest
Tests run: 1, Failures: 0, Errors: 1, Skipped: 0, Time elapsed: 0.001 sec <<< FAILURE!
Running joptsimple.examples.LongOptionsWithArgumentPositioningTest
Tests run: 1, Failures: 0, Errors: 1, Skipped: 0, Time elapsed: 0.001 sec <<< FAILURE!
Running joptsimple.examples.PosixlyCorrectTest
Tests run: 1, Failures: 0, Errors: 1, Skipped: 0, Time elapsed: 0.002 sec <<< FAILURE!
Running joptsimple.examples.OptionArgumentValueTypeTest
Tests run: 1, Failures: 0, Errors: 1, Skipped: 0, Time elapsed: 0.001 sec <<< FAILURE!
Running joptsimple.examples.UnrecognizedOptionsAllowedTest
Tests run: 1, Failures: 0, Errors: 1, Skipped: 0, Time elapsed: 0.002 sec <<< FAILURE!
Running joptsimple.examples.LongOptionsTest
Tests run: 1, Failures: 0, Errors: 1, Skipped: 0, Time elapsed: 0.001 sec <<< FAILURE!
Running joptsimple.examples.ShortOptionsClusteringTest
Tests run: 1, Failures: 0, Errors: 1, Skipped: 0, Time elapsed: 0.002 sec <<< FAILURE!
Running joptsimple.examples.ShortOptionsClusteringWithArgumentTest
Tests run: 1, Failures: 0, Errors: 1, Skipped: 0, Time elapsed: 0.001 sec <<< FAILURE!
Running joptsimple.examples.SignallingEndOfOptionsTest
Tests run: 1, Failures: 0, Errors: 1, Skipped: 0, Time elapsed: 0.002 sec <<< FAILURE!
Running joptsimple.examples.MultipleDelimitedArgumentsTest
Tests run: 1, Failures: 0, Errors: 1, Skipped: 0, Time elapsed: 0.002 sec <<< FAILURE!
Running joptsimple.examples.SpecialOptionalArgumentHandlingTest
Tests run: 1, Failures: 0, Errors: 1, Skipped: 0, Time elapsed: 0.002 sec <<< FAILURE!
Running joptsimple.examples.ShortOptionsWithMultipleArgumentsForSingleOptionTest
Tests run: 1, Failures: 0, Errors: 1, Skipped: 0, Time elapsed: 0.002 sec <<< FAILURE!
Running joptsimple.examples.ShortOptionsTest
Tests run: 1, Failures: 0, Errors: 1, Skipped: 0, Time elapsed: 0.002 sec <<< FAILURE!
Running joptsimple.examples.LongOptionsWithArgumentsTest
Tests run: 1, Failures: 0, Errors: 1, Skipped: 0, Time elapsed: 0 sec <<< FAILURE!
Running joptsimple.examples.ExportOptionsTest
Tests run: 1, Failures: 0, Errors: 1, Skipped: 0, Time elapsed: 0.002 sec <<< FAILURE!
Running joptsimple.examples.TypesafeOptionArgumentRetrievalTest
Tests run: 1, Failures: 0, Errors: 1, Skipped: 0, Time elapsed: 0.002 sec <<< FAILURE!
Running joptsimple.TypesafeOptionArgumentRetrievalTest
Tests run: 22, Failures: 0, Errors: 21, Skipped: 0, Time elapsed: 0.035 sec <<< FAILURE!
Running joptsimple.OptionSetEqualsHashCodeTest
Tests run: 9, Failures: 0, Errors: 0, Skipped: 0, Time elapsed: 0.019 sec

Results :

Failed tests:   recognizeLongOptionsTrumpsShortOptionW(joptsimple.WAsShortOptionTest): 
  illegalLongOption(joptsimple.WExtensionWithArgumentTest): 
  noMoreArguments(joptsimple.WExtensionWithArgumentTest): 
  argumentMissing(joptsimple.LongOptionRequiredArgumentTest): 
  optionWithOptionalArgumentThatLooksLikeAnInvalidOption(joptsimple.ShortOptionsOptionalArgumentTest): 
  tooManyHyphens(joptsimple.OptionParserOptionExceptionTest): 
  unrecognizedOption(joptsimple.OptionParserOptionExceptionTest): 
  longOptionLeadsWithSingleDashAmbiguousButAShortIsIllegal(joptsimple.OptionParserTest): 
  longOptionLeadsWithSingleDashAmbiguous(joptsimple.OptionParserTest): 
  addingManyWithNoCommonPrefix(joptsimple.internal.AbbreviationMapTest)
  removingSingleKey(joptsimple.internal.AbbreviationMapTest)
  addingThreeWithSuccessivelySmallerPrefixes(joptsimple.internal.AbbreviationMapTest)
  addKeysWithCommonPrefixThenRemoveNonExistentKeyWithCommonPrefix(joptsimple.internal.AbbreviationMapTest)
  removingNonExistentKeyHasNoEffect(joptsimple.internal.AbbreviationMapTest)
  addKeysWithCommonPrefixesStairstepStyleJumbled(joptsimple.internal.AbbreviationMapTest)
  multipleKeysWithCommonPrefix(joptsimple.internal.AbbreviationMapTest)
  addingTwoWithCommonPrefix(joptsimple.internal.AbbreviationMapTest)
  empty(joptsimple.internal.AbbreviationMapTest)
  addingThreeWithMixOfPrefixSize(joptsimple.internal.AbbreviationMapTest)
  addKeysWithCommonPrefixesStairstepStyle(joptsimple.internal.AbbreviationMapTest)
  removeKeyWithCommonPrefix(joptsimple.internal.AbbreviationMapTest)
  addingOne(joptsimple.internal.AbbreviationMapTest)
  cannotRemoveByUniqueAbbreviation(joptsimple.internal.AbbreviationMapTest)
  addingThreeWithSuccessivelyLargerPrefixes(joptsimple.internal.AbbreviationMapTest)
  addingOneThenReplacing(joptsimple.internal.AbbreviationMapTest)
  turnOffWExtension(joptsimple.WExtensionNoArgumentTest): 
  ambiguousAbbreviation(joptsimple.LongOptionNoArgumentTest): 
  argumentNotPresent(joptsimple.ShortOptionsRequiredArgumentTest): 
  clusteredOptionsWithLastOneAcceptingAnArgumentButMissing(joptsimple.ShortOptionsRequiredArgumentTest): 
  recognizeLongOptionsTrumpsLongOptionAbbreviation(joptsimple.WAsAbbreviationForLongOptionTest): 
  unrecognizedOptionDisallowed(joptsimple.OptionParserUnrecognizedOptionsAllowedTest): 

Tests in error: 
  parsingJVMSystemPropertiesArguments(joptsimple.JVMSystemPropertiesArgumentParsingTest)
  wIsLegal(joptsimple.WAsShortOptionTest): W is not a recognized option
  rejectsCommandLineMissingConditionallyRequiredOption(joptsimple.RequiredIfAnyTest): Option(s) [a] not configured on this parser
  rejectsCommandLineWithNotAllConditionallyRequiredOptionsPresent(joptsimple.RequiredIfAnyTest): Option(s) [a] not configured on this parser
  acceptsCommandLineWithConditionallyRequiredOptionsPresent(joptsimple.RequiredIfAnyTest): Option(s) [a] not configured on this parser
  acceptsOptionWithPrerequisiteAsNormalIfPrerequisiteNotInPlay(joptsimple.RequiredIfAnyTest): Option(s) [a] not configured on this parser
  rejectsCommandLineMissingOtherConditionallyRequiredOption(joptsimple.RequiredIfAnyTest): Option(s) [a] not configured on this parser
  oxfPermutationWithFollowingArg(joptsimple.ClusterWhereManyOptionsAcceptArgumentsTest)
  ofxPermutationWithFollowingArg(joptsimple.ClusterWhereManyOptionsAcceptArgumentsTest)
  ofxPermutation(joptsimple.ClusterWhereManyOptionsAcceptArgumentsTest)
  oxfPermutation(joptsimple.ClusterWhereManyOptionsAcceptArgumentsTest)
  fxoPermutationWithFollowingArg(joptsimple.ClusterWhereManyOptionsAcceptArgumentsTest)
  foxPermutationWithFollowingArg(joptsimple.ClusterWhereManyOptionsAcceptArgumentsTest)
  foxPermutation(joptsimple.ClusterWhereManyOptionsAcceptArgumentsTest)
  xofPermutationWithFollowingArg(joptsimple.ClusterWhereManyOptionsAcceptArgumentsTest)
  xfoPermutationWithFollowingArg(joptsimple.ClusterWhereManyOptionsAcceptArgumentsTest)
  fxoPermutation(joptsimple.ClusterWhereManyOptionsAcceptArgumentsTest)
  xfoPermutation(joptsimple.ClusterWhereManyOptionsAcceptArgumentsTest)
  xofPermutation(joptsimple.ClusterWhereManyOptionsAcceptArgumentsTest)
  separateArgument(joptsimple.WExtensionWithArgumentTest): W is not a recognized option
  typedTogetherArg(joptsimple.WExtensionWithArgumentTest): W is not a recognized option
  typedSeparateArg(joptsimple.WExtensionWithArgumentTest): W is not a recognized option
  abbreviationWithTogetherArgument(joptsimple.WExtensionWithArgumentTest): W is not a recognized option
  togetherArgument(joptsimple.WExtensionWithArgumentTest): W is not a recognized option
  allowsDotAsShortOption(joptsimple.PunctuationInShortOptionTest): . is not a recognized option
  allowsUnderscoreAsShortOption(joptsimple.PunctuationInShortOptionTest): _ is not a recognized option
  allowsQuestionMarkAsShortOption(joptsimple.PunctuationInShortOptionTest): ? is not a recognized option
  allowsDotInOptionNames(joptsimple.PunctuationInLongOptionTest): ..what.is.the.d..e...a....l... is not a recognized option
  allowsHyphensPrettyMuchAnywhereButTheFront(joptsimple.PunctuationInLongOptionTest): a-cra-zy-but-le--gal---o-p-t-i-o--n----- is not a recognized option
  allowsUnderscoreInOptionNames(joptsimple.PunctuationInLongOptionTest): super_long_option_name is not a recognized option
  allowsQuestionMarkInOptionNames(joptsimple.PunctuationInLongOptionTest): ??who?k??n???e????w? is not a recognized option
  allowsHyphensInTheMiddleOfOptionNames(joptsimple.PunctuationInLongOptionTest): hyphenated-option is not a recognized option
  argumentSeparate(joptsimple.LongOptionRequiredArgumentTest): quiet is not a recognized option
  argumentFollowedByLegalOption(joptsimple.LongOptionRequiredArgumentTest): quiet is not a recognized option
  argumentTogether(joptsimple.LongOptionRequiredArgumentTest): quiet is not a recognized option
  shortOptionSpecifiedAsLongOptionWithArgument(joptsimple.LongOptionRequiredArgumentTest): y is not a recognized option
  whenEndOfOptionsMarkerIsInPlaceOfRequiredArgument(joptsimple.LongOptionRequiredArgumentTest): quiet is not a recognized option
  givesSpecsInOrderOfCommandLinePresentation(joptsimple.OptionSetDetectedOptionsTest): a is not a recognized option
  clusteredOptions(joptsimple.ShortOptionsNoArgumentTest)
  optionsTerminator(joptsimple.ShortOptionsNoArgumentTest): a is not a recognized option
  singleOptionWithOneNonOptionArgument(joptsimple.ShortOptionsNoArgumentTest): c is not a recognized option
  twoSingleOptions(joptsimple.ShortOptionsNoArgumentTest): a is not a recognized option
  singleOption(joptsimple.ShortOptionsNoArgumentTest): a is not a recognized option
  appearingMultipleTimes(joptsimple.ShortOptionsNoArgumentTest): b is not a recognized option
  optionWithOptionalArgumentFollowedByLegalOption(joptsimple.ShortOptionsOptionalArgumentTest): f is not a recognized option
  multipleOfSameOptionSomeWithArgsAndSomeWithout(joptsimple.ShortOptionsOptionalArgumentTest): f is not a recognized option
  optionWithOptionalArgumentPresent(joptsimple.ShortOptionsOptionalArgumentTest): f is not a recognized option
  optionWithOptionalArgumentNotPresent(joptsimple.ShortOptionsOptionalArgumentTest): f is not a recognized option
  optionWithOptionalArgumentThatLooksLikeAValidOption(joptsimple.ShortOptionsOptionalArgumentTest): f is not a recognized option
  parsesSeparatedValuesWhenArgumentAbuttedWithEquals(joptsimple.ParsingSeparatedTypedOptionValuesTest): classpath is not a recognized option
  parsesSeparatedValuesAbutting(joptsimple.ParsingSeparatedTypedOptionValuesTest)
  parsesEqualsSeparatedValuesWhenArgumentAbuttedWithEquals(joptsimple.ParsingSeparatedTypedOptionValuesTest): classpath is not a recognized option
  parsesSeparatedValuesAsSeparateArgument(joptsimple.ParsingSeparatedTypedOptionValuesTest): classpath is not a recognized option
  hasAllSynonymsWhenSecondSynonymParsed(joptsimple.OptionSynonymNoArgumentTest): after-d is not a recognized option
  hasAllSynonymsWhenFirstSynonymParsed(joptsimple.OptionSynonymNoArgumentTest): N is not a recognized option
  hasAllSynonymsWhenThirdSynonymParsed(joptsimple.OptionSynonymNoArgumentTest): n is not a recognized option
  valueOfWhenMultiples(joptsimple.OptionParserOptionExceptionTest): e is not a recognized option
  resolvesToLongOptionEvenWithMatchingShortOptions(joptsimple.ClusterVersusLongOptionWithOptionalArgumentTest): fox is not a recognized option
  resolvesShortOptionToShortOption(joptsimple.ClusterVersusLongOptionWithOptionalArgumentTest): f is not a recognized option
  shortOptionsInDifferentOrder(joptsimple.ClusterVersusLongOptionWithOptionalArgumentTest)
  resolvesToLongOptionWithSingleDashEvenWithMatchingShortOptions(joptsimple.ClusterVersusLongOptionWithOptionalArgumentTest): f is not a recognized option
  withArgumentComingAfterCluster(joptsimple.ClusterVersusLongOptionWithOptionalArgumentTest): f is not a recognized option
  resolvesAbbreviationToLongOption(joptsimple.ClusterVersusLongOptionWithOptionalArgumentTest): f is not a recognized option
  resolvesShortOptionToShortOptionEvenWithDoubleHyphen(joptsimple.ClusterVersusLongOptionWithOptionalArgumentTest): f is not a recognized option
  resolvesToShortOptionsWithArgumentFollowingX(joptsimple.ClusterVersusLongOptionWithOptionalArgumentTest)
  longOptionWithMessedUpOrder(joptsimple.ClusterVersusLongOptionWithOptionalArgumentTest): Unexpected exception, expected<joptsimple.UnrecognizedOptionException> but was<java.lang.NullPointerException>
  commandLineMissingConditionallyRequiredOption(joptsimple.RequiredUnlessAnyTest): Option(s) [a] not configured on this parser
  acceptsCommandLineWithConditionallyRequiredOptionsPresent(joptsimple.RequiredUnlessAnyTest): Option(s) [a] not configured on this parser
  acceptsOptionWithPrerequisiteAsNormalIfPrerequisiteNotInPlay(joptsimple.RequiredUnlessAnyTest): Option(s) [a] not configured on this parser
  commandLineWithNotAllConditionallyRequiredOptionsPresent(joptsimple.RequiredUnlessAnyTest): Option(s) [a] not configured on this parser
  optionsWithOptionalNegativeNumberArgumentsAndNumberOptions(joptsimple.OptionParserNewDeclarationTest): 1 is not a recognized option
  shortArgumentType(joptsimple.OptionParserNewDeclarationTest): a is not a recognized option
  sqlDateArgumentType(joptsimple.OptionParserNewDeclarationTest): a is not a recognized option
  booleanArgumentType(joptsimple.OptionParserNewDeclarationTest): a is not a recognized option
  doubleArgumentType(joptsimple.OptionParserNewDeclarationTest): a is not a recognized option
  integerArgumentType(joptsimple.OptionParserNewDeclarationTest): a is not a recognized option
  floatArgumentType(joptsimple.OptionParserNewDeclarationTest): a is not a recognized option
  sqlTimestampArgumentType(joptsimple.OptionParserNewDeclarationTest): a is not a recognized option
  optionsWithNegativeNumberArgumentsAndNonNumberOptions(joptsimple.OptionParserNewDeclarationTest): 1 is not a recognized option
  optionsWithOptionalNegativeNumberArguments(joptsimple.OptionParserNewDeclarationTest): a is not a recognized option
  longArgumentType(joptsimple.OptionParserNewDeclarationTest): a is not a recognized option
  byteArgumentType(joptsimple.OptionParserNewDeclarationTest): a is not a recognized option
  sqlTimeArgumentType(joptsimple.OptionParserNewDeclarationTest): a is not a recognized option
  parsingSixthPrefix(joptsimple.OptionSynonymCommonPrefixesTest): v is not a recognized option
  parsingFifthPrefix(joptsimple.OptionSynonymCommonPrefixesTest): v is not a recognized option
  parsingFirstPrefix(joptsimple.OptionSynonymCommonPrefixesTest): v is not a recognized option
  parsingThirdPrefix(joptsimple.OptionSynonymCommonPrefixesTest): v is not a recognized option
  parsingFourthPrefix(joptsimple.OptionSynonymCommonPrefixesTest): v is not a recognized option
  parsingSeventhPrefix(joptsimple.OptionSynonymCommonPrefixesTest): v is not a recognized option
  parsingSecondPrefix(joptsimple.OptionSynonymCommonPrefixesTest): v is not a recognized option
  rejectsCommandLineMissingConditionallyRequiredOption(joptsimple.RequiredUnlessTest): Option(s) [anonymous] not configured on this parser
  acceptsOptionWithPrerequisiteAsNormal(joptsimple.RequiredUnlessTest): Option(s) [anonymous] not configured on this parser
  rejectsOptionSpecNotAlreadyConfigured(joptsimple.RequiredUnlessTest): Option(s) [anonymous] not configured on this parser
  rejectsCommandLineWithNotAllConditionallyRequiredOptionsPresent(joptsimple.RequiredUnlessTest): Option(s) [anonymous] not configured on this parser
  presenceOfHelpOptionNegatesRequiredUnlessness(joptsimple.RequiredUnlessTest): Option(s) [anonymous] not configured on this parser
  acceptsCommandLineWithConditionallyRequiredOptionsPresent(joptsimple.RequiredUnlessTest): Option(s) [anonymous] not configured on this parser
  acceptsOptionWithPrerequisite(joptsimple.RequiredUnlessTest): Option(s) [anonymous] not configured on this parser
  rejectsOptionNotAlreadyConfigured(joptsimple.RequiredUnlessTest): Option(s) [anonymous] not configured on this parser
  allowsWhitespaceyStringAsArgumentOfOption(joptsimple.OptionParserTest): j is not a recognized option
  typedArguments(joptsimple.OptionParserTest): a is not a recognized option
  allowsEmbeddedWhitespaceInArgumentOfOption(joptsimple.OptionParserTest): j is not a recognized option
  resetHappensAfterParsing(joptsimple.OptionParserTest)
  shortOptionSpecifiedAsLongOptionWithoutArgument(joptsimple.OptionParserTest): x is not a recognized option
  longOptionLeadsWithSingleDashAmbiguousButShortsAreLegal(joptsimple.OptionParserTest)
  allowsEmptyStringAsArgumentOfOption(joptsimple.OptionParserTest): i is not a recognized option
  longOptionLeadsWithSingleDashAmbiguousButAShortAcceptsAnArgument(joptsimple.OptionParserTest)
  longOptionLeadsWithSingleDash(joptsimple.OptionParserTest)
  optionsAndNonOptionsInterspersed(joptsimple.OptionParserTest)
  doubleHyphenSignalsEndsOfOptions(joptsimple.OptionParserTest): a is not a recognized option
  allowsMixingOfOptionsAndNonOptions(joptsimple.OptionParserTest): i is not a recognized option
  requiredOptionButHelpOptionPresent(joptsimple.OptionParserTest): h is not a recognized option
  handlesConsecutiveDelimiters(joptsimple.ParsingSeparatedStringOptionValuesTest)
  parsesSeparatedValuesWhenArgumentAbuttedWithEquals(joptsimple.ParsingSeparatedStringOptionValuesTest): classpath is not a recognized option
  parsesHyphenSeparatedValuesAbutting(joptsimple.ParsingSeparatedStringOptionValuesTest)
  parsesSeparatedValuesAbutting(joptsimple.ParsingSeparatedStringOptionValuesTest)
  parsesEqualsSeparatedValuesWhenArgumentAbuttedWithEquals(joptsimple.ParsingSeparatedStringOptionValuesTest): classpath is not a recognized option
  parsesSeparatedValuesAsSeparateArgument(joptsimple.ParsingSeparatedStringOptionValuesTest): classpath is not a recognized option
  optionalAbuttedArgumentVersusPosixlyCorrect(joptsimple.InterleavedArgumentsTest)
  optionalArgumentAndPosixlyCorrect(joptsimple.InterleavedArgumentsTest): c is not a recognized option
  requiredArgumentAndPosixlyCorrect(joptsimple.InterleavedArgumentsTest): c is not a recognized option
  requiredArgument(joptsimple.InterleavedArgumentsTest): c is not a recognized option
  optionalKeyValuePairArgumentVersusPosixlyCorrect(joptsimple.InterleavedArgumentsTest): c is not a recognized option
  onlyAppearingToHaveOptionArgumentsButPosixlyCorrect(joptsimple.InterleavedArgumentsTest): c is not a recognized option
  optionalArgument(joptsimple.InterleavedArgumentsTest): c is not a recognized option
  onlyAppearingToHaveOptionArguments(joptsimple.InterleavedArgumentsTest): c is not a recognized option
  resolvesToLongOptionEvenWithMatchingShortOptions(joptsimple.ClusterVersusLongOptionTest): fox is not a recognized option
  resolvesShortOptionToShortOption(joptsimple.ClusterVersusLongOptionTest): f is not a recognized option
  resolvesToLongOptionWithSingleDashEvenWithMatchingShortOptions(joptsimple.ClusterVersusLongOptionTest): f is not a recognized option
  resolvesAbbreviationToLongOption(joptsimple.ClusterVersusLongOptionTest): f is not a recognized option
  resolvesShortOptionToShortOptionEvenWithDoubleHyphen(joptsimple.ClusterVersusLongOptionTest): f is not a recognized option
  hasAllSynonymsWhenSecondSynonymParsed(joptsimple.OptionSynonymOptionalArgumentTest): ou is not a recognized option
  hasAllSynonymsWhenFirstSynonymParsed(joptsimple.OptionSynonymOptionalArgumentTest): d is not a recognized option
  hasAllSynonymsWhenThirdSynonymParsed(joptsimple.OptionSynonymOptionalArgumentTest): fold is not a recognized option
  reportsSameListOfArgumentsForEverySynonymOption(joptsimple.OptionSynonymOptionalArgumentTest): d is not a recognized option
  hasAllSynonymsWhenSecondSynonymParsed(joptsimple.OptionSynonymRequiredArgumentTest): after-date is not a recognized option
  hasAllSynonymsWhenFirstSynonymParsed(joptsimple.OptionSynonymRequiredArgumentTest): N is not a recognized option
  hasAllSynonymsWhenThirdSynonymParsed(joptsimple.OptionSynonymRequiredArgumentTest): newer is not a recognized option
  reportsSameListOfArgumentsForEverySynonymOption(joptsimple.OptionSynonymRequiredArgumentTest): N is not a recognized option
  gives(joptsimple.OptionSetAsMapTest): a is not a recognized option
  argumentSeparate(joptsimple.LongOptionOptionalArgumentTest): output is not a recognized option
  argumentTogether(joptsimple.LongOptionOptionalArgumentTest): output is not a recognized option
  argumentMissingTrailedByAnotherOption(joptsimple.LongOptionOptionalArgumentTest): output is not a recognized option
  resolvesToLongOptionEvenWithMatchingShortOptions(joptsimple.ClusterVersusLongOptionWithRequiredArgumentTest): fox is not a recognized option
  resolvesShortOptionToShortOption(joptsimple.ClusterVersusLongOptionWithRequiredArgumentTest): f is not a recognized option
  shortOptionsInDifferentOrder(joptsimple.ClusterVersusLongOptionWithRequiredArgumentTest)
  resolvesToLongOptionWithSingleDashEvenWithMatchingShortOptions(joptsimple.ClusterVersusLongOptionWithRequiredArgumentTest): f is not a recognized option
  withArgumentComingAfterCluster(joptsimple.ClusterVersusLongOptionWithRequiredArgumentTest): f is not a recognized option
  resolvesAbbreviationToLongOption(joptsimple.ClusterVersusLongOptionWithRequiredArgumentTest): f is not a recognized option
  resolvesShortOptionToShortOptionEvenWithDoubleHyphen(joptsimple.ClusterVersusLongOptionWithRequiredArgumentTest): f is not a recognized option
  resolvesToShortOptionsWithArgumentFollowingX(joptsimple.ClusterVersusLongOptionWithRequiredArgumentTest)
  longOptionWithMessedUpOrder(joptsimple.ClusterVersusLongOptionWithRequiredArgumentTest): Unexpected exception, expected<joptsimple.UnrecognizedOptionException> but was<java.lang.NullPointerException>
  asArgumentOfOption(joptsimple.SingleHyphenTest): o is not a recognized option
  asArgumentOfOptionInSameToken(joptsimple.SingleHyphenTest)
  wExtensionWithLongOptionWithoutAnArgument(joptsimple.WExtensionNoArgumentTest): W is not a recognized option
  abbreviationIsALegalOption(joptsimple.LongOptionNoArgumentTest): verb is not a recognized option
  singleLongOptionAbbreviated(joptsimple.LongOptionNoArgumentTest): verbo is not a recognized option
  singleLongOption(joptsimple.LongOptionNoArgumentTest): verbose is not a recognized option
  parsesSeparatedValuesWhenArgumentAbuttedWithEquals(joptsimple.ParsingSeparatedConvertedOptionValuesTest): classpath is not a recognized option
  parsesSeparatedValuesAbutting(joptsimple.ParsingSeparatedConvertedOptionValuesTest)
  parsesEqualsSeparatedValuesWhenArgumentAbuttedWithEquals(joptsimple.ParsingSeparatedConvertedOptionValuesTest): classpath is not a recognized option
  parsesSeparatedValuesAsSeparateArgument(joptsimple.ParsingSeparatedConvertedOptionValuesTest): classpath is not a recognized option
  optionalArgOptionWithDefaultGivesArgIfSpecifiedOnCommandLine(joptsimple.HandlingDefaultValuesForOptionArgumentsTest): a is not a recognized option
  optionalArgOptionWithDefaultGivesDefaultIfArgNotSpecifiedOnCommandLine(joptsimple.HandlingDefaultValuesForOptionArgumentsTest): a is not a recognized option
  specifiedOptionArgumentsTrumpsListOfDefaults(joptsimple.HandlingDefaultValuesForOptionArgumentsTest): c is not a recognized option
  requiredArgOptionWithDefaultGivesArgIfArgSpecifiedOnCommandLine(joptsimple.HandlingDefaultValuesForOptionArgumentsTest): a is not a recognized option
  requiredArgOptionWithDefaultStillsFailToParseIfArgNotSpecifiedOnCommandLine(joptsimple.HandlingDefaultValuesForOptionArgumentsTest): Unexpected exception, expected<joptsimple.OptionMissingRequiredArgumentException> but was<joptsimple.UnrecognizedOptionException>
  clusteredOptionsWithOneAcceptingAnArgument(joptsimple.ShortOptionsRequiredArgumentTest)
  inSameToken(joptsimple.ShortOptionsRequiredArgumentTest)
  clusteredOptionsWithLastOneAcceptingAnArgument(joptsimple.ShortOptionsRequiredArgumentTest)
  argumentNotPresentFollowedByAnotherOption(joptsimple.ShortOptionsRequiredArgumentTest): d is not a recognized option
  withArgument(joptsimple.ShortOptionsRequiredArgumentTest): d is not a recognized option
  appearingMultipleTimes(joptsimple.ShortOptionsRequiredArgumentTest): d is not a recognized option
  whenEndOfOptionsMarkerIsInPlaceOfRequiredArgument(joptsimple.ShortOptionsRequiredArgumentTest): d is not a recognized option
  createsParserWithOptionSpecificationString(joptsimple.CreateWithOptionSpecificationStringTest): k is not a recognized option
  rejectsCommandLineMissingConditionallyRequiredOptionSynonym(joptsimple.RequiredIfTest): Option(s) [file-transfer] not configured on this parser
  rejectsCommandLineMissingConditionallyRequiredOption(joptsimple.RequiredIfTest): Option(s) [file-transfer] not configured on this parser
  rejectsOptionSpecNotAlreadyConfigured(joptsimple.RequiredIfTest): Option(s) [file-transfer] not configured on this parser
  rejectsCommandLineWithNotAllConditionallyRequiredOptionsPresent(joptsimple.RequiredIfTest): Option(s) [file-transfer] not configured on this parser
  acceptsCommandLineWithConditionallyRequiredOptionsPresent(joptsimple.RequiredIfTest): Option(s) [file-transfer] not configured on this parser
  acceptsOptionWithPrerequisiteAsNormalIfPrerequisiteNotInPlay(joptsimple.RequiredIfTest): Option(s) [file-transfer] not configured on this parser
  rejectsOptionNotAlreadyConfigured(joptsimple.RequiredIfTest): Option(s) [file-transfer] not configured on this parser
  presenceOfHelpOptionNegatesRequiredIfness(joptsimple.RequiredIfTest): Option(s) [file-transfer] not configured on this parser
  abbreviation(joptsimple.WAsAbbreviationForLongOptionTest): W is not a recognized option
  treatsHAsThoughItWereLastDefinedSynonymOfH(joptsimple.OptionSynonymOverwritingTest): h is not a recognized option
  unrecognizedOptionAllowed(joptsimple.OptionParserUnrecognizedOptionsAllowedTest)
  parseWithPosixlyCorrect[0](joptsimple.PosixlyCorrectOptionParserTest)
  parseWithPosixlyCorrect[1](joptsimple.PosixlyCorrectOptionParserTest)
  allowsDifferentFormsOfPairingArgumentWithOption(joptsimple.examples.ShortOptionsWithArgumentPositioningTest): a is not a recognized option
  usesConvertersOnOptionArgumentsWhenTold(joptsimple.examples.OptionArgumentConverterTest): birthdate is not a recognized option
  aHelpOptionMeansRequiredOptionsNeedNotBePresent(joptsimple.examples.RequiredOptionsTest): help is not a recognized option
  allowsSpecificationOfDefaultValues(joptsimple.examples.DefaultValuesForOptionArgumentsTest): level is not a recognized option
  supportsOptionSynonyms(joptsimple.examples.OptionSynonymTest): message is not a recognized option
  allowsOptionsToAcceptArguments(joptsimple.examples.ShortOptionsWithArgumentsTest): f is not a recognized option
  handlesAlternativeLongOptions(joptsimple.examples.AlternativeLongOptionsTest): W is not a recognized option
  allowsDifferentFormsOfPairingArgumentWithOption(joptsimple.examples.LongOptionsWithArgumentPositioningTest): count is not a recognized option
  supportsPosixlyCorrectBehavior(joptsimple.examples.PosixlyCorrectTest)
  convertsArgumentsToJavaValueTypes(joptsimple.examples.OptionArgumentValueTypeTest): count is not a recognized option
  acceptsLongOptions(joptsimple.examples.UnrecognizedOptionsAllowedTest)
  acceptsLongOptions(joptsimple.examples.LongOptionsTest): flag is not a recognized option
  allowsClusteringShortOptions(joptsimple.examples.ShortOptionsClusteringTest)
  allowsClusteringShortOptionsThatAcceptArguments(joptsimple.examples.ShortOptionsClusteringWithArgumentTest)
  doubleHyphenSignalsEndOfOptions(joptsimple.examples.SignallingEndOfOptionsTest): a is not a recognized option
  supportsMultipleDelimitedArguments(joptsimple.examples.MultipleDelimitedArgumentsTest): path is not a recognized option
  handlesNegativeNumberOptionalArguments(joptsimple.examples.SpecialOptionalArgumentHandlingTest): a is not a recognized option
  allowsMultipleValuesForAnOption(joptsimple.examples.ShortOptionsWithMultipleArgumentsForSingleOptionTest): a is not a recognized option
  supportsShortOptions(joptsimple.examples.ShortOptionsTest): a is not a recognized option
  supportsLongOptionsWithArgumentsAndAbbreviations(joptsimple.examples.LongOptionsWithArgumentsTest): f is not a recognized option
  allowsExportOfOptions(joptsimple.examples.ExportOptionsTest): count is not a recognized option
  allowsTypesafeRetrievalOfOptionArguments(joptsimple.examples.TypesafeOptionArgumentRetrievalTest): count is not a recognized option
  primitiveIntAllowedAsTypeSpecifier(joptsimple.TypesafeOptionArgumentRetrievalTest): F is not a recognized option
  retrievalOfTypedOptionalArgumentsInATypesafeManner(joptsimple.TypesafeOptionArgumentRetrievalTest): b is not a recognized option
  retrievalOfUntypedRequiredArgumentsInATypesafeManner(joptsimple.TypesafeOptionArgumentRetrievalTest): c is not a recognized option
  canSubvertTypeSafetyIfYouUseAnOptionSpecAsTheWrongType(joptsimple.TypesafeOptionArgumentRetrievalTest): Unexpected exception, expected<java.lang.ClassCastException> but was<joptsimple.UnrecognizedOptionException>
  wrapsValueConversionExceptionsRaisedByConverter(joptsimple.TypesafeOptionArgumentRetrievalTest): m is not a recognized option
  cannotFoolValuesOfWithAnOptionNotIssuedFromBuilder(joptsimple.TypesafeOptionArgumentRetrievalTest): h is not a recognized option
  primitiveLongAllowedAsTypeSpecifier(joptsimple.TypesafeOptionArgumentRetrievalTest): g is not a recognized option
  canSubvertTypeSafetyIfYouGiveAnOptionSpecToOptionSetAsTheWrongType(joptsimple.TypesafeOptionArgumentRetrievalTest): Unexpected exception, expected<java.lang.ClassCastException> but was<joptsimple.UnrecognizedOptionException>
  retrievalOfTypedRequiredArgumentsInATypesafeManner(joptsimple.TypesafeOptionArgumentRetrievalTest): a is not a recognized option
  primitiveShortAllowedAsTypeSpecifier(joptsimple.TypesafeOptionArgumentRetrievalTest): H is not a recognized option
  cannotFoolHasWithAnOptionNotIssuedFromBuilder(joptsimple.TypesafeOptionArgumentRetrievalTest): e is not a recognized option
  usesConverterIfProvided(joptsimple.TypesafeOptionArgumentRetrievalTest): L is not a recognized option
  cannotFoolHasArgumentWithAnOptionNotIssuedFromBuilder(joptsimple.TypesafeOptionArgumentRetrievalTest): f is not a recognized option
  cannotFoolValueOfWithAnOptionNotIssuedFromBuilder(joptsimple.TypesafeOptionArgumentRetrievalTest): g is not a recognized option
  primitiveByteAllowedAsTypeSpecifier(joptsimple.TypesafeOptionArgumentRetrievalTest): b is not a recognized option
  retrievalWithVoidOption(joptsimple.TypesafeOptionArgumentRetrievalTest): e is not a recognized option
  retrievalOfUntypedOptionalArgumentsInATypesafeManner(joptsimple.TypesafeOptionArgumentRetrievalTest): d is not a recognized option
  primitiveFloatAllowedAsTypeSpecifier(joptsimple.TypesafeOptionArgumentRetrievalTest): e is not a recognized option
  primitiveBooleanAllowedAsTypeSpecifier(joptsimple.TypesafeOptionArgumentRetrievalTest): a is not a recognized option
  primitiveDoubleAllowedAsTypeSpecifier(joptsimple.TypesafeOptionArgumentRetrievalTest): d is not a recognized option
  canUseBooleanType(joptsimple.TypesafeOptionArgumentRetrievalTest): k is not a recognized option

Tests run: 745, Failures: 31, Errors: 230, Skipped: 0

[INFO] ------------------------------------------------------------------------
[INFO] BUILD FAILURE
[INFO] ------------------------------------------------------------------------
[INFO] Total time: 7.867s
[INFO] Finished at: Sun Aug 02 00:21:04 BST 2015
[INFO] Final Memory: 20M/289M
[INFO] ------------------------------------------------------------------------
[ERROR] Failed to execute goal org.apache.maven.plugins:maven-surefire-plugin:2.10:test (default-test) on project jopt-simple: There are test failures.
[ERROR] 
[ERROR] Please refer to /home/perham/Study/LittleDarwin/Cases/jopt-simple-4.8/target/surefire-reports for the individual test results.
[ERROR] -> [Help 1]
[ERROR] 
[ERROR] To see the full stack trace of the errors, re-run Maven with the -e switch.
[ERROR] Re-run Maven using the -X switch to enable full debug logging.
[ERROR] 
[ERROR] For more information about the errors and possible solutions, please read the following articles:
[ERROR] [Help 1] http://cwiki.apache.org/confluence/display/MAVEN/MojoFailureException
