[INFO] Scanning for projects...
[INFO]                                                                         
[INFO] ------------------------------------------------------------------------
[INFO] Building JOpt Simple 4.8
[INFO] ------------------------------------------------------------------------
[WARNING] The POM for com.googlecode.jmockit:jmockit:jar:1.6 is invalid, transitive dependencies (if any) will not be available, enable debug logging for more details
[INFO] 
[INFO] --- maven-enforcer-plugin:1.0:enforce (enforce-maven) @ jopt-simple ---
[INFO] 
[INFO] --- maven-resources-plugin:2.3:resources (default-resources) @ jopt-simple ---
[INFO] Using 'UTF-8' encoding to copy filtered resources.
[INFO] Copying 1 resource
[INFO] 
[INFO] --- maven-compiler-plugin:3.1:compile (default-compile) @ jopt-simple ---
[INFO] Changes detected - recompiling the module!
[INFO] Compiling 44 source files to /home/perham/Study/LittleDarwin/Cases/jopt-simple-4.8/target/classes
[WARNING] /home/perham/Study/LittleDarwin/Cases/jopt-simple-4.8/src/main/java/joptsimple/OptionMissingRequiredArgumentException.java: /home/perham/Study/LittleDarwin/Cases/jopt-simple-4.8/src/main/java/joptsimple/OptionMissingRequiredArgumentException.java uses unchecked or unsafe operations.
[WARNING] /home/perham/Study/LittleDarwin/Cases/jopt-simple-4.8/src/main/java/joptsimple/OptionMissingRequiredArgumentException.java: Recompile with -Xlint:unchecked for details.
[INFO] 
[INFO] >>> maven-pmd-plugin:3.2:cpd-check (default) @ jopt-simple >>>
[INFO] 
[INFO] --- maven-pmd-plugin:3.2:cpd (cpd) @ jopt-simple ---
[WARNING] Unable to locate Source XRef to link to - DISABLED
[INFO] 
[INFO] <<< maven-pmd-plugin:3.2:cpd-check (default) @ jopt-simple <<<
[INFO] 
[INFO] --- maven-pmd-plugin:3.2:cpd-check (default) @ jopt-simple ---
[INFO] 
[INFO] 
[INFO] --- animal-sniffer-maven-plugin:1.11:check (check-signature) @ jopt-simple ---
[INFO] Checking unresolved references to org.codehaus.mojo.signature:java15:1.0
[INFO] 
[INFO] --- maven-resources-plugin:2.3:testResources (default-testResources) @ jopt-simple ---
[INFO] Using 'UTF-8' encoding to copy filtered resources.
[INFO] skip non existing resourceDirectory /home/perham/Study/LittleDarwin/Cases/jopt-simple-4.8/src/test/resources
[INFO] 
[INFO] --- maven-compiler-plugin:3.1:testCompile (default-testCompile) @ jopt-simple ---
[INFO] Nothing to compile - all classes are up to date
[INFO] 
[INFO] --- maven-surefire-plugin:2.10:test (default-test) @ jopt-simple ---
[INFO] Surefire report directory: /home/perham/Study/LittleDarwin/Cases/jopt-simple-4.8/target/surefire-reports

-------------------------------------------------------
 T E S T S
-------------------------------------------------------
Running joptsimple.OptionSpecBuilderOptionsImmutabilityTest
Tests run: 12, Failures: 0, Errors: 0, Skipped: 0, Time elapsed: 0.456 sec
Running joptsimple.JVMSystemPropertiesArgumentParsingTest
Tests run: 1, Failures: 0, Errors: 1, Skipped: 0, Time elapsed: 0.016 sec <<< FAILURE!
Running joptsimple.WAsShortOptionTest
Tests run: 2, Failures: 1, Errors: 1, Skipped: 0, Time elapsed: 0.022 sec <<< FAILURE!
Running joptsimple.OptionSetValuesOfOptionStringImmutabilityTest
Tests run: 12, Failures: 0, Errors: 0, Skipped: 0, Time elapsed: 0.02 sec
Running joptsimple.ArgumentListHasNoMoreArgsTest
Tests run: 3, Failures: 0, Errors: 0, Skipped: 0, Time elapsed: 0.006 sec
Running joptsimple.util.KeyValuePairUnequalValuesTest
Tests run: 8, Failures: 0, Errors: 0, Skipped: 0, Time elapsed: 0.01 sec
Running joptsimple.util.DateConverterTest
Tests run: 11, Failures: 0, Errors: 0, Skipped: 0, Time elapsed: 0.14 sec
Running joptsimple.util.KeyValuePairUnequalKeysTest
Tests run: 8, Failures: 0, Errors: 0, Skipped: 0, Time elapsed: 0.013 sec
Running joptsimple.util.InetAddressConverterTest
Tests run: 2, Failures: 0, Errors: 0, Skipped: 0, Time elapsed: 0.02 sec
Running joptsimple.util.KeyValuePairTest
Tests run: 7, Failures: 0, Errors: 0, Skipped: 0, Time elapsed: 0.01 sec
Running joptsimple.util.RegexMatcherTest
Tests run: 6, Failures: 0, Errors: 0, Skipped: 0, Time elapsed: 0.013 sec
Running joptsimple.OptionSetSpecsImmutabilityTest
Tests run: 12, Failures: 0, Errors: 0, Skipped: 0, Time elapsed: 0.019 sec
Running joptsimple.ArgumentAcceptingOptionSpecTest
Tests run: 16, Failures: 0, Errors: 0, Skipped: 0, Time elapsed: 0.016 sec
Running joptsimple.AlternativeLongOptionSpecValuesImmutabilityTest
Tests run: 12, Failures: 0, Errors: 0, Skipped: 0, Time elapsed: 0.013 sec
Running joptsimple.RequiredIfAnyTest
Tests run: 5, Failures: 0, Errors: 5, Skipped: 0, Time elapsed: 0.009 sec <<< FAILURE!
Running joptsimple.ClusterWhereManyOptionsAcceptArgumentsTest
Tests run: 12, Failures: 0, Errors: 12, Skipped: 0, Time elapsed: 0.019 sec <<< FAILURE!
Running joptsimple.OptionSpecsReportTheirOptionsSortedSpeciallyTest
Tests run: 1, Failures: 0, Errors: 0, Skipped: 0, Time elapsed: 0.001 sec
Running joptsimple.DefaultSettingsOptionParserHelpTest
Tests run: 39, Failures: 28, Errors: 0, Skipped: 0, Time elapsed: 0.084 sec <<< FAILURE!
Running joptsimple.WExtensionWithArgumentTest
Tests run: 7, Failures: 2, Errors: 5, Skipped: 0, Time elapsed: 0.016 sec <<< FAILURE!
Running joptsimple.PunctuationInShortOptionTest
Tests run: 4, Failures: 0, Errors: 3, Skipped: 0, Time elapsed: 0.007 sec <<< FAILURE!
Running joptsimple.PunctuationInLongOptionTest
Tests run: 6, Failures: 0, Errors: 5, Skipped: 0, Time elapsed: 0.011 sec <<< FAILURE!
Running joptsimple.LongOptionRequiredArgumentTest
Tests run: 6, Failures: 1, Errors: 5, Skipped: 0, Time elapsed: 0.013 sec <<< FAILURE!
Running joptsimple.ToStringTest
Tests run: 3, Failures: 0, Errors: 0, Skipped: 0, Time elapsed: 0.012 sec
Running joptsimple.OptionSetDetectedOptionsTest
Tests run: 1, Failures: 0, Errors: 1, Skipped: 0, Time elapsed: 0.003 sec <<< FAILURE!
Running joptsimple.OptionSpecBuilderValuesImmutabilityTest
Tests run: 12, Failures: 0, Errors: 0, Skipped: 0, Time elapsed: 0.017 sec
Running joptsimple.ShortOptionsNoArgumentTest
Tests run: 6, Failures: 0, Errors: 6, Skipped: 0, Time elapsed: 0.012 sec <<< FAILURE!
Running joptsimple.OptionalArgumentOptionSpecValuesImmutabilityTest
Tests run: 12, Failures: 0, Errors: 0, Skipped: 0, Time elapsed: 0.016 sec
Running joptsimple.AlternativeLongOptionSpecOptionsImmutabilityTest
Tests run: 12, Failures: 0, Errors: 0, Skipped: 0, Time elapsed: 0.015 sec
Running joptsimple.ShortOptionsOptionalArgumentTest
Tests run: 6, Failures: 1, Errors: 5, Skipped: 0, Time elapsed: 0.012 sec <<< FAILURE!
Running joptsimple.ValueConverterAdmitsSubclassesOfValueTypeTest
Tests run: 1, Failures: 0, Errors: 0, Skipped: 0, Time elapsed: 0.001 sec
Running joptsimple.PopulatedOptionSetTest
Tests run: 4, Failures: 0, Errors: 0, Skipped: 0, Time elapsed: 0.005 sec
Running joptsimple.ParsingSeparatedTypedOptionValuesTest
Tests run: 4, Failures: 0, Errors: 4, Skipped: 0, Time elapsed: 0.007 sec <<< FAILURE!
Running joptsimple.OptionSynonymNoArgumentTest
Tests run: 3, Failures: 0, Errors: 3, Skipped: 0, Time elapsed: 0.006 sec <<< FAILURE!
Running joptsimple.OptionParserOptionExceptionTest
Tests run: 5, Failures: 2, Errors: 1, Skipped: 0, Time elapsed: 0.01 sec <<< FAILURE!
Running joptsimple.ClusterVersusLongOptionWithOptionalArgumentTest
Tests run: 9, Failures: 0, Errors: 9, Skipped: 0, Time elapsed: 0.018 sec <<< FAILURE!
Running joptsimple.RequiredUnlessAnyTest
Tests run: 4, Failures: 0, Errors: 4, Skipped: 0, Time elapsed: 0.013 sec <<< FAILURE!
Running joptsimple.OptionParserNewDeclarationTest
Tests run: 16, Failures: 0, Errors: 15, Skipped: 0, Time elapsed: 0.021 sec <<< FAILURE!
Running joptsimple.RequiredArgumentOptionSpecEqualsHashCodeTest
Tests run: 10, Failures: 0, Errors: 0, Skipped: 0, Time elapsed: 0.013 sec
Running joptsimple.OptionSynonymCommonPrefixesTest
Tests run: 7, Failures: 0, Errors: 7, Skipped: 0, Time elapsed: 0.013 sec <<< FAILURE!
Running joptsimple.OptionalArgumentOptionSpecOptionsImmutabilityTest
Tests run: 12, Failures: 0, Errors: 0, Skipped: 0, Time elapsed: 0.013 sec
Running joptsimple.RequiredUnlessTest
Tests run: 8, Failures: 0, Errors: 8, Skipped: 0, Time elapsed: 0.016 sec <<< FAILURE!
Running joptsimple.ArgumentListTest
Tests run: 2, Failures: 0, Errors: 0, Skipped: 0, Time elapsed: 0.001 sec
Running joptsimple.NoArgumentOptionSpecTest
Tests run: 11, Failures: 0, Errors: 0, Skipped: 0, Time elapsed: 0.015 sec
Running joptsimple.RequiredArgumentOptionSpecValuesImmutabilityTest
Tests run: 12, Failures: 0, Errors: 0, Skipped: 0, Time elapsed: 0.011 sec
Running joptsimple.OptionParserTest
Tests run: 17, Failures: 3, Errors: 14, Skipped: 0, Time elapsed: 0.023 sec <<< FAILURE!
Running joptsimple.PlainOldOptionParserTest
Tests run: 1, Failures: 0, Errors: 1, Skipped: 0, Time elapsed: 0.001 sec <<< FAILURE!
Running joptsimple.OptionExceptionOptionsImmutabilityTest
Tests run: 12, Failures: 0, Errors: 0, Skipped: 0, Time elapsed: 0.011 sec
Running joptsimple.ParsingSeparatedStringOptionValuesTest
Tests run: 6, Failures: 0, Errors: 6, Skipped: 0, Time elapsed: 0.011 sec <<< FAILURE!
Running joptsimple.OptionParserAlternateHelpFormatterTest
Tests run: 2, Failures: 1, Errors: 0, Skipped: 0, Time elapsed: 0.004 sec <<< FAILURE!
Running joptsimple.InterleavedArgumentsTest
Tests run: 9, Failures: 0, Errors: 9, Skipped: 0, Time elapsed: 0.01 sec <<< FAILURE!
Running joptsimple.ClusterVersusLongOptionTest
Tests run: 5, Failures: 0, Errors: 5, Skipped: 0, Time elapsed: 0.008 sec <<< FAILURE!
Running joptsimple.OptionSynonymOptionalArgumentTest
Tests run: 4, Failures: 0, Errors: 4, Skipped: 0, Time elapsed: 0.007 sec <<< FAILURE!
Running joptsimple.OptionSynonymRequiredArgumentTest
Tests run: 4, Failures: 0, Errors: 4, Skipped: 0, Time elapsed: 0.007 sec <<< FAILURE!
Running joptsimple.internal.ObjectsUtilityClassTest
Tests run: 1, Failures: 0, Errors: 0, Skipped: 0, Time elapsed: 0.009 sec
Running joptsimple.internal.RowEqualsHashCodeTest
Tests run: 9, Failures: 0, Errors: 0, Skipped: 0, Time elapsed: 0.005 sec
Running joptsimple.internal.RowsTest
Tests run: 3, Failures: 0, Errors: 0, Skipped: 0, Time elapsed: 0.009 sec
Running joptsimple.internal.AbbreviationMapTest
Tests run: 22, Failures: 14, Errors: 0, Skipped: 0, Time elapsed: 0.029 sec <<< FAILURE!
Running joptsimple.internal.AbbreviationMapToJavaUtilMapTest
Tests run: 12, Failures: 8, Errors: 0, Skipped: 0, Time elapsed: 0.018 sec <<< FAILURE!
Running joptsimple.internal.ReflectionUtilityClassTest
Tests run: 1, Failures: 0, Errors: 0, Skipped: 0, Time elapsed: 0.001 sec
Running joptsimple.internal.ClassesUtilityClassTest
Tests run: 1, Failures: 0, Errors: 0, Skipped: 0, Time elapsed: 0.002 sec
Running joptsimple.internal.StringsUtilityClassTest
Tests run: 1, Failures: 0, Errors: 0, Skipped: 0, Time elapsed: 0.002 sec
Running joptsimple.internal.ReflectionTest
Tests run: 6, Failures: 0, Errors: 0, Skipped: 0, Time elapsed: 0.01 sec
Running joptsimple.OptionSetAsMapTest
Tests run: 1, Failures: 0, Errors: 1, Skipped: 0, Time elapsed: 0.003 sec <<< FAILURE!
Running joptsimple.NoArgumentOptionSpecOptionsImmutabilityTest
Tests run: 12, Failures: 0, Errors: 0, Skipped: 0, Time elapsed: 0.014 sec
Running joptsimple.LongOptionOptionalArgumentTest
Tests run: 3, Failures: 0, Errors: 3, Skipped: 0, Time elapsed: 0.007 sec <<< FAILURE!
Running joptsimple.ClusterVersusLongOptionWithRequiredArgumentTest
Tests run: 9, Failures: 0, Errors: 9, Skipped: 0, Time elapsed: 0.015 sec <<< FAILURE!
Running joptsimple.OptionalArgumentOptionSpecTest
Tests run: 11, Failures: 0, Errors: 0, Skipped: 0, Time elapsed: 0.008 sec
Running joptsimple.OptionSetValuesOfSpecImmutabilityTest
Tests run: 12, Failures: 0, Errors: 0, Skipped: 0, Time elapsed: 0.009 sec
Running joptsimple.OptionSpecTokenizerTest
Tests run: 17, Failures: 0, Errors: 0, Skipped: 0, Time elapsed: 0.022 sec
Running joptsimple.SingleHyphenTest
Tests run: 3, Failures: 0, Errors: 3, Skipped: 0, Time elapsed: 0.007 sec <<< FAILURE!
Running joptsimple.WExtensionNoArgumentTest
Tests run: 2, Failures: 1, Errors: 1, Skipped: 0, Time elapsed: 0.005 sec <<< FAILURE!
Running joptsimple.RequiredArgumentOptionSpecOptionsImmutabilityTest
Tests run: 12, Failures: 0, Errors: 0, Skipped: 0, Time elapsed: 0.015 sec
Running joptsimple.ParserRulesUtilityClassTest
Tests run: 1, Failures: 0, Errors: 0, Skipped: 0, Time elapsed: 0.002 sec
Running joptsimple.ConfigurableOptionParserHelpTest
Tests run: 27, Failures: 26, Errors: 0, Skipped: 0, Time elapsed: 0.049 sec <<< FAILURE!
Running joptsimple.NonOptionArgumentSpecTest
Tests run: 7, Failures: 0, Errors: 5, Skipped: 0, Time elapsed: 0.007 sec <<< FAILURE!
Running joptsimple.OptionExceptionMessageTest
Tests run: 8, Failures: 0, Errors: 0, Skipped: 0, Time elapsed: 0.014 sec
Running joptsimple.LongOptionNoArgumentTest
Tests run: 4, Failures: 1, Errors: 3, Skipped: 0, Time elapsed: 0.01 sec <<< FAILURE!
Running joptsimple.ArgumentAcceptingOptionSpecDefaultValuesImmutabilityTest
Tests run: 12, Failures: 0, Errors: 0, Skipped: 0, Time elapsed: 0.017 sec
Running joptsimple.ParsingSeparatedConvertedOptionValuesTest
Tests run: 4, Failures: 0, Errors: 4, Skipped: 0, Time elapsed: 0.017 sec <<< FAILURE!
Running joptsimple.HandlingDefaultValuesForOptionArgumentsTest
Tests run: 9, Failures: 0, Errors: 9, Skipped: 0, Time elapsed: 0.021 sec <<< FAILURE!
Running joptsimple.ShortOptionsRequiredArgumentTest
Tests run: 9, Failures: 2, Errors: 7, Skipped: 0, Time elapsed: 0.02 sec <<< FAILURE!
Running joptsimple.CreateWithOptionSpecificationStringTest
Tests run: 1, Failures: 0, Errors: 1, Skipped: 0, Time elapsed: 0.001 sec <<< FAILURE!
Running joptsimple.EmptyOptionSetTest
Tests run: 8, Failures: 0, Errors: 0, Skipped: 0, Time elapsed: 0.012 sec
Running joptsimple.OptionParserArgumentExceptionTest
Tests run: 9, Failures: 0, Errors: 0, Skipped: 0, Time elapsed: 0.01 sec
Running joptsimple.RequiredIfTest
Tests run: 8, Failures: 0, Errors: 8, Skipped: 0, Time elapsed: 0.011 sec <<< FAILURE!
Running joptsimple.NoArgumentOptionSpecValuesImmutabilityTest
Tests run: 12, Failures: 0, Errors: 0, Skipped: 0, Time elapsed: 0.015 sec
Running joptsimple.WAsAbbreviationForLongOptionTest
Tests run: 2, Failures: 1, Errors: 1, Skipped: 0, Time elapsed: 0.005 sec <<< FAILURE!
Running joptsimple.OptionSynonymOverwritingTest
Tests run: 1, Failures: 0, Errors: 1, Skipped: 0, Time elapsed: 0.002 sec <<< FAILURE!
Running joptsimple.OptionParserRecognizedOptionsTest
Tests run: 2, Failures: 0, Errors: 0, Skipped: 0, Time elapsed: 0.004 sec
Running joptsimple.OptionSetNonOptionArgumentsImmutabilityTest
Tests run: 12, Failures: 0, Errors: 0, Skipped: 0, Time elapsed: 0.019 sec
Running joptsimple.OptionParserUnrecognizedOptionsAllowedTest
Tests run: 2, Failures: 1, Errors: 1, Skipped: 0, Time elapsed: 0.005 sec <<< FAILURE!
Running joptsimple.PosixlyCorrectOptionParserTest
Tests run: 2, Failures: 0, Errors: 2, Skipped: 0, Time elapsed: 0.003 sec <<< FAILURE!
Running joptsimple.examples.ShortOptionsWithArgumentPositioningTest
Tests run: 1, Failures: 0, Errors: 1, Skipped: 0, Time elapsed: 0.001 sec <<< FAILURE!
Running joptsimple.examples.OptionArgumentConverterTest
Tests run: 1, Failures: 0, Errors: 1, Skipped: 0, Time elapsed: 0.002 sec <<< FAILURE!
Running joptsimple.examples.RequiredOptionsTest
Tests run: 3, Failures: 0, Errors: 3, Skipped: 0, Time elapsed: 0.002 sec <<< FAILURE!
Running joptsimple.examples.DefaultValuesForOptionArgumentsTest
Tests run: 1, Failures: 0, Errors: 1, Skipped: 0, Time elapsed: 0.015 sec <<< FAILURE!
Running joptsimple.examples.OptionSynonymTest
Tests run: 1, Failures: 0, Errors: 1, Skipped: 0, Time elapsed: 0.001 sec <<< FAILURE!
Running joptsimple.examples.ShortOptionsWithArgumentsTest
Tests run: 1, Failures: 0, Errors: 1, Skipped: 0, Time elapsed: 0.002 sec <<< FAILURE!
Running joptsimple.examples.AlternativeLongOptionsTest
Tests run: 1, Failures: 0, Errors: 1, Skipped: 0, Time elapsed: 0.001 sec <<< FAILURE!
Running joptsimple.examples.LongOptionsWithArgumentPositioningTest
Tests run: 1, Failures: 0, Errors: 1, Skipped: 0, Time elapsed: 0.001 sec <<< FAILURE!
Running joptsimple.examples.PosixlyCorrectTest
Tests run: 1, Failures: 0, Errors: 1, Skipped: 0, Time elapsed: 0 sec <<< FAILURE!
Running joptsimple.examples.OptionArgumentValueTypeTest
Tests run: 1, Failures: 0, Errors: 1, Skipped: 0, Time elapsed: 0 sec <<< FAILURE!
Running joptsimple.examples.UnrecognizedOptionsAllowedTest
Tests run: 1, Failures: 0, Errors: 1, Skipped: 0, Time elapsed: 0.001 sec <<< FAILURE!
Running joptsimple.examples.LongOptionsTest
Tests run: 1, Failures: 0, Errors: 1, Skipped: 0, Time elapsed: 0.002 sec <<< FAILURE!
Running joptsimple.examples.ShortOptionsClusteringTest
Tests run: 1, Failures: 0, Errors: 1, Skipped: 0, Time elapsed: 0.001 sec <<< FAILURE!
Running joptsimple.examples.ShortOptionsClusteringWithArgumentTest
Tests run: 1, Failures: 0, Errors: 1, Skipped: 0, Time elapsed: 0.027 sec <<< FAILURE!
Running joptsimple.examples.SignallingEndOfOptionsTest
Tests run: 1, Failures: 0, Errors: 1, Skipped: 0, Time elapsed: 0.001 sec <<< FAILURE!
Running joptsimple.examples.MultipleDelimitedArgumentsTest
Tests run: 1, Failures: 0, Errors: 1, Skipped: 0, Time elapsed: 0.001 sec <<< FAILURE!
Running joptsimple.examples.SpecialOptionalArgumentHandlingTest
Tests run: 1, Failures: 0, Errors: 1, Skipped: 0, Time elapsed: 0 sec <<< FAILURE!
Running joptsimple.examples.ShortOptionsWithMultipleArgumentsForSingleOptionTest
Tests run: 1, Failures: 0, Errors: 1, Skipped: 0, Time elapsed: 0.002 sec <<< FAILURE!
Running joptsimple.examples.ShortOptionsTest
Tests run: 1, Failures: 0, Errors: 1, Skipped: 0, Time elapsed: 0.002 sec <<< FAILURE!
Running joptsimple.examples.LongOptionsWithArgumentsTest
Tests run: 1, Failures: 0, Errors: 1, Skipped: 0, Time elapsed: 0.002 sec <<< FAILURE!
Running joptsimple.examples.ExportOptionsTest
Tests run: 1, Failures: 0, Errors: 1, Skipped: 0, Time elapsed: 0 sec <<< FAILURE!
Running joptsimple.examples.TypesafeOptionArgumentRetrievalTest
Tests run: 1, Failures: 0, Errors: 1, Skipped: 0, Time elapsed: 0.001 sec <<< FAILURE!
Running joptsimple.TypesafeOptionArgumentRetrievalTest
Tests run: 22, Failures: 0, Errors: 21, Skipped: 0, Time elapsed: 0.022 sec <<< FAILURE!
Running joptsimple.OptionSetEqualsHashCodeTest
Tests run: 9, Failures: 0, Errors: 0, Skipped: 0, Time elapsed: 0.022 sec

Results :

Failed tests:   recognizeLongOptionsTrumpsShortOptionW(joptsimple.WAsShortOptionTest): 
  marksRequiredOptionsSpecially(joptsimple.DefaultSettingsOptionParserHelpTest): no non-options argument spec
  optionSynonymsWithOptionalArgument(joptsimple.DefaultSettingsOptionParserHelpTest): no non-options argument spec
  oneOptionRequiredArgNoDescriptionWithType(joptsimple.DefaultSettingsOptionParserHelpTest): no non-options argument spec
  includesDefaultValueForRequiredOptionArgument(joptsimple.DefaultSettingsOptionParserHelpTest): no non-options argument spec
  oneOptionOptionalArgNoDescription(joptsimple.DefaultSettingsOptionParserHelpTest): no non-options argument spec
  includesDefaultValueForArgumentWithDescription(joptsimple.DefaultSettingsOptionParserHelpTest): no non-options argument spec
  oneOptionOptionalArgNoDescriptionWithType(joptsimple.DefaultSettingsOptionParserHelpTest): no non-options argument spec
  oneOptionRequiredArgNoDescription(joptsimple.DefaultSettingsOptionParserHelpTest): no non-options argument spec
  oneOptionOptionalArgWithDescriptionAndType(joptsimple.DefaultSettingsOptionParserHelpTest): no non-options argument spec
  oneOptionRequiredArgWithDescriptionAndType(joptsimple.DefaultSettingsOptionParserHelpTest): no non-options argument spec
  dateConverterShowsDatePatternInCombinationWithDescription(joptsimple.DefaultSettingsOptionParserHelpTest): no non-options argument spec
  oneOptionNoArgNoDescription(joptsimple.DefaultSettingsOptionParserHelpTest): no non-options argument spec
  dateConverterShowsDatePattern(joptsimple.DefaultSettingsOptionParserHelpTest): no non-options argument spec
  twoOptionsNoArgWithDescription(joptsimple.DefaultSettingsOptionParserHelpTest): no non-options argument spec
  optionSynonymsSortedByShortOptionThenLexicographical(joptsimple.DefaultSettingsOptionParserHelpTest): no non-options argument spec
  gradleHelp(joptsimple.DefaultSettingsOptionParserHelpTest): no non-options argument spec
  alternativeLongOptions(joptsimple.DefaultSettingsOptionParserHelpTest): no non-options argument spec
  optionSynonymsWithoutArguments(joptsimple.DefaultSettingsOptionParserHelpTest): no non-options argument spec
  bothColumnsExceedingAllocatedWidths(joptsimple.DefaultSettingsOptionParserHelpTest): no non-options argument spec
  leavesEmbeddedNewlinesInDescriptionsAlone(joptsimple.DefaultSettingsOptionParserHelpTest): no non-options argument spec
  optionSynonymsWithRequiredArgument(joptsimple.DefaultSettingsOptionParserHelpTest): no non-options argument spec
  fixForIssue56(joptsimple.DefaultSettingsOptionParserHelpTest): no non-options argument spec
  oneOptionOptionalArgWithDescription(joptsimple.DefaultSettingsOptionParserHelpTest): no non-options argument spec
  includesDefaultValueForOptionalOptionArgument(joptsimple.DefaultSettingsOptionParserHelpTest): no non-options argument spec
  inetAddressConverterShowsType(joptsimple.DefaultSettingsOptionParserHelpTest): no non-options argument spec
  oneOptionRequiredArgWithDescription(joptsimple.DefaultSettingsOptionParserHelpTest): no non-options argument spec
  includesListOfDefaultsForArgumentWithDescription(joptsimple.DefaultSettingsOptionParserHelpTest): no non-options argument spec
  oneOptionNoArgWithDescription(joptsimple.DefaultSettingsOptionParserHelpTest): no non-options argument spec
  illegalLongOption(joptsimple.WExtensionWithArgumentTest): 
  noMoreArguments(joptsimple.WExtensionWithArgumentTest): 
  argumentMissing(joptsimple.LongOptionRequiredArgumentTest): 
  optionWithOptionalArgumentThatLooksLikeAnInvalidOption(joptsimple.ShortOptionsOptionalArgumentTest): 
  tooManyHyphens(joptsimple.OptionParserOptionExceptionTest): 
  unrecognizedOption(joptsimple.OptionParserOptionExceptionTest): 
  requiredOptionWithArgMissing(joptsimple.OptionParserTest): 
  longOptionLeadsWithSingleDashAmbiguousButAShortIsIllegal(joptsimple.OptionParserTest): 
  longOptionLeadsWithSingleDashAmbiguous(joptsimple.OptionParserTest): 
  getsFedOptionDescriptorsForRecognizedOptions(joptsimple.OptionParserAlternateHelpFormatterTest): expected:<2> but was:<1>
  addingManyWithNoCommonPrefix(joptsimple.internal.AbbreviationMapTest)
  addingThreeWithSuccessivelySmallerPrefixes(joptsimple.internal.AbbreviationMapTest)
  addKeysWithCommonPrefixThenRemoveNonExistentKeyWithCommonPrefix(joptsimple.internal.AbbreviationMapTest)
  removingNonExistentKeyHasNoEffect(joptsimple.internal.AbbreviationMapTest)
  addKeysWithCommonPrefixesStairstepStyleJumbled(joptsimple.internal.AbbreviationMapTest)
  multipleKeysWithCommonPrefix(joptsimple.internal.AbbreviationMapTest)
  addingTwoWithCommonPrefix(joptsimple.internal.AbbreviationMapTest)
  addingThreeWithMixOfPrefixSize(joptsimple.internal.AbbreviationMapTest)
  addKeysWithCommonPrefixesStairstepStyle(joptsimple.internal.AbbreviationMapTest)
  removeKeyWithCommonPrefix(joptsimple.internal.AbbreviationMapTest)
  addingOne(joptsimple.internal.AbbreviationMapTest)
  cannotRemoveByUniqueAbbreviation(joptsimple.internal.AbbreviationMapTest)
  addingThreeWithSuccessivelyLargerPrefixes(joptsimple.internal.AbbreviationMapTest)
  addingOneThenReplacing(joptsimple.internal.AbbreviationMapTest)
  addingManyWithNoCommonPrefix(joptsimple.internal.AbbreviationMapToJavaUtilMapTest): expected:<{[box=1, cat=2, ]dog=3}> but was:<{[]dog=3}>
  addingThreeWithSuccessivelySmallerPrefixes(joptsimple.internal.AbbreviationMapToJavaUtilMapTest): expected:<{b=1[, bo=2, boy=3]}> but was:<{b=1[]}>
  addKeysWithCommonPrefixesStairstepStyleJumbled(joptsimple.internal.AbbreviationMapToJavaUtilMapTest): expected:<{a[=1, abc=2, abcde=3]}> but was:<{a[bc=2]}>
  multipleKeysWithCommonPrefix(joptsimple.internal.AbbreviationMapToJavaUtilMapTest): expected:<{go[=2, good=4, goodye=6, goodyear=8]}> but was:<{go[odye=6]}>
  addingTwoWithCommonPrefix(joptsimple.internal.AbbreviationMapToJavaUtilMapTest): expected:<{bo[x=3, bo]y=4}> but was:<{bo[]y=4}>
  addingThreeWithMixOfPrefixSize(joptsimple.internal.AbbreviationMapToJavaUtilMapTest): expected:<{b[=1, bo=2, boy=3]}> but was:<{b[o=2]}>
  addKeysWithCommonPrefixesStairstepStyle(joptsimple.internal.AbbreviationMapToJavaUtilMapTest): expected:<{a[=1, abc=2, a]bcde=3}> but was:<{a[]bcde=3}>
  addingThreeWithSuccessivelyLargerPrefixes(joptsimple.internal.AbbreviationMapToJavaUtilMapTest): expected:<{b[=1, bo=2, b]oy=3}> but was:<{b[]oy=3}>
  turnOffWExtension(joptsimple.WExtensionNoArgumentTest): 
  marksRequiredOptionsSpecially(joptsimple.ConfigurableOptionParserHelpTest): no non-options argument spec
  optionSynonymsWithOptionalArgument(joptsimple.ConfigurableOptionParserHelpTest): no non-options argument spec
  oneOptionRequiredArgNoDescriptionWithType(joptsimple.ConfigurableOptionParserHelpTest): no non-options argument spec
  includesDefaultValueForRequiredOptionArgument(joptsimple.ConfigurableOptionParserHelpTest): no non-options argument spec
  oneOptionOptionalArgNoDescription(joptsimple.ConfigurableOptionParserHelpTest): no non-options argument spec
  includesDefaultValueForArgumentWithDescription(joptsimple.ConfigurableOptionParserHelpTest): no non-options argument spec
  oneOptionOptionalArgNoDescriptionWithType(joptsimple.ConfigurableOptionParserHelpTest): no non-options argument spec
  oneOptionRequiredArgNoDescription(joptsimple.ConfigurableOptionParserHelpTest): no non-options argument spec
  oneOptionOptionalArgWithDescriptionAndType(joptsimple.ConfigurableOptionParserHelpTest): no non-options argument spec
  oneOptionRequiredArgWithDescriptionAndType(joptsimple.ConfigurableOptionParserHelpTest): no non-options argument spec
  dateConverterShowsDatePatternInCombinationWithDescription(joptsimple.ConfigurableOptionParserHelpTest): no non-options argument spec
  oneOptionNoArgNoDescription(joptsimple.ConfigurableOptionParserHelpTest): no non-options argument spec
  dateConverterShowsDatePattern(joptsimple.ConfigurableOptionParserHelpTest): no non-options argument spec
  twoOptionsNoArgWithDescription(joptsimple.ConfigurableOptionParserHelpTest): no non-options argument spec
  optionSynonymsSortedByShortOptionThenLexicographical(joptsimple.ConfigurableOptionParserHelpTest): no non-options argument spec
  gradleHelp(joptsimple.ConfigurableOptionParserHelpTest): no non-options argument spec
  alternativeLongOptions(joptsimple.ConfigurableOptionParserHelpTest): no non-options argument spec
  optionSynonymsWithoutArguments(joptsimple.ConfigurableOptionParserHelpTest): no non-options argument spec
  bothColumnsExceedingAllocatedWidths(joptsimple.ConfigurableOptionParserHelpTest): no non-options argument spec
  leavesEmbeddedNewlinesInDescriptionsAlone(joptsimple.ConfigurableOptionParserHelpTest): no non-options argument spec
  optionSynonymsWithRequiredArgument(joptsimple.ConfigurableOptionParserHelpTest): no non-options argument spec
  oneOptionOptionalArgWithDescription(joptsimple.ConfigurableOptionParserHelpTest): no non-options argument spec
  includesDefaultValueForOptionalOptionArgument(joptsimple.ConfigurableOptionParserHelpTest): no non-options argument spec
  oneOptionRequiredArgWithDescription(joptsimple.ConfigurableOptionParserHelpTest): no non-options argument spec
  includesListOfDefaultsForArgumentWithDescription(joptsimple.ConfigurableOptionParserHelpTest): no non-options argument spec
  oneOptionNoArgWithDescription(joptsimple.ConfigurableOptionParserHelpTest): no non-options argument spec
  ambiguousAbbreviation(joptsimple.LongOptionNoArgumentTest): 
  argumentNotPresent(joptsimple.ShortOptionsRequiredArgumentTest): 
  clusteredOptionsWithLastOneAcceptingAnArgumentButMissing(joptsimple.ShortOptionsRequiredArgumentTest): 
  recognizeLongOptionsTrumpsLongOptionAbbreviation(joptsimple.WAsAbbreviationForLongOptionTest): 
  unrecognizedOptionDisallowed(joptsimple.OptionParserUnrecognizedOptionsAllowedTest): 

Tests in error: 
  parsingJVMSystemPropertiesArguments(joptsimple.JVMSystemPropertiesArgumentParsingTest)
  wIsLegal(joptsimple.WAsShortOptionTest)
  rejectsCommandLineMissingConditionallyRequiredOption(joptsimple.RequiredIfAnyTest): Option(s) [a] not configured on this parser
  rejectsCommandLineWithNotAllConditionallyRequiredOptionsPresent(joptsimple.RequiredIfAnyTest): Option(s) [a] not configured on this parser
  acceptsCommandLineWithConditionallyRequiredOptionsPresent(joptsimple.RequiredIfAnyTest): Option(s) [a] not configured on this parser
  acceptsOptionWithPrerequisiteAsNormalIfPrerequisiteNotInPlay(joptsimple.RequiredIfAnyTest): Option(s) [a] not configured on this parser
  rejectsCommandLineMissingOtherConditionallyRequiredOption(joptsimple.RequiredIfAnyTest): Option(s) [a] not configured on this parser
  oxfPermutationWithFollowingArg(joptsimple.ClusterWhereManyOptionsAcceptArgumentsTest)
  ofxPermutationWithFollowingArg(joptsimple.ClusterWhereManyOptionsAcceptArgumentsTest)
  ofxPermutation(joptsimple.ClusterWhereManyOptionsAcceptArgumentsTest)
  oxfPermutation(joptsimple.ClusterWhereManyOptionsAcceptArgumentsTest)
  fxoPermutationWithFollowingArg(joptsimple.ClusterWhereManyOptionsAcceptArgumentsTest)
  foxPermutationWithFollowingArg(joptsimple.ClusterWhereManyOptionsAcceptArgumentsTest)
  foxPermutation(joptsimple.ClusterWhereManyOptionsAcceptArgumentsTest)
  xofPermutationWithFollowingArg(joptsimple.ClusterWhereManyOptionsAcceptArgumentsTest)
  xfoPermutationWithFollowingArg(joptsimple.ClusterWhereManyOptionsAcceptArgumentsTest)
  fxoPermutation(joptsimple.ClusterWhereManyOptionsAcceptArgumentsTest)
  xfoPermutation(joptsimple.ClusterWhereManyOptionsAcceptArgumentsTest)
  xofPermutation(joptsimple.ClusterWhereManyOptionsAcceptArgumentsTest)
  separateArgument(joptsimple.WExtensionWithArgumentTest)
  typedTogetherArg(joptsimple.WExtensionWithArgumentTest)
  typedSeparateArg(joptsimple.WExtensionWithArgumentTest)
  abbreviationWithTogetherArgument(joptsimple.WExtensionWithArgumentTest)
  togetherArgument(joptsimple.WExtensionWithArgumentTest)
  allowsDotAsShortOption(joptsimple.PunctuationInShortOptionTest)
  allowsUnderscoreAsShortOption(joptsimple.PunctuationInShortOptionTest)
  allowsQuestionMarkAsShortOption(joptsimple.PunctuationInShortOptionTest)
  allowsDotInOptionNames(joptsimple.PunctuationInLongOptionTest)
  allowsHyphensPrettyMuchAnywhereButTheFront(joptsimple.PunctuationInLongOptionTest)
  allowsUnderscoreInOptionNames(joptsimple.PunctuationInLongOptionTest)
  allowsQuestionMarkInOptionNames(joptsimple.PunctuationInLongOptionTest)
  allowsHyphensInTheMiddleOfOptionNames(joptsimple.PunctuationInLongOptionTest)
  argumentSeparate(joptsimple.LongOptionRequiredArgumentTest)
  argumentFollowedByLegalOption(joptsimple.LongOptionRequiredArgumentTest)
  argumentTogether(joptsimple.LongOptionRequiredArgumentTest)
  shortOptionSpecifiedAsLongOptionWithArgument(joptsimple.LongOptionRequiredArgumentTest)
  whenEndOfOptionsMarkerIsInPlaceOfRequiredArgument(joptsimple.LongOptionRequiredArgumentTest)
  givesSpecsInOrderOfCommandLinePresentation(joptsimple.OptionSetDetectedOptionsTest)
  clusteredOptions(joptsimple.ShortOptionsNoArgumentTest)
  optionsTerminator(joptsimple.ShortOptionsNoArgumentTest)
  singleOptionWithOneNonOptionArgument(joptsimple.ShortOptionsNoArgumentTest)
  twoSingleOptions(joptsimple.ShortOptionsNoArgumentTest)
  singleOption(joptsimple.ShortOptionsNoArgumentTest)
  appearingMultipleTimes(joptsimple.ShortOptionsNoArgumentTest)
  optionWithOptionalArgumentFollowedByLegalOption(joptsimple.ShortOptionsOptionalArgumentTest)
  multipleOfSameOptionSomeWithArgsAndSomeWithout(joptsimple.ShortOptionsOptionalArgumentTest)
  optionWithOptionalArgumentPresent(joptsimple.ShortOptionsOptionalArgumentTest)
  optionWithOptionalArgumentNotPresent(joptsimple.ShortOptionsOptionalArgumentTest)
  optionWithOptionalArgumentThatLooksLikeAValidOption(joptsimple.ShortOptionsOptionalArgumentTest)
  parsesSeparatedValuesWhenArgumentAbuttedWithEquals(joptsimple.ParsingSeparatedTypedOptionValuesTest)
  parsesSeparatedValuesAbutting(joptsimple.ParsingSeparatedTypedOptionValuesTest)
  parsesEqualsSeparatedValuesWhenArgumentAbuttedWithEquals(joptsimple.ParsingSeparatedTypedOptionValuesTest)
  parsesSeparatedValuesAsSeparateArgument(joptsimple.ParsingSeparatedTypedOptionValuesTest)
  hasAllSynonymsWhenSecondSynonymParsed(joptsimple.OptionSynonymNoArgumentTest)
  hasAllSynonymsWhenFirstSynonymParsed(joptsimple.OptionSynonymNoArgumentTest)
  hasAllSynonymsWhenThirdSynonymParsed(joptsimple.OptionSynonymNoArgumentTest)
  valueOfWhenMultiples(joptsimple.OptionParserOptionExceptionTest)
  resolvesToLongOptionEvenWithMatchingShortOptions(joptsimple.ClusterVersusLongOptionWithOptionalArgumentTest)
  resolvesShortOptionToShortOption(joptsimple.ClusterVersusLongOptionWithOptionalArgumentTest)
  shortOptionsInDifferentOrder(joptsimple.ClusterVersusLongOptionWithOptionalArgumentTest)
  resolvesToLongOptionWithSingleDashEvenWithMatchingShortOptions(joptsimple.ClusterVersusLongOptionWithOptionalArgumentTest)
  withArgumentComingAfterCluster(joptsimple.ClusterVersusLongOptionWithOptionalArgumentTest)
  resolvesAbbreviationToLongOption(joptsimple.ClusterVersusLongOptionWithOptionalArgumentTest)
  resolvesShortOptionToShortOptionEvenWithDoubleHyphen(joptsimple.ClusterVersusLongOptionWithOptionalArgumentTest)
  resolvesToShortOptionsWithArgumentFollowingX(joptsimple.ClusterVersusLongOptionWithOptionalArgumentTest)
  longOptionWithMessedUpOrder(joptsimple.ClusterVersusLongOptionWithOptionalArgumentTest): Unexpected exception, expected<joptsimple.UnrecognizedOptionException> but was<java.lang.NullPointerException>
  commandLineMissingConditionallyRequiredOption(joptsimple.RequiredUnlessAnyTest): Option(s) [a] not configured on this parser
  acceptsCommandLineWithConditionallyRequiredOptionsPresent(joptsimple.RequiredUnlessAnyTest): Option(s) [a] not configured on this parser
  acceptsOptionWithPrerequisiteAsNormalIfPrerequisiteNotInPlay(joptsimple.RequiredUnlessAnyTest): Option(s) [a] not configured on this parser
  commandLineWithNotAllConditionallyRequiredOptionsPresent(joptsimple.RequiredUnlessAnyTest): Option(s) [a] not configured on this parser
  optionsWithOptionalNegativeNumberArgumentsAndNumberOptions(joptsimple.OptionParserNewDeclarationTest)
  shortArgumentType(joptsimple.OptionParserNewDeclarationTest)
  sqlDateArgumentType(joptsimple.OptionParserNewDeclarationTest)
  booleanArgumentType(joptsimple.OptionParserNewDeclarationTest)
  doubleArgumentType(joptsimple.OptionParserNewDeclarationTest)
  illegalOptionArgumentMethodConversion(joptsimple.OptionParserNewDeclarationTest): Unexpected exception, expected<joptsimple.OptionException> but was<java.lang.NullPointerException>
  integerArgumentType(joptsimple.OptionParserNewDeclarationTest)
  floatArgumentType(joptsimple.OptionParserNewDeclarationTest)
  sqlTimestampArgumentType(joptsimple.OptionParserNewDeclarationTest)
  optionsWithNegativeNumberArgumentsAndNonNumberOptions(joptsimple.OptionParserNewDeclarationTest)
  optionsWithOptionalNegativeNumberArguments(joptsimple.OptionParserNewDeclarationTest)
  longArgumentType(joptsimple.OptionParserNewDeclarationTest)
  illegalOptionArgumentConstructorConversion(joptsimple.OptionParserNewDeclarationTest): Unexpected exception, expected<joptsimple.OptionException> but was<java.lang.NullPointerException>
  byteArgumentType(joptsimple.OptionParserNewDeclarationTest)
  sqlTimeArgumentType(joptsimple.OptionParserNewDeclarationTest)
  parsingSixthPrefix(joptsimple.OptionSynonymCommonPrefixesTest)
  parsingFifthPrefix(joptsimple.OptionSynonymCommonPrefixesTest)
  parsingFirstPrefix(joptsimple.OptionSynonymCommonPrefixesTest)
  parsingThirdPrefix(joptsimple.OptionSynonymCommonPrefixesTest)
  parsingFourthPrefix(joptsimple.OptionSynonymCommonPrefixesTest)
  parsingSeventhPrefix(joptsimple.OptionSynonymCommonPrefixesTest)
  parsingSecondPrefix(joptsimple.OptionSynonymCommonPrefixesTest)
  rejectsCommandLineMissingConditionallyRequiredOption(joptsimple.RequiredUnlessTest): Option(s) [anonymous] not configured on this parser
  acceptsOptionWithPrerequisiteAsNormal(joptsimple.RequiredUnlessTest): Option(s) [anonymous] not configured on this parser
  rejectsOptionSpecNotAlreadyConfigured(joptsimple.RequiredUnlessTest): Option(s) [anonymous] not configured on this parser
  rejectsCommandLineWithNotAllConditionallyRequiredOptionsPresent(joptsimple.RequiredUnlessTest): Option(s) [anonymous] not configured on this parser
  presenceOfHelpOptionNegatesRequiredUnlessness(joptsimple.RequiredUnlessTest): Option(s) [anonymous] not configured on this parser
  acceptsCommandLineWithConditionallyRequiredOptionsPresent(joptsimple.RequiredUnlessTest): Option(s) [anonymous] not configured on this parser
  acceptsOptionWithPrerequisite(joptsimple.RequiredUnlessTest): Option(s) [anonymous] not configured on this parser
  rejectsOptionNotAlreadyConfigured(joptsimple.RequiredUnlessTest): Option(s) [anonymous] not configured on this parser
  allowsWhitespaceyStringAsArgumentOfOption(joptsimple.OptionParserTest)
  typedArguments(joptsimple.OptionParserTest)
  allowsEmbeddedWhitespaceInArgumentOfOption(joptsimple.OptionParserTest)
  resetHappensAfterParsing(joptsimple.OptionParserTest)
  shortOptionSpecifiedAsLongOptionWithoutArgument(joptsimple.OptionParserTest)
  longOptionLeadsWithSingleDashAmbiguousButShortsAreLegal(joptsimple.OptionParserTest)
  allowsEmptyStringAsArgumentOfOption(joptsimple.OptionParserTest)
  disallowsMixingOfOptionsAndNonOptionsUnderPosixlyCorrect(joptsimple.OptionParserTest)
  longOptionLeadsWithSingleDashAmbiguousButAShortAcceptsAnArgument(joptsimple.OptionParserTest)
  longOptionLeadsWithSingleDash(joptsimple.OptionParserTest)
  optionsAndNonOptionsInterspersed(joptsimple.OptionParserTest)
  doubleHyphenSignalsEndsOfOptions(joptsimple.OptionParserTest)
  allowsMixingOfOptionsAndNonOptions(joptsimple.OptionParserTest)
  requiredOptionButHelpOptionPresent(joptsimple.OptionParserTest)
  nonOptionsOnly(joptsimple.PlainOldOptionParserTest)
  handlesConsecutiveDelimiters(joptsimple.ParsingSeparatedStringOptionValuesTest)
  parsesSeparatedValuesWhenArgumentAbuttedWithEquals(joptsimple.ParsingSeparatedStringOptionValuesTest)
  parsesHyphenSeparatedValuesAbutting(joptsimple.ParsingSeparatedStringOptionValuesTest)
  parsesSeparatedValuesAbutting(joptsimple.ParsingSeparatedStringOptionValuesTest)
  parsesEqualsSeparatedValuesWhenArgumentAbuttedWithEquals(joptsimple.ParsingSeparatedStringOptionValuesTest)
  parsesSeparatedValuesAsSeparateArgument(joptsimple.ParsingSeparatedStringOptionValuesTest)
  optionalAbuttedArgumentVersusPosixlyCorrect(joptsimple.InterleavedArgumentsTest)
  leadingNonOptionCausesPosixlyCorrectToIgnoreRemainder(joptsimple.InterleavedArgumentsTest)
  optionalArgumentAndPosixlyCorrect(joptsimple.InterleavedArgumentsTest)
  requiredArgumentAndPosixlyCorrect(joptsimple.InterleavedArgumentsTest)
  requiredArgument(joptsimple.InterleavedArgumentsTest)
  optionalKeyValuePairArgumentVersusPosixlyCorrect(joptsimple.InterleavedArgumentsTest)
  onlyAppearingToHaveOptionArgumentsButPosixlyCorrect(joptsimple.InterleavedArgumentsTest)
  optionalArgument(joptsimple.InterleavedArgumentsTest)
  onlyAppearingToHaveOptionArguments(joptsimple.InterleavedArgumentsTest)
  resolvesToLongOptionEvenWithMatchingShortOptions(joptsimple.ClusterVersusLongOptionTest)
  resolvesShortOptionToShortOption(joptsimple.ClusterVersusLongOptionTest)
  resolvesToLongOptionWithSingleDashEvenWithMatchingShortOptions(joptsimple.ClusterVersusLongOptionTest)
  resolvesAbbreviationToLongOption(joptsimple.ClusterVersusLongOptionTest)
  resolvesShortOptionToShortOptionEvenWithDoubleHyphen(joptsimple.ClusterVersusLongOptionTest)
  hasAllSynonymsWhenSecondSynonymParsed(joptsimple.OptionSynonymOptionalArgumentTest)
  hasAllSynonymsWhenFirstSynonymParsed(joptsimple.OptionSynonymOptionalArgumentTest)
  hasAllSynonymsWhenThirdSynonymParsed(joptsimple.OptionSynonymOptionalArgumentTest)
  reportsSameListOfArgumentsForEverySynonymOption(joptsimple.OptionSynonymOptionalArgumentTest)
  hasAllSynonymsWhenSecondSynonymParsed(joptsimple.OptionSynonymRequiredArgumentTest)
  hasAllSynonymsWhenFirstSynonymParsed(joptsimple.OptionSynonymRequiredArgumentTest)
  hasAllSynonymsWhenThirdSynonymParsed(joptsimple.OptionSynonymRequiredArgumentTest)
  reportsSameListOfArgumentsForEverySynonymOption(joptsimple.OptionSynonymRequiredArgumentTest)
  gives(joptsimple.OptionSetAsMapTest)
  argumentSeparate(joptsimple.LongOptionOptionalArgumentTest)
  argumentTogether(joptsimple.LongOptionOptionalArgumentTest)
  argumentMissingTrailedByAnotherOption(joptsimple.LongOptionOptionalArgumentTest)
  resolvesToLongOptionEvenWithMatchingShortOptions(joptsimple.ClusterVersusLongOptionWithRequiredArgumentTest)
  resolvesShortOptionToShortOption(joptsimple.ClusterVersusLongOptionWithRequiredArgumentTest)
  shortOptionsInDifferentOrder(joptsimple.ClusterVersusLongOptionWithRequiredArgumentTest)
  resolvesToLongOptionWithSingleDashEvenWithMatchingShortOptions(joptsimple.ClusterVersusLongOptionWithRequiredArgumentTest)
  withArgumentComingAfterCluster(joptsimple.ClusterVersusLongOptionWithRequiredArgumentTest)
  resolvesAbbreviationToLongOption(joptsimple.ClusterVersusLongOptionWithRequiredArgumentTest)
  resolvesShortOptionToShortOptionEvenWithDoubleHyphen(joptsimple.ClusterVersusLongOptionWithRequiredArgumentTest)
  resolvesToShortOptionsWithArgumentFollowingX(joptsimple.ClusterVersusLongOptionWithRequiredArgumentTest)
  longOptionWithMessedUpOrder(joptsimple.ClusterVersusLongOptionWithRequiredArgumentTest): Unexpected exception, expected<joptsimple.UnrecognizedOptionException> but was<java.lang.NullPointerException>
  asArgumentOfOption(joptsimple.SingleHyphenTest)
  asArgumentOfOptionInSameToken(joptsimple.SingleHyphenTest)
  singleHyphen(joptsimple.SingleHyphenTest)
  wExtensionWithLongOptionWithoutAnArgument(joptsimple.WExtensionNoArgumentTest)
  allowsDescriptionOfNonOptionArguments(joptsimple.NonOptionArgumentSpecTest)
  allowsArgumentDescriptionForNonOptionArguments(joptsimple.NonOptionArgumentSpecTest)
  convertingUsingConverter(joptsimple.NonOptionArgumentSpecTest)
  allowsTypeAndDescriptionOfNonOptionArguments(joptsimple.NonOptionArgumentSpecTest)
  allowsTypingOfNonOptionArguments(joptsimple.NonOptionArgumentSpecTest)
  abbreviationIsALegalOption(joptsimple.LongOptionNoArgumentTest)
  singleLongOptionAbbreviated(joptsimple.LongOptionNoArgumentTest)
  singleLongOption(joptsimple.LongOptionNoArgumentTest)
  parsesSeparatedValuesWhenArgumentAbuttedWithEquals(joptsimple.ParsingSeparatedConvertedOptionValuesTest)
  parsesSeparatedValuesAbutting(joptsimple.ParsingSeparatedConvertedOptionValuesTest)
  parsesEqualsSeparatedValuesWhenArgumentAbuttedWithEquals(joptsimple.ParsingSeparatedConvertedOptionValuesTest)
  parsesSeparatedValuesAsSeparateArgument(joptsimple.ParsingSeparatedConvertedOptionValuesTest)
  optionalArgOptionWithDefaultGivesDefaultIfOptionNotOnCommandLine(joptsimple.HandlingDefaultValuesForOptionArgumentsTest)
  withCompileTimeArraySpecifyingDefaults(joptsimple.HandlingDefaultValuesForOptionArgumentsTest)
  optionalArgOptionWithDefaultGivesArgIfSpecifiedOnCommandLine(joptsimple.HandlingDefaultValuesForOptionArgumentsTest)
  optionalArgOptionWithDefaultGivesDefaultIfArgNotSpecifiedOnCommandLine(joptsimple.HandlingDefaultValuesForOptionArgumentsTest)
  requiredArgOptionWithDefaultGivesDefaultIfOptionNotOnCommandLine(joptsimple.HandlingDefaultValuesForOptionArgumentsTest)
  specifiedOptionArgumentsTrumpsListOfDefaults(joptsimple.HandlingDefaultValuesForOptionArgumentsTest)
  requiredArgOptionWithDefaultGivesArgIfArgSpecifiedOnCommandLine(joptsimple.HandlingDefaultValuesForOptionArgumentsTest)
  allowsListOfDefaults(joptsimple.HandlingDefaultValuesForOptionArgumentsTest)
  requiredArgOptionWithDefaultStillsFailToParseIfArgNotSpecifiedOnCommandLine(joptsimple.HandlingDefaultValuesForOptionArgumentsTest): Unexpected exception, expected<joptsimple.OptionMissingRequiredArgumentException> but was<java.lang.NullPointerException>
  clusteredOptionsWithOneAcceptingAnArgument(joptsimple.ShortOptionsRequiredArgumentTest)
  inSameToken(joptsimple.ShortOptionsRequiredArgumentTest)
  clusteredOptionsWithLastOneAcceptingAnArgument(joptsimple.ShortOptionsRequiredArgumentTest)
  argumentNotPresentFollowedByAnotherOption(joptsimple.ShortOptionsRequiredArgumentTest)
  withArgument(joptsimple.ShortOptionsRequiredArgumentTest)
  appearingMultipleTimes(joptsimple.ShortOptionsRequiredArgumentTest)
  whenEndOfOptionsMarkerIsInPlaceOfRequiredArgument(joptsimple.ShortOptionsRequiredArgumentTest)
  createsParserWithOptionSpecificationString(joptsimple.CreateWithOptionSpecificationStringTest)
  rejectsCommandLineMissingConditionallyRequiredOptionSynonym(joptsimple.RequiredIfTest): Option(s) [file-transfer] not configured on this parser
  rejectsCommandLineMissingConditionallyRequiredOption(joptsimple.RequiredIfTest): Option(s) [file-transfer] not configured on this parser
  rejectsOptionSpecNotAlreadyConfigured(joptsimple.RequiredIfTest): Option(s) [file-transfer] not configured on this parser
  rejectsCommandLineWithNotAllConditionallyRequiredOptionsPresent(joptsimple.RequiredIfTest): Option(s) [file-transfer] not configured on this parser
  acceptsCommandLineWithConditionallyRequiredOptionsPresent(joptsimple.RequiredIfTest): Option(s) [file-transfer] not configured on this parser
  acceptsOptionWithPrerequisiteAsNormalIfPrerequisiteNotInPlay(joptsimple.RequiredIfTest): Option(s) [file-transfer] not configured on this parser
  rejectsOptionNotAlreadyConfigured(joptsimple.RequiredIfTest): Option(s) [file-transfer] not configured on this parser
  presenceOfHelpOptionNegatesRequiredIfness(joptsimple.RequiredIfTest): Option(s) [file-transfer] not configured on this parser
  abbreviation(joptsimple.WAsAbbreviationForLongOptionTest)
  treatsHAsThoughItWereLastDefinedSynonymOfH(joptsimple.OptionSynonymOverwritingTest)
  unrecognizedOptionAllowed(joptsimple.OptionParserUnrecognizedOptionsAllowedTest)
  parseWithPosixlyCorrect[0](joptsimple.PosixlyCorrectOptionParserTest)
  parseWithPosixlyCorrect[1](joptsimple.PosixlyCorrectOptionParserTest)
  allowsDifferentFormsOfPairingArgumentWithOption(joptsimple.examples.ShortOptionsWithArgumentPositioningTest)
  usesConvertersOnOptionArgumentsWhenTold(joptsimple.examples.OptionArgumentConverterTest)
  aHelpOptionMeansRequiredOptionsNeedNotBePresent(joptsimple.examples.RequiredOptionsTest)
  missingHelpOptionMeansRequiredOptionsMustBePresent(joptsimple.examples.RequiredOptionsTest): Unexpected exception, expected<joptsimple.OptionException> but was<java.lang.NullPointerException>
  allowsSpecificationOfRequiredOptions(joptsimple.examples.RequiredOptionsTest): Unexpected exception, expected<joptsimple.OptionException> but was<java.lang.NullPointerException>
  allowsSpecificationOfDefaultValues(joptsimple.examples.DefaultValuesForOptionArgumentsTest)
  supportsOptionSynonyms(joptsimple.examples.OptionSynonymTest)
  allowsOptionsToAcceptArguments(joptsimple.examples.ShortOptionsWithArgumentsTest)
  handlesAlternativeLongOptions(joptsimple.examples.AlternativeLongOptionsTest)
  allowsDifferentFormsOfPairingArgumentWithOption(joptsimple.examples.LongOptionsWithArgumentPositioningTest)
  supportsPosixlyCorrectBehavior(joptsimple.examples.PosixlyCorrectTest)
  convertsArgumentsToJavaValueTypes(joptsimple.examples.OptionArgumentValueTypeTest)
  acceptsLongOptions(joptsimple.examples.UnrecognizedOptionsAllowedTest)
  acceptsLongOptions(joptsimple.examples.LongOptionsTest)
  allowsClusteringShortOptions(joptsimple.examples.ShortOptionsClusteringTest)
  allowsClusteringShortOptionsThatAcceptArguments(joptsimple.examples.ShortOptionsClusteringWithArgumentTest)
  doubleHyphenSignalsEndOfOptions(joptsimple.examples.SignallingEndOfOptionsTest)
  supportsMultipleDelimitedArguments(joptsimple.examples.MultipleDelimitedArgumentsTest)
  handlesNegativeNumberOptionalArguments(joptsimple.examples.SpecialOptionalArgumentHandlingTest)
  allowsMultipleValuesForAnOption(joptsimple.examples.ShortOptionsWithMultipleArgumentsForSingleOptionTest)
  supportsShortOptions(joptsimple.examples.ShortOptionsTest)
  supportsLongOptionsWithArgumentsAndAbbreviations(joptsimple.examples.LongOptionsWithArgumentsTest)
  allowsExportOfOptions(joptsimple.examples.ExportOptionsTest)
  allowsTypesafeRetrievalOfOptionArguments(joptsimple.examples.TypesafeOptionArgumentRetrievalTest)
  primitiveIntAllowedAsTypeSpecifier(joptsimple.TypesafeOptionArgumentRetrievalTest)
  retrievalOfTypedOptionalArgumentsInATypesafeManner(joptsimple.TypesafeOptionArgumentRetrievalTest)
  retrievalOfUntypedRequiredArgumentsInATypesafeManner(joptsimple.TypesafeOptionArgumentRetrievalTest)
  canSubvertTypeSafetyIfYouUseAnOptionSpecAsTheWrongType(joptsimple.TypesafeOptionArgumentRetrievalTest): Unexpected exception, expected<java.lang.ClassCastException> but was<java.lang.NullPointerException>
  wrapsValueConversionExceptionsRaisedByConverter(joptsimple.TypesafeOptionArgumentRetrievalTest)
  cannotFoolValuesOfWithAnOptionNotIssuedFromBuilder(joptsimple.TypesafeOptionArgumentRetrievalTest)
  primitiveLongAllowedAsTypeSpecifier(joptsimple.TypesafeOptionArgumentRetrievalTest)
  canSubvertTypeSafetyIfYouGiveAnOptionSpecToOptionSetAsTheWrongType(joptsimple.TypesafeOptionArgumentRetrievalTest): Unexpected exception, expected<java.lang.ClassCastException> but was<java.lang.NullPointerException>
  retrievalOfTypedRequiredArgumentsInATypesafeManner(joptsimple.TypesafeOptionArgumentRetrievalTest)
  primitiveShortAllowedAsTypeSpecifier(joptsimple.TypesafeOptionArgumentRetrievalTest)
  cannotFoolHasWithAnOptionNotIssuedFromBuilder(joptsimple.TypesafeOptionArgumentRetrievalTest)
  usesConverterIfProvided(joptsimple.TypesafeOptionArgumentRetrievalTest)
  cannotFoolHasArgumentWithAnOptionNotIssuedFromBuilder(joptsimple.TypesafeOptionArgumentRetrievalTest)
  cannotFoolValueOfWithAnOptionNotIssuedFromBuilder(joptsimple.TypesafeOptionArgumentRetrievalTest)
  primitiveByteAllowedAsTypeSpecifier(joptsimple.TypesafeOptionArgumentRetrievalTest)
  retrievalWithVoidOption(joptsimple.TypesafeOptionArgumentRetrievalTest)
  retrievalOfUntypedOptionalArgumentsInATypesafeManner(joptsimple.TypesafeOptionArgumentRetrievalTest)
  primitiveFloatAllowedAsTypeSpecifier(joptsimple.TypesafeOptionArgumentRetrievalTest)
  primitiveBooleanAllowedAsTypeSpecifier(joptsimple.TypesafeOptionArgumentRetrievalTest)
  primitiveDoubleAllowedAsTypeSpecifier(joptsimple.TypesafeOptionArgumentRetrievalTest)
  canUseBooleanType(joptsimple.TypesafeOptionArgumentRetrievalTest)

Tests run: 745, Failures: 93, Errors: 247, Skipped: 0

[INFO] ------------------------------------------------------------------------
[INFO] BUILD FAILURE
[INFO] ------------------------------------------------------------------------
[INFO] Total time: 7.944s
[INFO] Finished at: Sun Aug 02 00:20:25 BST 2015
[INFO] Final Memory: 20M/288M
[INFO] ------------------------------------------------------------------------
[ERROR] Failed to execute goal org.apache.maven.plugins:maven-surefire-plugin:2.10:test (default-test) on project jopt-simple: There are test failures.
[ERROR] 
[ERROR] Please refer to /home/perham/Study/LittleDarwin/Cases/jopt-simple-4.8/target/surefire-reports for the individual test results.
[ERROR] -> [Help 1]
[ERROR] 
[ERROR] To see the full stack trace of the errors, re-run Maven with the -e switch.
[ERROR] Re-run Maven using the -X switch to enable full debug logging.
[ERROR] 
[ERROR] For more information about the errors and possible solutions, please read the following articles:
[ERROR] [Help 1] http://cwiki.apache.org/confluence/display/MAVEN/MojoFailureException
