[INFO] Scanning for projects...
[INFO]                                                                         
[INFO] ------------------------------------------------------------------------
[INFO] Building JOpt Simple 4.8
[INFO] ------------------------------------------------------------------------
[WARNING] The POM for com.googlecode.jmockit:jmockit:jar:1.6 is invalid, transitive dependencies (if any) will not be available, enable debug logging for more details
[INFO] 
[INFO] --- maven-enforcer-plugin:1.0:enforce (enforce-maven) @ jopt-simple ---
[INFO] 
[INFO] --- maven-resources-plugin:2.3:resources (default-resources) @ jopt-simple ---
[INFO] Using 'UTF-8' encoding to copy filtered resources.
[INFO] Copying 1 resource
[INFO] 
[INFO] --- maven-compiler-plugin:3.1:compile (default-compile) @ jopt-simple ---
[INFO] Changes detected - recompiling the module!
[INFO] Compiling 44 source files to /home/perham/Study/LittleDarwin/Cases/jopt-simple-4.8/target/classes
[WARNING] /home/perham/Study/LittleDarwin/Cases/jopt-simple-4.8/src/main/java/joptsimple/OptionMissingRequiredArgumentException.java: /home/perham/Study/LittleDarwin/Cases/jopt-simple-4.8/src/main/java/joptsimple/OptionMissingRequiredArgumentException.java uses unchecked or unsafe operations.
[WARNING] /home/perham/Study/LittleDarwin/Cases/jopt-simple-4.8/src/main/java/joptsimple/OptionMissingRequiredArgumentException.java: Recompile with -Xlint:unchecked for details.
[INFO] 
[INFO] >>> maven-pmd-plugin:3.2:cpd-check (default) @ jopt-simple >>>
[INFO] 
[INFO] --- maven-pmd-plugin:3.2:cpd (cpd) @ jopt-simple ---
[WARNING] Unable to locate Source XRef to link to - DISABLED
[INFO] 
[INFO] <<< maven-pmd-plugin:3.2:cpd-check (default) @ jopt-simple <<<
[INFO] 
[INFO] --- maven-pmd-plugin:3.2:cpd-check (default) @ jopt-simple ---
[INFO] 
[INFO] 
[INFO] --- animal-sniffer-maven-plugin:1.11:check (check-signature) @ jopt-simple ---
[INFO] Checking unresolved references to org.codehaus.mojo.signature:java15:1.0
[INFO] 
[INFO] --- maven-resources-plugin:2.3:testResources (default-testResources) @ jopt-simple ---
[INFO] Using 'UTF-8' encoding to copy filtered resources.
[INFO] skip non existing resourceDirectory /home/perham/Study/LittleDarwin/Cases/jopt-simple-4.8/src/test/resources
[INFO] 
[INFO] --- maven-compiler-plugin:3.1:testCompile (default-testCompile) @ jopt-simple ---
[INFO] Nothing to compile - all classes are up to date
[INFO] 
[INFO] --- maven-surefire-plugin:2.10:test (default-test) @ jopt-simple ---
[INFO] Surefire report directory: /home/perham/Study/LittleDarwin/Cases/jopt-simple-4.8/target/surefire-reports

-------------------------------------------------------
 T E S T S
-------------------------------------------------------
Running joptsimple.OptionSpecBuilderOptionsImmutabilityTest
Tests run: 12, Failures: 0, Errors: 0, Skipped: 0, Time elapsed: 0.467 sec
Running joptsimple.JVMSystemPropertiesArgumentParsingTest
Tests run: 1, Failures: 0, Errors: 1, Skipped: 0, Time elapsed: 0.02 sec <<< FAILURE!
Running joptsimple.WAsShortOptionTest
Tests run: 2, Failures: 0, Errors: 1, Skipped: 0, Time elapsed: 0.016 sec <<< FAILURE!
Running joptsimple.OptionSetValuesOfOptionStringImmutabilityTest
Tests run: 12, Failures: 0, Errors: 12, Skipped: 0, Time elapsed: 0.027 sec <<< FAILURE!
Running joptsimple.ArgumentListHasNoMoreArgsTest
Tests run: 3, Failures: 0, Errors: 0, Skipped: 0, Time elapsed: 0.003 sec
Running joptsimple.util.KeyValuePairUnequalValuesTest
Tests run: 8, Failures: 0, Errors: 0, Skipped: 0, Time elapsed: 0.01 sec
Running joptsimple.util.DateConverterTest
Tests run: 11, Failures: 0, Errors: 0, Skipped: 0, Time elapsed: 0.133 sec
Running joptsimple.util.KeyValuePairUnequalKeysTest
Tests run: 8, Failures: 0, Errors: 0, Skipped: 0, Time elapsed: 0.01 sec
Running joptsimple.util.InetAddressConverterTest
Tests run: 2, Failures: 0, Errors: 0, Skipped: 0, Time elapsed: 0.023 sec
Running joptsimple.util.KeyValuePairTest
Tests run: 7, Failures: 0, Errors: 0, Skipped: 0, Time elapsed: 0.014 sec
Running joptsimple.util.RegexMatcherTest
Tests run: 6, Failures: 0, Errors: 0, Skipped: 0, Time elapsed: 0.013 sec
Running joptsimple.OptionSetSpecsImmutabilityTest
Tests run: 12, Failures: 0, Errors: 0, Skipped: 0, Time elapsed: 0.021 sec
Running joptsimple.ArgumentAcceptingOptionSpecTest
Tests run: 16, Failures: 0, Errors: 0, Skipped: 0, Time elapsed: 0.023 sec
Running joptsimple.AlternativeLongOptionSpecValuesImmutabilityTest
Tests run: 12, Failures: 0, Errors: 12, Skipped: 0, Time elapsed: 0.017 sec <<< FAILURE!
Running joptsimple.RequiredIfAnyTest
Tests run: 5, Failures: 3, Errors: 0, Skipped: 0, Time elapsed: 0.014 sec <<< FAILURE!
Running joptsimple.ClusterWhereManyOptionsAcceptArgumentsTest
Tests run: 12, Failures: 0, Errors: 12, Skipped: 0, Time elapsed: 0.029 sec <<< FAILURE!
Running joptsimple.OptionSpecsReportTheirOptionsSortedSpeciallyTest
Tests run: 1, Failures: 0, Errors: 0, Skipped: 0, Time elapsed: 0.001 sec
Running joptsimple.DefaultSettingsOptionParserHelpTest
Tests run: 39, Failures: 0, Errors: 0, Skipped: 0, Time elapsed: 0.097 sec
Running joptsimple.WExtensionWithArgumentTest
Tests run: 7, Failures: 0, Errors: 5, Skipped: 0, Time elapsed: 0.015 sec <<< FAILURE!
Running joptsimple.PunctuationInShortOptionTest
Tests run: 4, Failures: 0, Errors: 0, Skipped: 0, Time elapsed: 0.007 sec
Running joptsimple.PunctuationInLongOptionTest
Tests run: 6, Failures: 0, Errors: 0, Skipped: 0, Time elapsed: 0.012 sec
Running joptsimple.LongOptionRequiredArgumentTest
Tests run: 6, Failures: 0, Errors: 5, Skipped: 0, Time elapsed: 0.013 sec <<< FAILURE!
Running joptsimple.ToStringTest
Tests run: 3, Failures: 0, Errors: 0, Skipped: 0, Time elapsed: 0.011 sec
Running joptsimple.OptionSetDetectedOptionsTest
Tests run: 1, Failures: 0, Errors: 1, Skipped: 0, Time elapsed: 0.003 sec <<< FAILURE!
Running joptsimple.OptionSpecBuilderValuesImmutabilityTest
Tests run: 12, Failures: 0, Errors: 12, Skipped: 0, Time elapsed: 0.018 sec <<< FAILURE!
Running joptsimple.ShortOptionsNoArgumentTest
Tests run: 6, Failures: 0, Errors: 2, Skipped: 0, Time elapsed: 0.011 sec <<< FAILURE!
Running joptsimple.OptionalArgumentOptionSpecValuesImmutabilityTest
Tests run: 12, Failures: 0, Errors: 12, Skipped: 0, Time elapsed: 0.017 sec <<< FAILURE!
Running joptsimple.AlternativeLongOptionSpecOptionsImmutabilityTest
Tests run: 12, Failures: 0, Errors: 0, Skipped: 0, Time elapsed: 0.014 sec
Running joptsimple.ShortOptionsOptionalArgumentTest
Tests run: 6, Failures: 0, Errors: 2, Skipped: 0, Time elapsed: 0.013 sec <<< FAILURE!
Running joptsimple.ValueConverterAdmitsSubclassesOfValueTypeTest
Tests run: 1, Failures: 0, Errors: 0, Skipped: 0, Time elapsed: 0.001 sec
Running joptsimple.PopulatedOptionSetTest
Tests run: 4, Failures: 0, Errors: 4, Skipped: 0, Time elapsed: 0.006 sec <<< FAILURE!
Running joptsimple.ParsingSeparatedTypedOptionValuesTest
Tests run: 4, Failures: 0, Errors: 4, Skipped: 0, Time elapsed: 0.009 sec <<< FAILURE!
Running joptsimple.OptionSynonymNoArgumentTest
Tests run: 3, Failures: 0, Errors: 0, Skipped: 0, Time elapsed: 0.006 sec
Running joptsimple.OptionParserOptionExceptionTest
Tests run: 5, Failures: 0, Errors: 1, Skipped: 0, Time elapsed: 0.009 sec <<< FAILURE!
Running joptsimple.ClusterVersusLongOptionWithOptionalArgumentTest
Tests run: 9, Failures: 0, Errors: 3, Skipped: 0, Time elapsed: 0.017 sec <<< FAILURE!
Running joptsimple.RequiredUnlessAnyTest
Tests run: 4, Failures: 0, Errors: 4, Skipped: 0, Time elapsed: 0.01 sec <<< FAILURE!
Running joptsimple.OptionParserNewDeclarationTest
Tests run: 16, Failures: 0, Errors: 14, Skipped: 0, Time elapsed: 0.037 sec <<< FAILURE!
Running joptsimple.RequiredArgumentOptionSpecEqualsHashCodeTest
Tests run: 10, Failures: 0, Errors: 0, Skipped: 0, Time elapsed: 0.01 sec
Running joptsimple.OptionSynonymCommonPrefixesTest
Tests run: 7, Failures: 0, Errors: 0, Skipped: 0, Time elapsed: 0.012 sec
Running joptsimple.OptionalArgumentOptionSpecOptionsImmutabilityTest
Tests run: 12, Failures: 0, Errors: 0, Skipped: 0, Time elapsed: 0.016 sec
Running joptsimple.RequiredUnlessTest
Tests run: 8, Failures: 2, Errors: 4, Skipped: 0, Time elapsed: 0.023 sec <<< FAILURE!
Running joptsimple.ArgumentListTest
Tests run: 2, Failures: 0, Errors: 0, Skipped: 0, Time elapsed: 0.001 sec
Running joptsimple.NoArgumentOptionSpecTest
Tests run: 11, Failures: 0, Errors: 0, Skipped: 0, Time elapsed: 0.015 sec
Running joptsimple.RequiredArgumentOptionSpecValuesImmutabilityTest
Tests run: 12, Failures: 0, Errors: 12, Skipped: 0, Time elapsed: 0.014 sec <<< FAILURE!
Running joptsimple.OptionParserTest
Tests run: 17, Failures: 0, Errors: 11, Skipped: 0, Time elapsed: 0.032 sec <<< FAILURE!
Running joptsimple.PlainOldOptionParserTest
Tests run: 1, Failures: 0, Errors: 1, Skipped: 0, Time elapsed: 0.002 sec <<< FAILURE!
Running joptsimple.OptionExceptionOptionsImmutabilityTest
Tests run: 12, Failures: 0, Errors: 0, Skipped: 0, Time elapsed: 0.014 sec
Running joptsimple.ParsingSeparatedStringOptionValuesTest
Tests run: 6, Failures: 0, Errors: 6, Skipped: 0, Time elapsed: 0.012 sec <<< FAILURE!
Running joptsimple.OptionParserAlternateHelpFormatterTest
Tests run: 2, Failures: 0, Errors: 0, Skipped: 0, Time elapsed: 0.005 sec
Running joptsimple.InterleavedArgumentsTest
Tests run: 9, Failures: 0, Errors: 9, Skipped: 0, Time elapsed: 0.016 sec <<< FAILURE!
Running joptsimple.ClusterVersusLongOptionTest
Tests run: 5, Failures: 0, Errors: 0, Skipped: 0, Time elapsed: 0.008 sec
Running joptsimple.OptionSynonymOptionalArgumentTest
Tests run: 4, Failures: 0, Errors: 4, Skipped: 0, Time elapsed: 0.01 sec <<< FAILURE!
Running joptsimple.OptionSynonymRequiredArgumentTest
Tests run: 4, Failures: 0, Errors: 4, Skipped: 0, Time elapsed: 0.008 sec <<< FAILURE!
Running joptsimple.internal.ObjectsUtilityClassTest
Tests run: 1, Failures: 0, Errors: 0, Skipped: 0, Time elapsed: 0.003 sec
Running joptsimple.internal.RowEqualsHashCodeTest
Tests run: 9, Failures: 0, Errors: 0, Skipped: 0, Time elapsed: 0.011 sec
Running joptsimple.internal.RowsTest
Tests run: 3, Failures: 0, Errors: 0, Skipped: 0, Time elapsed: 0.005 sec
Running joptsimple.internal.AbbreviationMapTest
Tests run: 22, Failures: 0, Errors: 0, Skipped: 0, Time elapsed: 0.027 sec
Running joptsimple.internal.AbbreviationMapToJavaUtilMapTest
Tests run: 12, Failures: 0, Errors: 0, Skipped: 0, Time elapsed: 0.012 sec
Running joptsimple.internal.ReflectionUtilityClassTest
Tests run: 1, Failures: 0, Errors: 0, Skipped: 0, Time elapsed: 0.002 sec
Running joptsimple.internal.ClassesUtilityClassTest
Tests run: 1, Failures: 0, Errors: 0, Skipped: 0, Time elapsed: 0.001 sec
Running joptsimple.internal.StringsUtilityClassTest
Tests run: 1, Failures: 0, Errors: 0, Skipped: 0, Time elapsed: 0.002 sec
Running joptsimple.internal.ReflectionTest
Tests run: 6, Failures: 0, Errors: 0, Skipped: 0, Time elapsed: 0.01 sec
Running joptsimple.OptionSetAsMapTest
Tests run: 1, Failures: 0, Errors: 1, Skipped: 0, Time elapsed: 0.003 sec <<< FAILURE!
Running joptsimple.NoArgumentOptionSpecOptionsImmutabilityTest
Tests run: 12, Failures: 0, Errors: 0, Skipped: 0, Time elapsed: 0.013 sec
Running joptsimple.LongOptionOptionalArgumentTest
Tests run: 3, Failures: 0, Errors: 2, Skipped: 0, Time elapsed: 0.006 sec <<< FAILURE!
Running joptsimple.ClusterVersusLongOptionWithRequiredArgumentTest
Tests run: 9, Failures: 0, Errors: 3, Skipped: 0, Time elapsed: 0.014 sec <<< FAILURE!
Running joptsimple.OptionalArgumentOptionSpecTest
Tests run: 11, Failures: 0, Errors: 0, Skipped: 0, Time elapsed: 0.011 sec
Running joptsimple.OptionSetValuesOfSpecImmutabilityTest
Tests run: 12, Failures: 0, Errors: 12, Skipped: 0, Time elapsed: 0.014 sec <<< FAILURE!
Running joptsimple.OptionSpecTokenizerTest
Tests run: 17, Failures: 0, Errors: 0, Skipped: 0, Time elapsed: 0.019 sec
Running joptsimple.SingleHyphenTest
Tests run: 3, Failures: 0, Errors: 3, Skipped: 0, Time elapsed: 0.006 sec <<< FAILURE!
Running joptsimple.WExtensionNoArgumentTest
Tests run: 2, Failures: 0, Errors: 0, Skipped: 0, Time elapsed: 0.005 sec
Running joptsimple.RequiredArgumentOptionSpecOptionsImmutabilityTest
Tests run: 12, Failures: 0, Errors: 0, Skipped: 0, Time elapsed: 0.01 sec
Running joptsimple.ParserRulesUtilityClassTest
Tests run: 1, Failures: 0, Errors: 0, Skipped: 0, Time elapsed: 0.002 sec
Running joptsimple.ConfigurableOptionParserHelpTest
Tests run: 27, Failures: 0, Errors: 0, Skipped: 0, Time elapsed: 0.051 sec
Running joptsimple.NonOptionArgumentSpecTest
Tests run: 7, Failures: 0, Errors: 5, Skipped: 0, Time elapsed: 0.01 sec <<< FAILURE!
Running joptsimple.OptionExceptionMessageTest
Tests run: 8, Failures: 0, Errors: 0, Skipped: 0, Time elapsed: 0.013 sec
Running joptsimple.LongOptionNoArgumentTest
Tests run: 4, Failures: 0, Errors: 0, Skipped: 0, Time elapsed: 0.008 sec
Running joptsimple.ArgumentAcceptingOptionSpecDefaultValuesImmutabilityTest
Tests run: 12, Failures: 0, Errors: 0, Skipped: 0, Time elapsed: 0.016 sec
Running joptsimple.ParsingSeparatedConvertedOptionValuesTest
Tests run: 4, Failures: 0, Errors: 4, Skipped: 0, Time elapsed: 0.009 sec <<< FAILURE!
Running joptsimple.HandlingDefaultValuesForOptionArgumentsTest
Tests run: 9, Failures: 1, Errors: 3, Skipped: 0, Time elapsed: 0.017 sec <<< FAILURE!
Running joptsimple.ShortOptionsRequiredArgumentTest
Tests run: 9, Failures: 0, Errors: 7, Skipped: 0, Time elapsed: 0.021 sec <<< FAILURE!
Running joptsimple.CreateWithOptionSpecificationStringTest
Tests run: 1, Failures: 0, Errors: 1, Skipped: 0, Time elapsed: 0.002 sec <<< FAILURE!
Running joptsimple.EmptyOptionSetTest
Tests run: 8, Failures: 0, Errors: 0, Skipped: 0, Time elapsed: 0.023 sec
Running joptsimple.OptionParserArgumentExceptionTest
Tests run: 9, Failures: 0, Errors: 0, Skipped: 0, Time elapsed: 0.015 sec
Running joptsimple.RequiredIfTest
Tests run: 8, Failures: 3, Errors: 2, Skipped: 0, Time elapsed: 0.014 sec <<< FAILURE!
Running joptsimple.NoArgumentOptionSpecValuesImmutabilityTest
Tests run: 12, Failures: 0, Errors: 12, Skipped: 0, Time elapsed: 0.012 sec <<< FAILURE!
Running joptsimple.WAsAbbreviationForLongOptionTest
Tests run: 2, Failures: 0, Errors: 1, Skipped: 0, Time elapsed: 0.003 sec <<< FAILURE!
Running joptsimple.OptionSynonymOverwritingTest
Tests run: 1, Failures: 0, Errors: 0, Skipped: 0, Time elapsed: 0.002 sec
Running joptsimple.OptionParserRecognizedOptionsTest
Tests run: 2, Failures: 0, Errors: 0, Skipped: 0, Time elapsed: 0.003 sec
Running joptsimple.OptionSetNonOptionArgumentsImmutabilityTest
Tests run: 12, Failures: 0, Errors: 12, Skipped: 0, Time elapsed: 0.013 sec <<< FAILURE!
Running joptsimple.OptionParserUnrecognizedOptionsAllowedTest
Tests run: 2, Failures: 0, Errors: 1, Skipped: 0, Time elapsed: 0.003 sec <<< FAILURE!
Running joptsimple.PosixlyCorrectOptionParserTest
Tests run: 2, Failures: 0, Errors: 2, Skipped: 0, Time elapsed: 0.005 sec <<< FAILURE!
Running joptsimple.examples.ShortOptionsWithArgumentPositioningTest
Tests run: 1, Failures: 0, Errors: 1, Skipped: 0, Time elapsed: 0.001 sec <<< FAILURE!
Running joptsimple.examples.OptionArgumentConverterTest
Tests run: 1, Failures: 0, Errors: 1, Skipped: 0, Time elapsed: 0.002 sec <<< FAILURE!
Running joptsimple.examples.RequiredOptionsTest
Tests run: 3, Failures: 0, Errors: 3, Skipped: 0, Time elapsed: 0.006 sec <<< FAILURE!
Running joptsimple.examples.DefaultValuesForOptionArgumentsTest
Tests run: 1, Failures: 0, Errors: 1, Skipped: 0, Time elapsed: 0.016 sec <<< FAILURE!
Running joptsimple.examples.OptionSynonymTest
Tests run: 1, Failures: 0, Errors: 1, Skipped: 0, Time elapsed: 0.002 sec <<< FAILURE!
Running joptsimple.examples.ShortOptionsWithArgumentsTest
Tests run: 1, Failures: 0, Errors: 1, Skipped: 0, Time elapsed: 0.002 sec <<< FAILURE!
Running joptsimple.examples.AlternativeLongOptionsTest
Tests run: 1, Failures: 0, Errors: 1, Skipped: 0, Time elapsed: 0.001 sec <<< FAILURE!
Running joptsimple.examples.LongOptionsWithArgumentPositioningTest
Tests run: 1, Failures: 0, Errors: 1, Skipped: 0, Time elapsed: 0.002 sec <<< FAILURE!
Running joptsimple.examples.PosixlyCorrectTest
Tests run: 1, Failures: 0, Errors: 1, Skipped: 0, Time elapsed: 0.002 sec <<< FAILURE!
Running joptsimple.examples.OptionArgumentValueTypeTest
Tests run: 1, Failures: 0, Errors: 1, Skipped: 0, Time elapsed: 0.002 sec <<< FAILURE!
Running joptsimple.examples.UnrecognizedOptionsAllowedTest
Tests run: 1, Failures: 0, Errors: 1, Skipped: 0, Time elapsed: 0.001 sec <<< FAILURE!
Running joptsimple.examples.LongOptionsTest
Tests run: 1, Failures: 0, Errors: 0, Skipped: 0, Time elapsed: 0.001 sec
Running joptsimple.examples.ShortOptionsClusteringTest
Tests run: 1, Failures: 0, Errors: 0, Skipped: 0, Time elapsed: 0.001 sec
Running joptsimple.examples.ShortOptionsClusteringWithArgumentTest
Tests run: 1, Failures: 0, Errors: 1, Skipped: 0, Time elapsed: 0.002 sec <<< FAILURE!
Running joptsimple.examples.SignallingEndOfOptionsTest
Tests run: 1, Failures: 0, Errors: 1, Skipped: 0, Time elapsed: 0.002 sec <<< FAILURE!
Running joptsimple.examples.MultipleDelimitedArgumentsTest
Tests run: 1, Failures: 0, Errors: 1, Skipped: 0, Time elapsed: 0.002 sec <<< FAILURE!
Running joptsimple.examples.SpecialOptionalArgumentHandlingTest
Tests run: 1, Failures: 0, Errors: 1, Skipped: 0, Time elapsed: 0.002 sec <<< FAILURE!
Running joptsimple.examples.ShortOptionsWithMultipleArgumentsForSingleOptionTest
Tests run: 1, Failures: 0, Errors: 1, Skipped: 0, Time elapsed: 0.002 sec <<< FAILURE!
Running joptsimple.examples.ShortOptionsTest
Tests run: 1, Failures: 0, Errors: 0, Skipped: 0, Time elapsed: 0.001 sec
Running joptsimple.examples.LongOptionsWithArgumentsTest
Tests run: 1, Failures: 0, Errors: 1, Skipped: 0, Time elapsed: 0.002 sec <<< FAILURE!
Running joptsimple.examples.ExportOptionsTest
Tests run: 1, Failures: 0, Errors: 1, Skipped: 0, Time elapsed: 0.002 sec <<< FAILURE!
Running joptsimple.examples.TypesafeOptionArgumentRetrievalTest
Tests run: 1, Failures: 0, Errors: 1, Skipped: 0, Time elapsed: 0.002 sec <<< FAILURE!
Running joptsimple.TypesafeOptionArgumentRetrievalTest
Tests run: 22, Failures: 1, Errors: 19, Skipped: 0, Time elapsed: 0.034 sec <<< FAILURE!
Running joptsimple.OptionSetEqualsHashCodeTest
Tests run: 9, Failures: 0, Errors: 9, Skipped: 0, Time elapsed: 0.009 sec <<< FAILURE!

Results :

Failed tests:   rejectsCommandLineMissingConditionallyRequiredOption(joptsimple.RequiredIfAnyTest): Expected test to throw an instance of joptsimple.MissingRequiredOptionsException
  rejectsCommandLineWithNotAllConditionallyRequiredOptionsPresent(joptsimple.RequiredIfAnyTest): Expected test to throw an instance of joptsimple.MissingRequiredOptionsException
  rejectsCommandLineMissingOtherConditionallyRequiredOption(joptsimple.RequiredIfAnyTest): Expected test to throw an instance of joptsimple.MissingRequiredOptionsException
  rejectsCommandLineMissingConditionallyRequiredOption(joptsimple.RequiredUnlessTest): 
  rejectsCommandLineWithNotAllConditionallyRequiredOptionsPresent(joptsimple.RequiredUnlessTest): 
  optionalArgOptionWithDefaultGivesDefaultIfArgNotSpecifiedOnCommandLine(joptsimple.HandlingDefaultValuesForOptionArgumentsTest)
  rejectsCommandLineMissingConditionallyRequiredOptionSynonym(joptsimple.RequiredIfTest): Expected test to throw an instance of joptsimple.MissingRequiredOptionsException
  rejectsCommandLineMissingConditionallyRequiredOption(joptsimple.RequiredIfTest): Expected test to throw an instance of joptsimple.MissingRequiredOptionsException
  rejectsCommandLineWithNotAllConditionallyRequiredOptionsPresent(joptsimple.RequiredIfTest): 
  retrievalWithVoidOption(joptsimple.TypesafeOptionArgumentRetrievalTest)

Tests in error: 
  parsingJVMSystemPropertiesArguments(joptsimple.JVMSystemPropertiesArgumentParsingTest)
  wIsLegal(joptsimple.WAsShortOptionTest)
  shouldPreventSetViaListIterator(joptsimple.OptionSetValuesOfOptionStringImmutabilityTest)
  shouldPreventAddAtIndex(joptsimple.OptionSetValuesOfOptionStringImmutabilityTest)
  shouldPreventSetAtIndex(joptsimple.OptionSetValuesOfOptionStringImmutabilityTest)
  shouldPreventRemoveAtIndex(joptsimple.OptionSetValuesOfOptionStringImmutabilityTest)
  shouldPreventRemoveViaListIterator(joptsimple.OptionSetValuesOfOptionStringImmutabilityTest)
  shouldPreventAdd(joptsimple.OptionSetValuesOfOptionStringImmutabilityTest)
  shouldPreventRetainAll(joptsimple.OptionSetValuesOfOptionStringImmutabilityTest)
  shouldPreventRemoveViaIterator(joptsimple.OptionSetValuesOfOptionStringImmutabilityTest)
  shouldPreventAddAll(joptsimple.OptionSetValuesOfOptionStringImmutabilityTest)
  shouldPreventClear(joptsimple.OptionSetValuesOfOptionStringImmutabilityTest)
  shouldPreventRemove(joptsimple.OptionSetValuesOfOptionStringImmutabilityTest)
  shouldPreventRemoveAll(joptsimple.OptionSetValuesOfOptionStringImmutabilityTest)
  shouldPreventSetViaListIterator(joptsimple.AlternativeLongOptionSpecValuesImmutabilityTest)
  shouldPreventAddAtIndex(joptsimple.AlternativeLongOptionSpecValuesImmutabilityTest)
  shouldPreventSetAtIndex(joptsimple.AlternativeLongOptionSpecValuesImmutabilityTest)
  shouldPreventRemoveAtIndex(joptsimple.AlternativeLongOptionSpecValuesImmutabilityTest)
  shouldPreventRemoveViaListIterator(joptsimple.AlternativeLongOptionSpecValuesImmutabilityTest)
  shouldPreventAdd(joptsimple.AlternativeLongOptionSpecValuesImmutabilityTest)
  shouldPreventRetainAll(joptsimple.AlternativeLongOptionSpecValuesImmutabilityTest)
  shouldPreventRemoveViaIterator(joptsimple.AlternativeLongOptionSpecValuesImmutabilityTest)
  shouldPreventAddAll(joptsimple.AlternativeLongOptionSpecValuesImmutabilityTest)
  shouldPreventClear(joptsimple.AlternativeLongOptionSpecValuesImmutabilityTest)
  shouldPreventRemove(joptsimple.AlternativeLongOptionSpecValuesImmutabilityTest)
  shouldPreventRemoveAll(joptsimple.AlternativeLongOptionSpecValuesImmutabilityTest)
  oxfPermutationWithFollowingArg(joptsimple.ClusterWhereManyOptionsAcceptArgumentsTest)
  ofxPermutationWithFollowingArg(joptsimple.ClusterWhereManyOptionsAcceptArgumentsTest)
  ofxPermutation(joptsimple.ClusterWhereManyOptionsAcceptArgumentsTest)
  oxfPermutation(joptsimple.ClusterWhereManyOptionsAcceptArgumentsTest)
  fxoPermutationWithFollowingArg(joptsimple.ClusterWhereManyOptionsAcceptArgumentsTest)
  foxPermutationWithFollowingArg(joptsimple.ClusterWhereManyOptionsAcceptArgumentsTest)
  foxPermutation(joptsimple.ClusterWhereManyOptionsAcceptArgumentsTest)
  xofPermutationWithFollowingArg(joptsimple.ClusterWhereManyOptionsAcceptArgumentsTest)
  xfoPermutationWithFollowingArg(joptsimple.ClusterWhereManyOptionsAcceptArgumentsTest)
  fxoPermutation(joptsimple.ClusterWhereManyOptionsAcceptArgumentsTest)
  xfoPermutation(joptsimple.ClusterWhereManyOptionsAcceptArgumentsTest)
  xofPermutation(joptsimple.ClusterWhereManyOptionsAcceptArgumentsTest)
  separateArgument(joptsimple.WExtensionWithArgumentTest)
  typedTogetherArg(joptsimple.WExtensionWithArgumentTest)
  typedSeparateArg(joptsimple.WExtensionWithArgumentTest)
  abbreviationWithTogetherArgument(joptsimple.WExtensionWithArgumentTest)
  togetherArgument(joptsimple.WExtensionWithArgumentTest)
  argumentSeparate(joptsimple.LongOptionRequiredArgumentTest)
  argumentFollowedByLegalOption(joptsimple.LongOptionRequiredArgumentTest)
  argumentTogether(joptsimple.LongOptionRequiredArgumentTest)
  shortOptionSpecifiedAsLongOptionWithArgument(joptsimple.LongOptionRequiredArgumentTest)
  whenEndOfOptionsMarkerIsInPlaceOfRequiredArgument(joptsimple.LongOptionRequiredArgumentTest)
  givesSpecsInOrderOfCommandLinePresentation(joptsimple.OptionSetDetectedOptionsTest)
  shouldPreventSetViaListIterator(joptsimple.OptionSpecBuilderValuesImmutabilityTest)
  shouldPreventAddAtIndex(joptsimple.OptionSpecBuilderValuesImmutabilityTest)
  shouldPreventSetAtIndex(joptsimple.OptionSpecBuilderValuesImmutabilityTest)
  shouldPreventRemoveAtIndex(joptsimple.OptionSpecBuilderValuesImmutabilityTest)
  shouldPreventRemoveViaListIterator(joptsimple.OptionSpecBuilderValuesImmutabilityTest)
  shouldPreventAdd(joptsimple.OptionSpecBuilderValuesImmutabilityTest)
  shouldPreventRetainAll(joptsimple.OptionSpecBuilderValuesImmutabilityTest)
  shouldPreventRemoveViaIterator(joptsimple.OptionSpecBuilderValuesImmutabilityTest)
  shouldPreventAddAll(joptsimple.OptionSpecBuilderValuesImmutabilityTest)
  shouldPreventClear(joptsimple.OptionSpecBuilderValuesImmutabilityTest)
  shouldPreventRemove(joptsimple.OptionSpecBuilderValuesImmutabilityTest)
  shouldPreventRemoveAll(joptsimple.OptionSpecBuilderValuesImmutabilityTest)
  optionsTerminator(joptsimple.ShortOptionsNoArgumentTest)
  singleOptionWithOneNonOptionArgument(joptsimple.ShortOptionsNoArgumentTest)
  shouldPreventSetViaListIterator(joptsimple.OptionalArgumentOptionSpecValuesImmutabilityTest)
  shouldPreventAddAtIndex(joptsimple.OptionalArgumentOptionSpecValuesImmutabilityTest)
  shouldPreventSetAtIndex(joptsimple.OptionalArgumentOptionSpecValuesImmutabilityTest)
  shouldPreventRemoveAtIndex(joptsimple.OptionalArgumentOptionSpecValuesImmutabilityTest)
  shouldPreventRemoveViaListIterator(joptsimple.OptionalArgumentOptionSpecValuesImmutabilityTest)
  shouldPreventAdd(joptsimple.OptionalArgumentOptionSpecValuesImmutabilityTest)
  shouldPreventRetainAll(joptsimple.OptionalArgumentOptionSpecValuesImmutabilityTest)
  shouldPreventRemoveViaIterator(joptsimple.OptionalArgumentOptionSpecValuesImmutabilityTest)
  shouldPreventAddAll(joptsimple.OptionalArgumentOptionSpecValuesImmutabilityTest)
  shouldPreventClear(joptsimple.OptionalArgumentOptionSpecValuesImmutabilityTest)
  shouldPreventRemove(joptsimple.OptionalArgumentOptionSpecValuesImmutabilityTest)
  shouldPreventRemoveAll(joptsimple.OptionalArgumentOptionSpecValuesImmutabilityTest)
  multipleOfSameOptionSomeWithArgsAndSomeWithout(joptsimple.ShortOptionsOptionalArgumentTest)
  optionWithOptionalArgumentPresent(joptsimple.ShortOptionsOptionalArgumentTest)
  valuesOf(joptsimple.PopulatedOptionSetTest)
  valueOf(joptsimple.PopulatedOptionSetTest)
  hasOptions(joptsimple.PopulatedOptionSetTest)
  hasArgument(joptsimple.PopulatedOptionSetTest)
  parsesSeparatedValuesWhenArgumentAbuttedWithEquals(joptsimple.ParsingSeparatedTypedOptionValuesTest)
  parsesSeparatedValuesAbutting(joptsimple.ParsingSeparatedTypedOptionValuesTest)
  parsesEqualsSeparatedValuesWhenArgumentAbuttedWithEquals(joptsimple.ParsingSeparatedTypedOptionValuesTest)
  parsesSeparatedValuesAsSeparateArgument(joptsimple.ParsingSeparatedTypedOptionValuesTest)
  valueOfWhenMultiples(joptsimple.OptionParserOptionExceptionTest)
  shortOptionsInDifferentOrder(joptsimple.ClusterVersusLongOptionWithOptionalArgumentTest)
  withArgumentComingAfterCluster(joptsimple.ClusterVersusLongOptionWithOptionalArgumentTest)
  resolvesToShortOptionsWithArgumentFollowingX(joptsimple.ClusterVersusLongOptionWithOptionalArgumentTest)
  commandLineMissingConditionallyRequiredOption(joptsimple.RequiredUnlessAnyTest): Missing required option(s) [n]
  acceptsCommandLineWithConditionallyRequiredOptionsPresent(joptsimple.RequiredUnlessAnyTest): Missing required option(s) [n]
  acceptsOptionWithPrerequisiteAsNormalIfPrerequisiteNotInPlay(joptsimple.RequiredUnlessAnyTest): Missing required option(s) [n]
  commandLineWithNotAllConditionallyRequiredOptionsPresent(joptsimple.RequiredUnlessAnyTest): Missing required option(s) [n]
  shortArgumentType(joptsimple.OptionParserNewDeclarationTest)
  sqlDateArgumentType(joptsimple.OptionParserNewDeclarationTest)
  booleanArgumentType(joptsimple.OptionParserNewDeclarationTest)
  doubleArgumentType(joptsimple.OptionParserNewDeclarationTest)
  illegalOptionArgumentMethodConversion(joptsimple.OptionParserNewDeclarationTest): Unexpected exception, expected<joptsimple.OptionException> but was<java.lang.NullPointerException>
  integerArgumentType(joptsimple.OptionParserNewDeclarationTest)
  floatArgumentType(joptsimple.OptionParserNewDeclarationTest)
  sqlTimestampArgumentType(joptsimple.OptionParserNewDeclarationTest)
  optionsWithNegativeNumberArgumentsAndNonNumberOptions(joptsimple.OptionParserNewDeclarationTest)
  optionsWithOptionalNegativeNumberArguments(joptsimple.OptionParserNewDeclarationTest)
  longArgumentType(joptsimple.OptionParserNewDeclarationTest)
  illegalOptionArgumentConstructorConversion(joptsimple.OptionParserNewDeclarationTest): Unexpected exception, expected<joptsimple.OptionException> but was<java.lang.NullPointerException>
  byteArgumentType(joptsimple.OptionParserNewDeclarationTest)
  sqlTimeArgumentType(joptsimple.OptionParserNewDeclarationTest)
  acceptsOptionWithPrerequisiteAsNormal(joptsimple.RequiredUnlessTest)
  presenceOfHelpOptionNegatesRequiredUnlessness(joptsimple.RequiredUnlessTest): Missing required option(s) [userid/username, password/pwd]
  acceptsCommandLineWithConditionallyRequiredOptionsPresent(joptsimple.RequiredUnlessTest)
  acceptsOptionWithPrerequisite(joptsimple.RequiredUnlessTest): Missing required option(s) [userid/username, password/pwd]
  shouldPreventSetViaListIterator(joptsimple.RequiredArgumentOptionSpecValuesImmutabilityTest)
  shouldPreventAddAtIndex(joptsimple.RequiredArgumentOptionSpecValuesImmutabilityTest)
  shouldPreventSetAtIndex(joptsimple.RequiredArgumentOptionSpecValuesImmutabilityTest)
  shouldPreventRemoveAtIndex(joptsimple.RequiredArgumentOptionSpecValuesImmutabilityTest)
  shouldPreventRemoveViaListIterator(joptsimple.RequiredArgumentOptionSpecValuesImmutabilityTest)
  shouldPreventAdd(joptsimple.RequiredArgumentOptionSpecValuesImmutabilityTest)
  shouldPreventRetainAll(joptsimple.RequiredArgumentOptionSpecValuesImmutabilityTest)
  shouldPreventRemoveViaIterator(joptsimple.RequiredArgumentOptionSpecValuesImmutabilityTest)
  shouldPreventAddAll(joptsimple.RequiredArgumentOptionSpecValuesImmutabilityTest)
  shouldPreventClear(joptsimple.RequiredArgumentOptionSpecValuesImmutabilityTest)
  shouldPreventRemove(joptsimple.RequiredArgumentOptionSpecValuesImmutabilityTest)
  shouldPreventRemoveAll(joptsimple.RequiredArgumentOptionSpecValuesImmutabilityTest)
  allowsWhitespaceyStringAsArgumentOfOption(joptsimple.OptionParserTest)
  typedArguments(joptsimple.OptionParserTest)
  allowsEmbeddedWhitespaceInArgumentOfOption(joptsimple.OptionParserTest)
  resetHappensAfterParsing(joptsimple.OptionParserTest)
  allowsEmptyStringAsArgumentOfOption(joptsimple.OptionParserTest)
  disallowsMixingOfOptionsAndNonOptionsUnderPosixlyCorrect(joptsimple.OptionParserTest)
  longOptionLeadsWithSingleDashAmbiguousButAShortAcceptsAnArgument(joptsimple.OptionParserTest)
  optionsAndNonOptionsInterspersed(joptsimple.OptionParserTest)
  doubleHyphenSignalsEndsOfOptions(joptsimple.OptionParserTest)
  allowsMixingOfOptionsAndNonOptions(joptsimple.OptionParserTest)
  requiredOptionButHelpOptionPresent(joptsimple.OptionParserTest): Missing required option(s) [t]
  nonOptionsOnly(joptsimple.PlainOldOptionParserTest)
  handlesConsecutiveDelimiters(joptsimple.ParsingSeparatedStringOptionValuesTest)
  parsesSeparatedValuesWhenArgumentAbuttedWithEquals(joptsimple.ParsingSeparatedStringOptionValuesTest)
  parsesHyphenSeparatedValuesAbutting(joptsimple.ParsingSeparatedStringOptionValuesTest)
  parsesSeparatedValuesAbutting(joptsimple.ParsingSeparatedStringOptionValuesTest)
  parsesEqualsSeparatedValuesWhenArgumentAbuttedWithEquals(joptsimple.ParsingSeparatedStringOptionValuesTest)
  parsesSeparatedValuesAsSeparateArgument(joptsimple.ParsingSeparatedStringOptionValuesTest)
  optionalAbuttedArgumentVersusPosixlyCorrect(joptsimple.InterleavedArgumentsTest)
  leadingNonOptionCausesPosixlyCorrectToIgnoreRemainder(joptsimple.InterleavedArgumentsTest)
  optionalArgumentAndPosixlyCorrect(joptsimple.InterleavedArgumentsTest)
  requiredArgumentAndPosixlyCorrect(joptsimple.InterleavedArgumentsTest)
  requiredArgument(joptsimple.InterleavedArgumentsTest)
  optionalKeyValuePairArgumentVersusPosixlyCorrect(joptsimple.InterleavedArgumentsTest)
  onlyAppearingToHaveOptionArgumentsButPosixlyCorrect(joptsimple.InterleavedArgumentsTest)
  optionalArgument(joptsimple.InterleavedArgumentsTest)
  onlyAppearingToHaveOptionArguments(joptsimple.InterleavedArgumentsTest)
  hasAllSynonymsWhenSecondSynonymParsed(joptsimple.OptionSynonymOptionalArgumentTest)
  hasAllSynonymsWhenFirstSynonymParsed(joptsimple.OptionSynonymOptionalArgumentTest)
  hasAllSynonymsWhenThirdSynonymParsed(joptsimple.OptionSynonymOptionalArgumentTest)
  reportsSameListOfArgumentsForEverySynonymOption(joptsimple.OptionSynonymOptionalArgumentTest)
  hasAllSynonymsWhenSecondSynonymParsed(joptsimple.OptionSynonymRequiredArgumentTest)
  hasAllSynonymsWhenFirstSynonymParsed(joptsimple.OptionSynonymRequiredArgumentTest)
  hasAllSynonymsWhenThirdSynonymParsed(joptsimple.OptionSynonymRequiredArgumentTest)
  reportsSameListOfArgumentsForEverySynonymOption(joptsimple.OptionSynonymRequiredArgumentTest)
  gives(joptsimple.OptionSetAsMapTest)
  argumentSeparate(joptsimple.LongOptionOptionalArgumentTest)
  argumentTogether(joptsimple.LongOptionOptionalArgumentTest)
  shortOptionsInDifferentOrder(joptsimple.ClusterVersusLongOptionWithRequiredArgumentTest)
  withArgumentComingAfterCluster(joptsimple.ClusterVersusLongOptionWithRequiredArgumentTest)
  resolvesToShortOptionsWithArgumentFollowingX(joptsimple.ClusterVersusLongOptionWithRequiredArgumentTest)
  shouldPreventSetViaListIterator(joptsimple.OptionSetValuesOfSpecImmutabilityTest)
  shouldPreventAddAtIndex(joptsimple.OptionSetValuesOfSpecImmutabilityTest)
  shouldPreventSetAtIndex(joptsimple.OptionSetValuesOfSpecImmutabilityTest)
  shouldPreventRemoveAtIndex(joptsimple.OptionSetValuesOfSpecImmutabilityTest)
  shouldPreventRemoveViaListIterator(joptsimple.OptionSetValuesOfSpecImmutabilityTest)
  shouldPreventAdd(joptsimple.OptionSetValuesOfSpecImmutabilityTest)
  shouldPreventRetainAll(joptsimple.OptionSetValuesOfSpecImmutabilityTest)
  shouldPreventRemoveViaIterator(joptsimple.OptionSetValuesOfSpecImmutabilityTest)
  shouldPreventAddAll(joptsimple.OptionSetValuesOfSpecImmutabilityTest)
  shouldPreventClear(joptsimple.OptionSetValuesOfSpecImmutabilityTest)
  shouldPreventRemove(joptsimple.OptionSetValuesOfSpecImmutabilityTest)
  shouldPreventRemoveAll(joptsimple.OptionSetValuesOfSpecImmutabilityTest)
  asArgumentOfOption(joptsimple.SingleHyphenTest)
  asArgumentOfOptionInSameToken(joptsimple.SingleHyphenTest)
  singleHyphen(joptsimple.SingleHyphenTest)
  allowsDescriptionOfNonOptionArguments(joptsimple.NonOptionArgumentSpecTest)
  allowsArgumentDescriptionForNonOptionArguments(joptsimple.NonOptionArgumentSpecTest)
  convertingUsingConverter(joptsimple.NonOptionArgumentSpecTest)
  allowsTypeAndDescriptionOfNonOptionArguments(joptsimple.NonOptionArgumentSpecTest)
  allowsTypingOfNonOptionArguments(joptsimple.NonOptionArgumentSpecTest)
  parsesSeparatedValuesWhenArgumentAbuttedWithEquals(joptsimple.ParsingSeparatedConvertedOptionValuesTest)
  parsesSeparatedValuesAbutting(joptsimple.ParsingSeparatedConvertedOptionValuesTest)
  parsesEqualsSeparatedValuesWhenArgumentAbuttedWithEquals(joptsimple.ParsingSeparatedConvertedOptionValuesTest)
  parsesSeparatedValuesAsSeparateArgument(joptsimple.ParsingSeparatedConvertedOptionValuesTest)
  optionalArgOptionWithDefaultGivesArgIfSpecifiedOnCommandLine(joptsimple.HandlingDefaultValuesForOptionArgumentsTest)
  specifiedOptionArgumentsTrumpsListOfDefaults(joptsimple.HandlingDefaultValuesForOptionArgumentsTest)
  requiredArgOptionWithDefaultGivesArgIfArgSpecifiedOnCommandLine(joptsimple.HandlingDefaultValuesForOptionArgumentsTest)
  clusteredOptionsWithOneAcceptingAnArgument(joptsimple.ShortOptionsRequiredArgumentTest)
  inSameToken(joptsimple.ShortOptionsRequiredArgumentTest)
  clusteredOptionsWithLastOneAcceptingAnArgument(joptsimple.ShortOptionsRequiredArgumentTest)
  argumentNotPresentFollowedByAnotherOption(joptsimple.ShortOptionsRequiredArgumentTest)
  withArgument(joptsimple.ShortOptionsRequiredArgumentTest)
  appearingMultipleTimes(joptsimple.ShortOptionsRequiredArgumentTest)
  whenEndOfOptionsMarkerIsInPlaceOfRequiredArgument(joptsimple.ShortOptionsRequiredArgumentTest)
  createsParserWithOptionSpecificationString(joptsimple.CreateWithOptionSpecificationStringTest)
  acceptsCommandLineWithConditionallyRequiredOptionsPresent(joptsimple.RequiredIfTest)
  acceptsOptionWithPrerequisiteAsNormalIfPrerequisiteNotInPlay(joptsimple.RequiredIfTest)
  shouldPreventSetViaListIterator(joptsimple.NoArgumentOptionSpecValuesImmutabilityTest)
  shouldPreventAddAtIndex(joptsimple.NoArgumentOptionSpecValuesImmutabilityTest)
  shouldPreventSetAtIndex(joptsimple.NoArgumentOptionSpecValuesImmutabilityTest)
  shouldPreventRemoveAtIndex(joptsimple.NoArgumentOptionSpecValuesImmutabilityTest)
  shouldPreventRemoveViaListIterator(joptsimple.NoArgumentOptionSpecValuesImmutabilityTest)
  shouldPreventAdd(joptsimple.NoArgumentOptionSpecValuesImmutabilityTest)
  shouldPreventRetainAll(joptsimple.NoArgumentOptionSpecValuesImmutabilityTest)
  shouldPreventRemoveViaIterator(joptsimple.NoArgumentOptionSpecValuesImmutabilityTest)
  shouldPreventAddAll(joptsimple.NoArgumentOptionSpecValuesImmutabilityTest)
  shouldPreventClear(joptsimple.NoArgumentOptionSpecValuesImmutabilityTest)
  shouldPreventRemove(joptsimple.NoArgumentOptionSpecValuesImmutabilityTest)
  shouldPreventRemoveAll(joptsimple.NoArgumentOptionSpecValuesImmutabilityTest)
  abbreviation(joptsimple.WAsAbbreviationForLongOptionTest)
  shouldPreventSetViaListIterator(joptsimple.OptionSetNonOptionArgumentsImmutabilityTest)
  shouldPreventAddAtIndex(joptsimple.OptionSetNonOptionArgumentsImmutabilityTest)
  shouldPreventSetAtIndex(joptsimple.OptionSetNonOptionArgumentsImmutabilityTest)
  shouldPreventRemoveAtIndex(joptsimple.OptionSetNonOptionArgumentsImmutabilityTest)
  shouldPreventRemoveViaListIterator(joptsimple.OptionSetNonOptionArgumentsImmutabilityTest)
  shouldPreventAdd(joptsimple.OptionSetNonOptionArgumentsImmutabilityTest)
  shouldPreventRetainAll(joptsimple.OptionSetNonOptionArgumentsImmutabilityTest)
  shouldPreventRemoveViaIterator(joptsimple.OptionSetNonOptionArgumentsImmutabilityTest)
  shouldPreventAddAll(joptsimple.OptionSetNonOptionArgumentsImmutabilityTest)
  shouldPreventClear(joptsimple.OptionSetNonOptionArgumentsImmutabilityTest)
  shouldPreventRemove(joptsimple.OptionSetNonOptionArgumentsImmutabilityTest)
  shouldPreventRemoveAll(joptsimple.OptionSetNonOptionArgumentsImmutabilityTest)
  unrecognizedOptionAllowed(joptsimple.OptionParserUnrecognizedOptionsAllowedTest)
  parseWithPosixlyCorrect[0](joptsimple.PosixlyCorrectOptionParserTest)
  parseWithPosixlyCorrect[1](joptsimple.PosixlyCorrectOptionParserTest)
  allowsDifferentFormsOfPairingArgumentWithOption(joptsimple.examples.ShortOptionsWithArgumentPositioningTest)
  usesConvertersOnOptionArgumentsWhenTold(joptsimple.examples.OptionArgumentConverterTest)
  aHelpOptionMeansRequiredOptionsNeedNotBePresent(joptsimple.examples.RequiredOptionsTest): Missing required option(s) [password, userid]
  missingHelpOptionMeansRequiredOptionsMustBePresent(joptsimple.examples.RequiredOptionsTest): Unexpected exception, expected<joptsimple.OptionException> but was<java.lang.NullPointerException>
  allowsSpecificationOfRequiredOptions(joptsimple.examples.RequiredOptionsTest): Unexpected exception, expected<joptsimple.OptionException> but was<java.lang.NullPointerException>
  allowsSpecificationOfDefaultValues(joptsimple.examples.DefaultValuesForOptionArgumentsTest)
  supportsOptionSynonyms(joptsimple.examples.OptionSynonymTest)
  allowsOptionsToAcceptArguments(joptsimple.examples.ShortOptionsWithArgumentsTest)
  handlesAlternativeLongOptions(joptsimple.examples.AlternativeLongOptionsTest)
  allowsDifferentFormsOfPairingArgumentWithOption(joptsimple.examples.LongOptionsWithArgumentPositioningTest)
  supportsPosixlyCorrectBehavior(joptsimple.examples.PosixlyCorrectTest)
  convertsArgumentsToJavaValueTypes(joptsimple.examples.OptionArgumentValueTypeTest)
  acceptsLongOptions(joptsimple.examples.UnrecognizedOptionsAllowedTest)
  allowsClusteringShortOptionsThatAcceptArguments(joptsimple.examples.ShortOptionsClusteringWithArgumentTest)
  doubleHyphenSignalsEndOfOptions(joptsimple.examples.SignallingEndOfOptionsTest)
  supportsMultipleDelimitedArguments(joptsimple.examples.MultipleDelimitedArgumentsTest)
  handlesNegativeNumberOptionalArguments(joptsimple.examples.SpecialOptionalArgumentHandlingTest)
  allowsMultipleValuesForAnOption(joptsimple.examples.ShortOptionsWithMultipleArgumentsForSingleOptionTest)
  supportsLongOptionsWithArgumentsAndAbbreviations(joptsimple.examples.LongOptionsWithArgumentsTest)
  allowsExportOfOptions(joptsimple.examples.ExportOptionsTest)
  allowsTypesafeRetrievalOfOptionArguments(joptsimple.examples.TypesafeOptionArgumentRetrievalTest)
  primitiveIntAllowedAsTypeSpecifier(joptsimple.TypesafeOptionArgumentRetrievalTest)
  retrievalOfTypedOptionalArgumentsInATypesafeManner(joptsimple.TypesafeOptionArgumentRetrievalTest)
  retrievalOfUntypedRequiredArgumentsInATypesafeManner(joptsimple.TypesafeOptionArgumentRetrievalTest)
  canSubvertTypeSafetyIfYouUseAnOptionSpecAsTheWrongType(joptsimple.TypesafeOptionArgumentRetrievalTest): Unexpected exception, expected<java.lang.ClassCastException> but was<java.lang.NullPointerException>
  wrapsValueConversionExceptionsRaisedByConverter(joptsimple.TypesafeOptionArgumentRetrievalTest)
  cannotFoolValuesOfWithAnOptionNotIssuedFromBuilder(joptsimple.TypesafeOptionArgumentRetrievalTest)
  primitiveLongAllowedAsTypeSpecifier(joptsimple.TypesafeOptionArgumentRetrievalTest)
  canSubvertTypeSafetyIfYouGiveAnOptionSpecToOptionSetAsTheWrongType(joptsimple.TypesafeOptionArgumentRetrievalTest): Unexpected exception, expected<java.lang.ClassCastException> but was<java.lang.NullPointerException>
  retrievalOfTypedRequiredArgumentsInATypesafeManner(joptsimple.TypesafeOptionArgumentRetrievalTest)
  primitiveShortAllowedAsTypeSpecifier(joptsimple.TypesafeOptionArgumentRetrievalTest)
  usesConverterIfProvided(joptsimple.TypesafeOptionArgumentRetrievalTest)
  cannotFoolHasArgumentWithAnOptionNotIssuedFromBuilder(joptsimple.TypesafeOptionArgumentRetrievalTest)
  cannotFoolValueOfWithAnOptionNotIssuedFromBuilder(joptsimple.TypesafeOptionArgumentRetrievalTest)
  primitiveByteAllowedAsTypeSpecifier(joptsimple.TypesafeOptionArgumentRetrievalTest)
  retrievalOfUntypedOptionalArgumentsInATypesafeManner(joptsimple.TypesafeOptionArgumentRetrievalTest)
  primitiveFloatAllowedAsTypeSpecifier(joptsimple.TypesafeOptionArgumentRetrievalTest)
  primitiveBooleanAllowedAsTypeSpecifier(joptsimple.TypesafeOptionArgumentRetrievalTest)
  primitiveDoubleAllowedAsTypeSpecifier(joptsimple.TypesafeOptionArgumentRetrievalTest)
  canUseBooleanType(joptsimple.TypesafeOptionArgumentRetrievalTest)
  subclassInstanceWithSameValuesShouldNotCompareEqualToSuperclassInstance(joptsimple.OptionSetEqualsHashCodeTest)
  equalsShouldBeSymmetricAndTransitive(joptsimple.OptionSetEqualsHashCodeTest)
  unequalObjectsShouldNotCompareEqual(joptsimple.OptionSetEqualsHashCodeTest)
  equalObjectsShouldGiveSameHashCode(joptsimple.OptionSetEqualsHashCodeTest)
  equalsShouldBeReflexive(joptsimple.OptionSetEqualsHashCodeTest)
  shouldNotBeEqualToNull(joptsimple.OptionSetEqualsHashCodeTest)
  hashCodeShouldBeConsistentAcrossInvocations(joptsimple.OptionSetEqualsHashCodeTest)
  shouldNotBeEqualToJavaLangObject(joptsimple.OptionSetEqualsHashCodeTest)
  equalsShouldBeConsistentAcrossInvocations(joptsimple.OptionSetEqualsHashCodeTest)

Tests run: 745, Failures: 10, Errors: 278, Skipped: 0

[INFO] ------------------------------------------------------------------------
[INFO] BUILD FAILURE
[INFO] ------------------------------------------------------------------------
[INFO] Total time: 7.969s
[INFO] Finished at: Sun Aug 02 00:05:20 BST 2015
[INFO] Final Memory: 28M/346M
[INFO] ------------------------------------------------------------------------
[ERROR] Failed to execute goal org.apache.maven.plugins:maven-surefire-plugin:2.10:test (default-test) on project jopt-simple: There are test failures.
[ERROR] 
[ERROR] Please refer to /home/perham/Study/LittleDarwin/Cases/jopt-simple-4.8/target/surefire-reports for the individual test results.
[ERROR] -> [Help 1]
[ERROR] 
[ERROR] To see the full stack trace of the errors, re-run Maven with the -e switch.
[ERROR] Re-run Maven using the -X switch to enable full debug logging.
[ERROR] 
[ERROR] For more information about the errors and possible solutions, please read the following articles:
[ERROR] [Help 1] http://cwiki.apache.org/confluence/display/MAVEN/MojoFailureException
