[INFO] Scanning for projects...
[INFO]                                                                         
[INFO] ------------------------------------------------------------------------
[INFO] Building JOpt Simple 4.8
[INFO] ------------------------------------------------------------------------
[WARNING] The POM for com.googlecode.jmockit:jmockit:jar:1.6 is invalid, transitive dependencies (if any) will not be available, enable debug logging for more details
[INFO] 
[INFO] --- maven-enforcer-plugin:1.0:enforce (enforce-maven) @ jopt-simple ---
[INFO] 
[INFO] --- maven-resources-plugin:2.3:resources (default-resources) @ jopt-simple ---
[INFO] Using 'UTF-8' encoding to copy filtered resources.
[INFO] Copying 1 resource
[INFO] 
[INFO] --- maven-compiler-plugin:3.1:compile (default-compile) @ jopt-simple ---
[INFO] Changes detected - recompiling the module!
[INFO] Compiling 44 source files to /home/perham/Study/LittleDarwin/Cases/jopt-simple-4.8/target/classes
[WARNING] /home/perham/Study/LittleDarwin/Cases/jopt-simple-4.8/src/main/java/joptsimple/OptionMissingRequiredArgumentException.java: /home/perham/Study/LittleDarwin/Cases/jopt-simple-4.8/src/main/java/joptsimple/OptionMissingRequiredArgumentException.java uses unchecked or unsafe operations.
[WARNING] /home/perham/Study/LittleDarwin/Cases/jopt-simple-4.8/src/main/java/joptsimple/OptionMissingRequiredArgumentException.java: Recompile with -Xlint:unchecked for details.
[INFO] 
[INFO] >>> maven-pmd-plugin:3.2:cpd-check (default) @ jopt-simple >>>
[INFO] 
[INFO] --- maven-pmd-plugin:3.2:cpd (cpd) @ jopt-simple ---
[WARNING] Unable to locate Source XRef to link to - DISABLED
[INFO] 
[INFO] <<< maven-pmd-plugin:3.2:cpd-check (default) @ jopt-simple <<<
[INFO] 
[INFO] --- maven-pmd-plugin:3.2:cpd-check (default) @ jopt-simple ---
[INFO] 
[INFO] 
[INFO] --- animal-sniffer-maven-plugin:1.11:check (check-signature) @ jopt-simple ---
[INFO] Checking unresolved references to org.codehaus.mojo.signature:java15:1.0
[INFO] 
[INFO] --- maven-resources-plugin:2.3:testResources (default-testResources) @ jopt-simple ---
[INFO] Using 'UTF-8' encoding to copy filtered resources.
[INFO] skip non existing resourceDirectory /home/perham/Study/LittleDarwin/Cases/jopt-simple-4.8/src/test/resources
[INFO] 
[INFO] --- maven-compiler-plugin:3.1:testCompile (default-testCompile) @ jopt-simple ---
[INFO] Nothing to compile - all classes are up to date
[INFO] 
[INFO] --- maven-surefire-plugin:2.10:test (default-test) @ jopt-simple ---
[INFO] Surefire report directory: /home/perham/Study/LittleDarwin/Cases/jopt-simple-4.8/target/surefire-reports

-------------------------------------------------------
 T E S T S
-------------------------------------------------------
Running joptsimple.OptionSpecBuilderOptionsImmutabilityTest
Tests run: 12, Failures: 0, Errors: 0, Skipped: 0, Time elapsed: 0.519 sec
Running joptsimple.JVMSystemPropertiesArgumentParsingTest
Tests run: 1, Failures: 0, Errors: 0, Skipped: 0, Time elapsed: 0.013 sec
Running joptsimple.WAsShortOptionTest
Tests run: 2, Failures: 1, Errors: 0, Skipped: 0, Time elapsed: 0.019 sec <<< FAILURE!
Running joptsimple.OptionSetValuesOfOptionStringImmutabilityTest
Tests run: 12, Failures: 0, Errors: 0, Skipped: 0, Time elapsed: 0.018 sec
Running joptsimple.ArgumentListHasNoMoreArgsTest
Tests run: 3, Failures: 0, Errors: 0, Skipped: 0, Time elapsed: 0.008 sec
Running joptsimple.util.KeyValuePairUnequalValuesTest
Tests run: 8, Failures: 0, Errors: 0, Skipped: 0, Time elapsed: 0.014 sec
Running joptsimple.util.DateConverterTest
Tests run: 11, Failures: 0, Errors: 0, Skipped: 0, Time elapsed: 0.133 sec
Running joptsimple.util.KeyValuePairUnequalKeysTest
Tests run: 8, Failures: 0, Errors: 0, Skipped: 0, Time elapsed: 0.01 sec
Running joptsimple.util.InetAddressConverterTest
Tests run: 2, Failures: 0, Errors: 0, Skipped: 0, Time elapsed: 0.019 sec
Running joptsimple.util.KeyValuePairTest
Tests run: 7, Failures: 0, Errors: 0, Skipped: 0, Time elapsed: 0.015 sec
Running joptsimple.util.RegexMatcherTest
Tests run: 6, Failures: 0, Errors: 0, Skipped: 0, Time elapsed: 0.012 sec
Running joptsimple.OptionSetSpecsImmutabilityTest
Tests run: 12, Failures: 0, Errors: 0, Skipped: 0, Time elapsed: 0.017 sec
Running joptsimple.ArgumentAcceptingOptionSpecTest
Tests run: 16, Failures: 0, Errors: 0, Skipped: 0, Time elapsed: 0.021 sec
Running joptsimple.AlternativeLongOptionSpecValuesImmutabilityTest
Tests run: 12, Failures: 0, Errors: 0, Skipped: 0, Time elapsed: 0.014 sec
Running joptsimple.RequiredIfAnyTest
Tests run: 5, Failures: 0, Errors: 0, Skipped: 0, Time elapsed: 0.009 sec
Running joptsimple.ClusterWhereManyOptionsAcceptArgumentsTest
Tests run: 12, Failures: 0, Errors: 0, Skipped: 0, Time elapsed: 0.017 sec
Running joptsimple.OptionSpecsReportTheirOptionsSortedSpeciallyTest
Tests run: 1, Failures: 0, Errors: 0, Skipped: 0, Time elapsed: 0.001 sec
Running joptsimple.DefaultSettingsOptionParserHelpTest
Tests run: 39, Failures: 0, Errors: 0, Skipped: 0, Time elapsed: 0.083 sec
Running joptsimple.WExtensionWithArgumentTest
Tests run: 7, Failures: 1, Errors: 5, Skipped: 0, Time elapsed: 0.016 sec <<< FAILURE!
Running joptsimple.PunctuationInShortOptionTest
Tests run: 4, Failures: 0, Errors: 0, Skipped: 0, Time elapsed: 0.005 sec
Running joptsimple.PunctuationInLongOptionTest
Tests run: 6, Failures: 0, Errors: 5, Skipped: 0, Time elapsed: 0.023 sec <<< FAILURE!
Running joptsimple.LongOptionRequiredArgumentTest
Tests run: 6, Failures: 1, Errors: 5, Skipped: 0, Time elapsed: 0.015 sec <<< FAILURE!
Running joptsimple.ToStringTest
Tests run: 3, Failures: 0, Errors: 0, Skipped: 0, Time elapsed: 0.007 sec
Running joptsimple.OptionSetDetectedOptionsTest
Tests run: 1, Failures: 0, Errors: 0, Skipped: 0, Time elapsed: 0.002 sec
Running joptsimple.OptionSpecBuilderValuesImmutabilityTest
Tests run: 12, Failures: 0, Errors: 0, Skipped: 0, Time elapsed: 0.015 sec
Running joptsimple.ShortOptionsNoArgumentTest
Tests run: 6, Failures: 0, Errors: 0, Skipped: 0, Time elapsed: 0.011 sec
Running joptsimple.OptionalArgumentOptionSpecValuesImmutabilityTest
Tests run: 12, Failures: 0, Errors: 0, Skipped: 0, Time elapsed: 0.012 sec
Running joptsimple.AlternativeLongOptionSpecOptionsImmutabilityTest
Tests run: 12, Failures: 0, Errors: 0, Skipped: 0, Time elapsed: 0.005 sec
Running joptsimple.ShortOptionsOptionalArgumentTest
Tests run: 6, Failures: 1, Errors: 1, Skipped: 0, Time elapsed: 0.01 sec <<< FAILURE!
Running joptsimple.ValueConverterAdmitsSubclassesOfValueTypeTest
Tests run: 1, Failures: 0, Errors: 0, Skipped: 0, Time elapsed: 0.001 sec
Running joptsimple.PopulatedOptionSetTest
Tests run: 4, Failures: 0, Errors: 0, Skipped: 0, Time elapsed: 0.004 sec
Running joptsimple.ParsingSeparatedTypedOptionValuesTest
Tests run: 4, Failures: 0, Errors: 3, Skipped: 0, Time elapsed: 0.009 sec <<< FAILURE!
Running joptsimple.OptionSynonymNoArgumentTest
Tests run: 3, Failures: 0, Errors: 2, Skipped: 0, Time elapsed: 0.007 sec <<< FAILURE!
Running joptsimple.OptionParserOptionExceptionTest
Tests run: 5, Failures: 1, Errors: 0, Skipped: 0, Time elapsed: 0.007 sec <<< FAILURE!
Running joptsimple.ClusterVersusLongOptionWithOptionalArgumentTest
Tests run: 9, Failures: 0, Errors: 3, Skipped: 0, Time elapsed: 0.014 sec <<< FAILURE!
Running joptsimple.RequiredUnlessAnyTest
Tests run: 4, Failures: 0, Errors: 0, Skipped: 0, Time elapsed: 0.004 sec
Running joptsimple.OptionParserNewDeclarationTest
Tests run: 16, Failures: 0, Errors: 0, Skipped: 0, Time elapsed: 0.025 sec
Running joptsimple.RequiredArgumentOptionSpecEqualsHashCodeTest
Tests run: 10, Failures: 0, Errors: 0, Skipped: 0, Time elapsed: 0.005 sec
Running joptsimple.OptionSynonymCommonPrefixesTest
Tests run: 7, Failures: 0, Errors: 0, Skipped: 0, Time elapsed: 0.012 sec
Running joptsimple.OptionalArgumentOptionSpecOptionsImmutabilityTest
Tests run: 12, Failures: 0, Errors: 0, Skipped: 0, Time elapsed: 0.013 sec
Running joptsimple.RequiredUnlessTest
Tests run: 8, Failures: 1, Errors: 3, Skipped: 0, Time elapsed: 0.008 sec <<< FAILURE!
Running joptsimple.ArgumentListTest
Tests run: 2, Failures: 0, Errors: 0, Skipped: 0, Time elapsed: 0.004 sec
Running joptsimple.NoArgumentOptionSpecTest
Tests run: 11, Failures: 0, Errors: 0, Skipped: 0, Time elapsed: 0.02 sec
Running joptsimple.RequiredArgumentOptionSpecValuesImmutabilityTest
Tests run: 12, Failures: 0, Errors: 0, Skipped: 0, Time elapsed: 0.022 sec
Running joptsimple.OptionParserTest
Tests run: 17, Failures: 0, Errors: 1, Skipped: 0, Time elapsed: 0.026 sec <<< FAILURE!
Running joptsimple.PlainOldOptionParserTest
Tests run: 1, Failures: 0, Errors: 0, Skipped: 0, Time elapsed: 0.002 sec
Running joptsimple.OptionExceptionOptionsImmutabilityTest
Tests run: 12, Failures: 0, Errors: 0, Skipped: 0, Time elapsed: 0.012 sec
Running joptsimple.ParsingSeparatedStringOptionValuesTest
Tests run: 6, Failures: 0, Errors: 3, Skipped: 0, Time elapsed: 0.01 sec <<< FAILURE!
Running joptsimple.OptionParserAlternateHelpFormatterTest
Tests run: 2, Failures: 0, Errors: 0, Skipped: 0, Time elapsed: 0.003 sec
Running joptsimple.InterleavedArgumentsTest
Tests run: 9, Failures: 0, Errors: 0, Skipped: 0, Time elapsed: 0.009 sec
Running joptsimple.ClusterVersusLongOptionTest
Tests run: 5, Failures: 0, Errors: 2, Skipped: 0, Time elapsed: 0.006 sec <<< FAILURE!
Running joptsimple.OptionSynonymOptionalArgumentTest
Tests run: 4, Failures: 0, Errors: 3, Skipped: 0, Time elapsed: 0.006 sec <<< FAILURE!
Running joptsimple.OptionSynonymRequiredArgumentTest
Tests run: 4, Failures: 0, Errors: 3, Skipped: 0, Time elapsed: 0.01 sec <<< FAILURE!
Running joptsimple.internal.ObjectsUtilityClassTest
Tests run: 1, Failures: 0, Errors: 0, Skipped: 0, Time elapsed: 0.001 sec
Running joptsimple.internal.RowEqualsHashCodeTest
Tests run: 9, Failures: 0, Errors: 0, Skipped: 0, Time elapsed: 0.014 sec
Running joptsimple.internal.RowsTest
Tests run: 3, Failures: 0, Errors: 0, Skipped: 0, Time elapsed: 0.005 sec
Running joptsimple.internal.AbbreviationMapTest
Tests run: 22, Failures: 0, Errors: 0, Skipped: 0, Time elapsed: 0.029 sec
Running joptsimple.internal.AbbreviationMapToJavaUtilMapTest
Tests run: 12, Failures: 0, Errors: 0, Skipped: 0, Time elapsed: 0.013 sec
Running joptsimple.internal.ReflectionUtilityClassTest
Tests run: 1, Failures: 0, Errors: 0, Skipped: 0, Time elapsed: 0.002 sec
Running joptsimple.internal.ClassesUtilityClassTest
Tests run: 1, Failures: 0, Errors: 0, Skipped: 0, Time elapsed: 0.002 sec
Running joptsimple.internal.StringsUtilityClassTest
Tests run: 1, Failures: 0, Errors: 0, Skipped: 0, Time elapsed: 0.001 sec
Running joptsimple.internal.ReflectionTest
Tests run: 6, Failures: 0, Errors: 0, Skipped: 0, Time elapsed: 0.01 sec
Running joptsimple.OptionSetAsMapTest
Tests run: 1, Failures: 0, Errors: 0, Skipped: 0, Time elapsed: 0.004 sec
Running joptsimple.NoArgumentOptionSpecOptionsImmutabilityTest
Tests run: 12, Failures: 0, Errors: 0, Skipped: 0, Time elapsed: 0.009 sec
Running joptsimple.LongOptionOptionalArgumentTest
Tests run: 3, Failures: 0, Errors: 3, Skipped: 0, Time elapsed: 0.004 sec <<< FAILURE!
Running joptsimple.ClusterVersusLongOptionWithRequiredArgumentTest
Tests run: 9, Failures: 0, Errors: 3, Skipped: 0, Time elapsed: 0.011 sec <<< FAILURE!
Running joptsimple.OptionalArgumentOptionSpecTest
Tests run: 11, Failures: 0, Errors: 0, Skipped: 0, Time elapsed: 0.007 sec
Running joptsimple.OptionSetValuesOfSpecImmutabilityTest
Tests run: 12, Failures: 0, Errors: 0, Skipped: 0, Time elapsed: 0.011 sec
Running joptsimple.OptionSpecTokenizerTest
Tests run: 17, Failures: 0, Errors: 0, Skipped: 0, Time elapsed: 0.014 sec
Running joptsimple.SingleHyphenTest
Tests run: 3, Failures: 0, Errors: 0, Skipped: 0, Time elapsed: 0.005 sec
Running joptsimple.WExtensionNoArgumentTest
Tests run: 2, Failures: 0, Errors: 1, Skipped: 0, Time elapsed: 0.004 sec <<< FAILURE!
Running joptsimple.RequiredArgumentOptionSpecOptionsImmutabilityTest
Tests run: 12, Failures: 0, Errors: 0, Skipped: 0, Time elapsed: 0.012 sec
Running joptsimple.ParserRulesUtilityClassTest
Tests run: 1, Failures: 0, Errors: 0, Skipped: 0, Time elapsed: 0.002 sec
Running joptsimple.ConfigurableOptionParserHelpTest
Tests run: 27, Failures: 0, Errors: 0, Skipped: 0, Time elapsed: 0.059 sec
Running joptsimple.NonOptionArgumentSpecTest
Tests run: 7, Failures: 0, Errors: 0, Skipped: 0, Time elapsed: 0.011 sec
Running joptsimple.OptionExceptionMessageTest
Tests run: 8, Failures: 0, Errors: 0, Skipped: 0, Time elapsed: 0.014 sec
Running joptsimple.LongOptionNoArgumentTest
Tests run: 4, Failures: 1, Errors: 3, Skipped: 0, Time elapsed: 0.01 sec <<< FAILURE!
Running joptsimple.ArgumentAcceptingOptionSpecDefaultValuesImmutabilityTest
Tests run: 12, Failures: 0, Errors: 0, Skipped: 0, Time elapsed: 0.016 sec
Running joptsimple.ParsingSeparatedConvertedOptionValuesTest
Tests run: 4, Failures: 0, Errors: 3, Skipped: 0, Time elapsed: 0.01 sec <<< FAILURE!
Running joptsimple.HandlingDefaultValuesForOptionArgumentsTest
Tests run: 9, Failures: 0, Errors: 0, Skipped: 0, Time elapsed: 0.013 sec
Running joptsimple.ShortOptionsRequiredArgumentTest
Tests run: 9, Failures: 0, Errors: 0, Skipped: 0, Time elapsed: 0.014 sec
Running joptsimple.CreateWithOptionSpecificationStringTest
Tests run: 1, Failures: 0, Errors: 0, Skipped: 0, Time elapsed: 0.001 sec
Running joptsimple.EmptyOptionSetTest
Tests run: 8, Failures: 0, Errors: 0, Skipped: 0, Time elapsed: 0.006 sec
Running joptsimple.OptionParserArgumentExceptionTest
Tests run: 9, Failures: 0, Errors: 0, Skipped: 0, Time elapsed: 0.008 sec
Running joptsimple.RequiredIfTest
Tests run: 8, Failures: 3, Errors: 3, Skipped: 0, Time elapsed: 0.017 sec <<< FAILURE!
Running joptsimple.NoArgumentOptionSpecValuesImmutabilityTest
Tests run: 12, Failures: 0, Errors: 0, Skipped: 0, Time elapsed: 0.015 sec
Running joptsimple.WAsAbbreviationForLongOptionTest
Tests run: 2, Failures: 1, Errors: 1, Skipped: 0, Time elapsed: 0.006 sec <<< FAILURE!
Running joptsimple.OptionSynonymOverwritingTest
Tests run: 1, Failures: 0, Errors: 0, Skipped: 0, Time elapsed: 0.003 sec
Running joptsimple.OptionParserRecognizedOptionsTest
Tests run: 2, Failures: 0, Errors: 0, Skipped: 0, Time elapsed: 0.003 sec
Running joptsimple.OptionSetNonOptionArgumentsImmutabilityTest
Tests run: 12, Failures: 0, Errors: 0, Skipped: 0, Time elapsed: 0.013 sec
Running joptsimple.OptionParserUnrecognizedOptionsAllowedTest
Tests run: 2, Failures: 0, Errors: 0, Skipped: 0, Time elapsed: 0.002 sec
Running joptsimple.PosixlyCorrectOptionParserTest
Tests run: 2, Failures: 0, Errors: 0, Skipped: 0, Time elapsed: 0.003 sec
Running joptsimple.examples.ShortOptionsWithArgumentPositioningTest
Tests run: 1, Failures: 0, Errors: 0, Skipped: 0, Time elapsed: 0.001 sec
Running joptsimple.examples.OptionArgumentConverterTest
Tests run: 1, Failures: 0, Errors: 1, Skipped: 0, Time elapsed: 0.002 sec <<< FAILURE!
Running joptsimple.examples.RequiredOptionsTest
Tests run: 3, Failures: 0, Errors: 1, Skipped: 0, Time elapsed: 0.004 sec <<< FAILURE!
Running joptsimple.examples.DefaultValuesForOptionArgumentsTest
Tests run: 1, Failures: 0, Errors: 1, Skipped: 0, Time elapsed: 0.014 sec <<< FAILURE!
Running joptsimple.examples.OptionSynonymTest
Tests run: 1, Failures: 0, Errors: 1, Skipped: 0, Time elapsed: 0.002 sec <<< FAILURE!
Running joptsimple.examples.ShortOptionsWithArgumentsTest
Tests run: 1, Failures: 0, Errors: 0, Skipped: 0, Time elapsed: 0.001 sec
Running joptsimple.examples.AlternativeLongOptionsTest
Tests run: 1, Failures: 0, Errors: 1, Skipped: 0, Time elapsed: 0.002 sec <<< FAILURE!
Running joptsimple.examples.LongOptionsWithArgumentPositioningTest
Tests run: 1, Failures: 0, Errors: 1, Skipped: 0, Time elapsed: 0.001 sec <<< FAILURE!
Running joptsimple.examples.PosixlyCorrectTest
Tests run: 1, Failures: 0, Errors: 0, Skipped: 0, Time elapsed: 0.001 sec
Running joptsimple.examples.OptionArgumentValueTypeTest
Tests run: 1, Failures: 0, Errors: 1, Skipped: 0, Time elapsed: 0.001 sec <<< FAILURE!
Running joptsimple.examples.UnrecognizedOptionsAllowedTest
Tests run: 1, Failures: 0, Errors: 0, Skipped: 0, Time elapsed: 0.002 sec
Running joptsimple.examples.LongOptionsTest
Tests run: 1, Failures: 0, Errors: 1, Skipped: 0, Time elapsed: 0.002 sec <<< FAILURE!
Running joptsimple.examples.ShortOptionsClusteringTest
Tests run: 1, Failures: 0, Errors: 0, Skipped: 0, Time elapsed: 0 sec
Running joptsimple.examples.ShortOptionsClusteringWithArgumentTest
Tests run: 1, Failures: 0, Errors: 0, Skipped: 0, Time elapsed: 0.001 sec
Running joptsimple.examples.SignallingEndOfOptionsTest
Tests run: 1, Failures: 0, Errors: 0, Skipped: 0, Time elapsed: 0 sec
Running joptsimple.examples.MultipleDelimitedArgumentsTest
Tests run: 1, Failures: 0, Errors: 1, Skipped: 0, Time elapsed: 0.001 sec <<< FAILURE!
Running joptsimple.examples.SpecialOptionalArgumentHandlingTest
Tests run: 1, Failures: 0, Errors: 0, Skipped: 0, Time elapsed: 0.001 sec
Running joptsimple.examples.ShortOptionsWithMultipleArgumentsForSingleOptionTest
Tests run: 1, Failures: 0, Errors: 0, Skipped: 0, Time elapsed: 0.002 sec
Running joptsimple.examples.ShortOptionsTest
Tests run: 1, Failures: 0, Errors: 0, Skipped: 0, Time elapsed: 0.001 sec
Running joptsimple.examples.LongOptionsWithArgumentsTest
Tests run: 1, Failures: 0, Errors: 1, Skipped: 0, Time elapsed: 0.001 sec <<< FAILURE!
Running joptsimple.examples.ExportOptionsTest
Tests run: 1, Failures: 0, Errors: 1, Skipped: 0, Time elapsed: 0.001 sec <<< FAILURE!
Running joptsimple.examples.TypesafeOptionArgumentRetrievalTest
Tests run: 1, Failures: 0, Errors: 1, Skipped: 0, Time elapsed: 0.002 sec <<< FAILURE!
Running joptsimple.TypesafeOptionArgumentRetrievalTest
Tests run: 22, Failures: 0, Errors: 0, Skipped: 0, Time elapsed: 0.024 sec
Running joptsimple.OptionSetEqualsHashCodeTest
Tests run: 9, Failures: 0, Errors: 0, Skipped: 0, Time elapsed: 0.02 sec

Results :

Failed tests:   recognizeLongOptionsTrumpsShortOptionW(joptsimple.WAsShortOptionTest): 
  illegalLongOption(joptsimple.WExtensionWithArgumentTest): 
  argumentMissing(joptsimple.LongOptionRequiredArgumentTest): 
  optionWithOptionalArgumentThatLooksLikeAnInvalidOption(joptsimple.ShortOptionsOptionalArgumentTest): 
  tooManyHyphens(joptsimple.OptionParserOptionExceptionTest): 
  rejectsCommandLineWithNotAllConditionallyRequiredOptionsPresent(joptsimple.RequiredUnlessTest): 
  ambiguousAbbreviation(joptsimple.LongOptionNoArgumentTest): 
  rejectsCommandLineMissingConditionallyRequiredOptionSynonym(joptsimple.RequiredIfTest): 
  rejectsCommandLineMissingConditionallyRequiredOption(joptsimple.RequiredIfTest): 
  rejectsCommandLineWithNotAllConditionallyRequiredOptionsPresent(joptsimple.RequiredIfTest): 
  recognizeLongOptionsTrumpsLongOptionAbbreviation(joptsimple.WAsAbbreviationForLongOptionTest): 

Tests in error: 
  separateArgument(joptsimple.WExtensionWithArgumentTest): silent is not a recognized option
  typedTogetherArg(joptsimple.WExtensionWithArgumentTest): level is not a recognized option
  typedSeparateArg(joptsimple.WExtensionWithArgumentTest): floor is not a recognized option
  abbreviationWithTogetherArgument(joptsimple.WExtensionWithArgumentTest): s is not a recognized option
  togetherArgument(joptsimple.WExtensionWithArgumentTest): silent is not a recognized option
  allowsDotInOptionNames(joptsimple.PunctuationInLongOptionTest): ..what.is.the.d..e...a....l... is not a recognized option
  allowsHyphensPrettyMuchAnywhereButTheFront(joptsimple.PunctuationInLongOptionTest): a-cra-zy-but-le--gal---o-p-t-i-o--n----- is not a recognized option
  allowsUnderscoreInOptionNames(joptsimple.PunctuationInLongOptionTest): super_long_option_name is not a recognized option
  allowsQuestionMarkInOptionNames(joptsimple.PunctuationInLongOptionTest): ??who?k??n???e????w? is not a recognized option
  allowsHyphensInTheMiddleOfOptionNames(joptsimple.PunctuationInLongOptionTest): hyphenated-option is not a recognized option
  argumentSeparate(joptsimple.LongOptionRequiredArgumentTest): quiet is not a recognized option
  argumentFollowedByLegalOption(joptsimple.LongOptionRequiredArgumentTest): quiet is not a recognized option
  argumentTogether(joptsimple.LongOptionRequiredArgumentTest): quiet is not a recognized option
  shortOptionSpecifiedAsLongOptionWithArgument(joptsimple.LongOptionRequiredArgumentTest): y is not a recognized option
  whenEndOfOptionsMarkerIsInPlaceOfRequiredArgument(joptsimple.LongOptionRequiredArgumentTest): quiet is not a recognized option
  optionWithOptionalArgumentThatLooksLikeAValidOption(joptsimple.ShortOptionsOptionalArgumentTest): bar is not a recognized option
  parsesSeparatedValuesWhenArgumentAbuttedWithEquals(joptsimple.ParsingSeparatedTypedOptionValuesTest): classpath is not a recognized option
  parsesEqualsSeparatedValuesWhenArgumentAbuttedWithEquals(joptsimple.ParsingSeparatedTypedOptionValuesTest): classpath is not a recognized option
  parsesSeparatedValuesAsSeparateArgument(joptsimple.ParsingSeparatedTypedOptionValuesTest): classpath is not a recognized option
  hasAllSynonymsWhenSecondSynonymParsed(joptsimple.OptionSynonymNoArgumentTest): after-d is not a recognized option
  hasAllSynonymsWhenThirdSynonymParsed(joptsimple.OptionSynonymNoArgumentTest): n is not a recognized option
  resolvesToLongOptionEvenWithMatchingShortOptions(joptsimple.ClusterVersusLongOptionWithOptionalArgumentTest): fox is not a recognized option
  resolvesShortOptionToShortOptionEvenWithDoubleHyphen(joptsimple.ClusterVersusLongOptionWithOptionalArgumentTest): f is not a recognized option
  longOptionWithMessedUpOrder(joptsimple.ClusterVersusLongOptionWithOptionalArgumentTest): Unexpected exception, expected<joptsimple.UnrecognizedOptionException> but was<java.lang.NullPointerException>
  acceptsOptionWithPrerequisiteAsNormal(joptsimple.RequiredUnlessTest): anonymous is not a recognized option
  acceptsCommandLineWithConditionallyRequiredOptionsPresent(joptsimple.RequiredUnlessTest): userid is not a recognized option
  acceptsOptionWithPrerequisite(joptsimple.RequiredUnlessTest): anonymous is not a recognized option
  shortOptionSpecifiedAsLongOptionWithoutArgument(joptsimple.OptionParserTest): x is not a recognized option
  parsesSeparatedValuesWhenArgumentAbuttedWithEquals(joptsimple.ParsingSeparatedStringOptionValuesTest): classpath is not a recognized option
  parsesEqualsSeparatedValuesWhenArgumentAbuttedWithEquals(joptsimple.ParsingSeparatedStringOptionValuesTest): classpath is not a recognized option
  parsesSeparatedValuesAsSeparateArgument(joptsimple.ParsingSeparatedStringOptionValuesTest): classpath is not a recognized option
  resolvesToLongOptionEvenWithMatchingShortOptions(joptsimple.ClusterVersusLongOptionTest): fox is not a recognized option
  resolvesShortOptionToShortOptionEvenWithDoubleHyphen(joptsimple.ClusterVersusLongOptionTest): f is not a recognized option
  hasAllSynonymsWhenSecondSynonymParsed(joptsimple.OptionSynonymOptionalArgumentTest): ou is not a recognized option
  hasAllSynonymsWhenThirdSynonymParsed(joptsimple.OptionSynonymOptionalArgumentTest): fold is not a recognized option
  reportsSameListOfArgumentsForEverySynonymOption(joptsimple.OptionSynonymOptionalArgumentTest): output-dir is not a recognized option
  hasAllSynonymsWhenSecondSynonymParsed(joptsimple.OptionSynonymRequiredArgumentTest): after-date is not a recognized option
  hasAllSynonymsWhenThirdSynonymParsed(joptsimple.OptionSynonymRequiredArgumentTest): newer is not a recognized option
  reportsSameListOfArgumentsForEverySynonymOption(joptsimple.OptionSynonymRequiredArgumentTest): ne is not a recognized option
  argumentSeparate(joptsimple.LongOptionOptionalArgumentTest): output is not a recognized option
  argumentTogether(joptsimple.LongOptionOptionalArgumentTest): output is not a recognized option
  argumentMissingTrailedByAnotherOption(joptsimple.LongOptionOptionalArgumentTest): output is not a recognized option
  resolvesToLongOptionEvenWithMatchingShortOptions(joptsimple.ClusterVersusLongOptionWithRequiredArgumentTest): fox is not a recognized option
  resolvesShortOptionToShortOptionEvenWithDoubleHyphen(joptsimple.ClusterVersusLongOptionWithRequiredArgumentTest): f is not a recognized option
  longOptionWithMessedUpOrder(joptsimple.ClusterVersusLongOptionWithRequiredArgumentTest): Unexpected exception, expected<joptsimple.UnrecognizedOptionException> but was<java.lang.NullPointerException>
  wExtensionWithLongOptionWithoutAnArgument(joptsimple.WExtensionNoArgumentTest): silent is not a recognized option
  abbreviationIsALegalOption(joptsimple.LongOptionNoArgumentTest): verb is not a recognized option
  singleLongOptionAbbreviated(joptsimple.LongOptionNoArgumentTest): verbo is not a recognized option
  singleLongOption(joptsimple.LongOptionNoArgumentTest): verbose is not a recognized option
  parsesSeparatedValuesWhenArgumentAbuttedWithEquals(joptsimple.ParsingSeparatedConvertedOptionValuesTest): classpath is not a recognized option
  parsesEqualsSeparatedValuesWhenArgumentAbuttedWithEquals(joptsimple.ParsingSeparatedConvertedOptionValuesTest): classpath is not a recognized option
  parsesSeparatedValuesAsSeparateArgument(joptsimple.ParsingSeparatedConvertedOptionValuesTest): classpath is not a recognized option
  acceptsCommandLineWithConditionallyRequiredOptionsPresent(joptsimple.RequiredIfTest): ftp is not a recognized option
  acceptsOptionWithPrerequisiteAsNormalIfPrerequisiteNotInPlay(joptsimple.RequiredIfTest): pwd is not a recognized option
  presenceOfHelpOptionNegatesRequiredIfness(joptsimple.RequiredIfTest): ftp is not a recognized option
  abbreviation(joptsimple.WAsAbbreviationForLongOptionTest): W is not a recognized option
  usesConvertersOnOptionArgumentsWhenTold(joptsimple.examples.OptionArgumentConverterTest): birthdate is not a recognized option
  aHelpOptionMeansRequiredOptionsNeedNotBePresent(joptsimple.examples.RequiredOptionsTest): help is not a recognized option
  allowsSpecificationOfDefaultValues(joptsimple.examples.DefaultValuesForOptionArgumentsTest): level is not a recognized option
  supportsOptionSynonyms(joptsimple.examples.OptionSynonymTest): message is not a recognized option
  handlesAlternativeLongOptions(joptsimple.examples.AlternativeLongOptionsTest): level is not a recognized option
  allowsDifferentFormsOfPairingArgumentWithOption(joptsimple.examples.LongOptionsWithArgumentPositioningTest): count is not a recognized option
  convertsArgumentsToJavaValueTypes(joptsimple.examples.OptionArgumentValueTypeTest): count is not a recognized option
  acceptsLongOptions(joptsimple.examples.LongOptionsTest): flag is not a recognized option
  supportsMultipleDelimitedArguments(joptsimple.examples.MultipleDelimitedArgumentsTest): path is not a recognized option
  supportsLongOptionsWithArgumentsAndAbbreviations(joptsimple.examples.LongOptionsWithArgumentsTest): co is not a recognized option
  allowsExportOfOptions(joptsimple.examples.ExportOptionsTest): count is not a recognized option
  allowsTypesafeRetrievalOfOptionArguments(joptsimple.examples.TypesafeOptionArgumentRetrievalTest): count is not a recognized option

Tests run: 745, Failures: 11, Errors: 68, Skipped: 0

[INFO] ------------------------------------------------------------------------
[INFO] BUILD FAILURE
[INFO] ------------------------------------------------------------------------
[INFO] Total time: 8.203s
[INFO] Finished at: Sun Aug 02 00:03:24 BST 2015
[INFO] Final Memory: 20M/217M
[INFO] ------------------------------------------------------------------------
[ERROR] Failed to execute goal org.apache.maven.plugins:maven-surefire-plugin:2.10:test (default-test) on project jopt-simple: There are test failures.
[ERROR] 
[ERROR] Please refer to /home/perham/Study/LittleDarwin/Cases/jopt-simple-4.8/target/surefire-reports for the individual test results.
[ERROR] -> [Help 1]
[ERROR] 
[ERROR] To see the full stack trace of the errors, re-run Maven with the -e switch.
[ERROR] Re-run Maven using the -X switch to enable full debug logging.
[ERROR] 
[ERROR] For more information about the errors and possible solutions, please read the following articles:
[ERROR] [Help 1] http://cwiki.apache.org/confluence/display/MAVEN/MojoFailureException
