[INFO] Scanning for projects...
[INFO]                                                                         
[INFO] ------------------------------------------------------------------------
[INFO] Building JOpt Simple 4.8
[INFO] ------------------------------------------------------------------------
[WARNING] The POM for com.googlecode.jmockit:jmockit:jar:1.6 is invalid, transitive dependencies (if any) will not be available, enable debug logging for more details
[INFO] 
[INFO] --- maven-enforcer-plugin:1.0:enforce (enforce-maven) @ jopt-simple ---
[INFO] 
[INFO] --- maven-resources-plugin:2.3:resources (default-resources) @ jopt-simple ---
[INFO] Using 'UTF-8' encoding to copy filtered resources.
[INFO] Copying 1 resource
[INFO] 
[INFO] --- maven-compiler-plugin:3.1:compile (default-compile) @ jopt-simple ---
[INFO] Changes detected - recompiling the module!
[INFO] Compiling 44 source files to /home/perham/Study/LittleDarwin/Cases/jopt-simple-4.8/target/classes
[WARNING] /home/perham/Study/LittleDarwin/Cases/jopt-simple-4.8/src/main/java/joptsimple/OptionMissingRequiredArgumentException.java: /home/perham/Study/LittleDarwin/Cases/jopt-simple-4.8/src/main/java/joptsimple/OptionMissingRequiredArgumentException.java uses unchecked or unsafe operations.
[WARNING] /home/perham/Study/LittleDarwin/Cases/jopt-simple-4.8/src/main/java/joptsimple/OptionMissingRequiredArgumentException.java: Recompile with -Xlint:unchecked for details.
[INFO] 
[INFO] >>> maven-pmd-plugin:3.2:cpd-check (default) @ jopt-simple >>>
[INFO] 
[INFO] --- maven-pmd-plugin:3.2:cpd (cpd) @ jopt-simple ---
[WARNING] Unable to locate Source XRef to link to - DISABLED
[INFO] 
[INFO] <<< maven-pmd-plugin:3.2:cpd-check (default) @ jopt-simple <<<
[INFO] 
[INFO] --- maven-pmd-plugin:3.2:cpd-check (default) @ jopt-simple ---
[INFO] 
[INFO] 
[INFO] --- animal-sniffer-maven-plugin:1.11:check (check-signature) @ jopt-simple ---
[INFO] Checking unresolved references to org.codehaus.mojo.signature:java15:1.0
[INFO] 
[INFO] --- maven-resources-plugin:2.3:testResources (default-testResources) @ jopt-simple ---
[INFO] Using 'UTF-8' encoding to copy filtered resources.
[INFO] skip non existing resourceDirectory /home/perham/Study/LittleDarwin/Cases/jopt-simple-4.8/src/test/resources
[INFO] 
[INFO] --- maven-compiler-plugin:3.1:testCompile (default-testCompile) @ jopt-simple ---
[INFO] Nothing to compile - all classes are up to date
[INFO] 
[INFO] --- maven-surefire-plugin:2.10:test (default-test) @ jopt-simple ---
[INFO] Surefire report directory: /home/perham/Study/LittleDarwin/Cases/jopt-simple-4.8/target/surefire-reports

-------------------------------------------------------
 T E S T S
-------------------------------------------------------
Running joptsimple.OptionSpecBuilderOptionsImmutabilityTest
Tests run: 12, Failures: 0, Errors: 0, Skipped: 0, Time elapsed: 0.461 sec
Running joptsimple.JVMSystemPropertiesArgumentParsingTest
Tests run: 1, Failures: 0, Errors: 1, Skipped: 0, Time elapsed: 0.025 sec <<< FAILURE!
Running joptsimple.WAsShortOptionTest
Tests run: 2, Failures: 0, Errors: 1, Skipped: 0, Time elapsed: 0.012 sec <<< FAILURE!
Running joptsimple.OptionSetValuesOfOptionStringImmutabilityTest
Tests run: 12, Failures: 0, Errors: 0, Skipped: 0, Time elapsed: 0.019 sec
Running joptsimple.ArgumentListHasNoMoreArgsTest
Tests run: 3, Failures: 0, Errors: 0, Skipped: 0, Time elapsed: 0.004 sec
Running joptsimple.util.KeyValuePairUnequalValuesTest
Tests run: 8, Failures: 0, Errors: 0, Skipped: 0, Time elapsed: 0.008 sec
Running joptsimple.util.DateConverterTest
Tests run: 11, Failures: 0, Errors: 0, Skipped: 0, Time elapsed: 0.116 sec
Running joptsimple.util.KeyValuePairUnequalKeysTest
Tests run: 8, Failures: 0, Errors: 0, Skipped: 0, Time elapsed: 0.011 sec
Running joptsimple.util.InetAddressConverterTest
Tests run: 2, Failures: 0, Errors: 0, Skipped: 0, Time elapsed: 0.018 sec
Running joptsimple.util.KeyValuePairTest
Tests run: 7, Failures: 0, Errors: 0, Skipped: 0, Time elapsed: 0.009 sec
Running joptsimple.util.RegexMatcherTest
Tests run: 6, Failures: 0, Errors: 0, Skipped: 0, Time elapsed: 0.011 sec
Running joptsimple.OptionSetSpecsImmutabilityTest
Tests run: 12, Failures: 0, Errors: 0, Skipped: 0, Time elapsed: 0.023 sec
Running joptsimple.ArgumentAcceptingOptionSpecTest
Tests run: 16, Failures: 0, Errors: 0, Skipped: 0, Time elapsed: 0.021 sec
Running joptsimple.AlternativeLongOptionSpecValuesImmutabilityTest
Tests run: 12, Failures: 0, Errors: 0, Skipped: 0, Time elapsed: 0.016 sec
Running joptsimple.RequiredIfAnyTest
Tests run: 5, Failures: 0, Errors: 2, Skipped: 0, Time elapsed: 0.011 sec <<< FAILURE!
Running joptsimple.ClusterWhereManyOptionsAcceptArgumentsTest
Tests run: 12, Failures: 0, Errors: 12, Skipped: 0, Time elapsed: 0.025 sec <<< FAILURE!
Running joptsimple.OptionSpecsReportTheirOptionsSortedSpeciallyTest
Tests run: 1, Failures: 0, Errors: 0, Skipped: 0, Time elapsed: 0 sec
Running joptsimple.DefaultSettingsOptionParserHelpTest
Tests run: 39, Failures: 0, Errors: 0, Skipped: 0, Time elapsed: 0.1 sec
Running joptsimple.WExtensionWithArgumentTest
Tests run: 7, Failures: 0, Errors: 5, Skipped: 0, Time elapsed: 0.013 sec <<< FAILURE!
Running joptsimple.PunctuationInShortOptionTest
Tests run: 4, Failures: 0, Errors: 3, Skipped: 0, Time elapsed: 0.014 sec <<< FAILURE!
Running joptsimple.PunctuationInLongOptionTest
Tests run: 6, Failures: 0, Errors: 5, Skipped: 0, Time elapsed: 0.015 sec <<< FAILURE!
Running joptsimple.LongOptionRequiredArgumentTest
Tests run: 6, Failures: 0, Errors: 5, Skipped: 0, Time elapsed: 0.014 sec <<< FAILURE!
Running joptsimple.ToStringTest
Tests run: 3, Failures: 0, Errors: 0, Skipped: 0, Time elapsed: 0.011 sec
Running joptsimple.OptionSetDetectedOptionsTest
Tests run: 1, Failures: 0, Errors: 1, Skipped: 0, Time elapsed: 0.004 sec <<< FAILURE!
Running joptsimple.OptionSpecBuilderValuesImmutabilityTest
Tests run: 12, Failures: 0, Errors: 0, Skipped: 0, Time elapsed: 0.016 sec
Running joptsimple.ShortOptionsNoArgumentTest
Tests run: 6, Failures: 0, Errors: 6, Skipped: 0, Time elapsed: 0.015 sec <<< FAILURE!
Running joptsimple.OptionalArgumentOptionSpecValuesImmutabilityTest
Tests run: 12, Failures: 0, Errors: 0, Skipped: 0, Time elapsed: 0.016 sec
Running joptsimple.AlternativeLongOptionSpecOptionsImmutabilityTest
Tests run: 12, Failures: 0, Errors: 0, Skipped: 0, Time elapsed: 0.016 sec
Running joptsimple.ShortOptionsOptionalArgumentTest
Tests run: 6, Failures: 0, Errors: 5, Skipped: 0, Time elapsed: 0.014 sec <<< FAILURE!
Running joptsimple.ValueConverterAdmitsSubclassesOfValueTypeTest
Tests run: 1, Failures: 0, Errors: 0, Skipped: 0, Time elapsed: 0.001 sec
Running joptsimple.PopulatedOptionSetTest
Tests run: 4, Failures: 0, Errors: 0, Skipped: 0, Time elapsed: 0.005 sec
Running joptsimple.ParsingSeparatedTypedOptionValuesTest
Tests run: 4, Failures: 0, Errors: 4, Skipped: 0, Time elapsed: 0.01 sec <<< FAILURE!
Running joptsimple.OptionSynonymNoArgumentTest
Tests run: 3, Failures: 0, Errors: 3, Skipped: 0, Time elapsed: 0.008 sec <<< FAILURE!
Running joptsimple.OptionParserOptionExceptionTest
Tests run: 5, Failures: 0, Errors: 1, Skipped: 0, Time elapsed: 0.008 sec <<< FAILURE!
Running joptsimple.ClusterVersusLongOptionWithOptionalArgumentTest
Tests run: 9, Failures: 0, Errors: 8, Skipped: 0, Time elapsed: 0.02 sec <<< FAILURE!
Running joptsimple.RequiredUnlessAnyTest
Tests run: 4, Failures: 0, Errors: 4, Skipped: 0, Time elapsed: 0.01 sec <<< FAILURE!
Running joptsimple.OptionParserNewDeclarationTest
Tests run: 16, Failures: 0, Errors: 13, Skipped: 0, Time elapsed: 0.038 sec <<< FAILURE!
Running joptsimple.RequiredArgumentOptionSpecEqualsHashCodeTest
Tests run: 10, Failures: 0, Errors: 0, Skipped: 0, Time elapsed: 0.011 sec
Running joptsimple.OptionSynonymCommonPrefixesTest
Tests run: 7, Failures: 0, Errors: 7, Skipped: 0, Time elapsed: 0.019 sec <<< FAILURE!
Running joptsimple.OptionalArgumentOptionSpecOptionsImmutabilityTest
Tests run: 12, Failures: 0, Errors: 0, Skipped: 0, Time elapsed: 0.014 sec
Running joptsimple.RequiredUnlessTest
Tests run: 8, Failures: 0, Errors: 4, Skipped: 0, Time elapsed: 0.036 sec <<< FAILURE!
Running joptsimple.ArgumentListTest
Tests run: 2, Failures: 0, Errors: 0, Skipped: 0, Time elapsed: 0 sec
Running joptsimple.NoArgumentOptionSpecTest
Tests run: 11, Failures: 0, Errors: 0, Skipped: 0, Time elapsed: 0.015 sec
Running joptsimple.RequiredArgumentOptionSpecValuesImmutabilityTest
Tests run: 12, Failures: 0, Errors: 0, Skipped: 0, Time elapsed: 0.018 sec
Running joptsimple.OptionParserTest
Tests run: 17, Failures: 0, Errors: 14, Skipped: 0, Time elapsed: 0.047 sec <<< FAILURE!
Running joptsimple.PlainOldOptionParserTest
Tests run: 1, Failures: 0, Errors: 1, Skipped: 0, Time elapsed: 0.001 sec <<< FAILURE!
Running joptsimple.OptionExceptionOptionsImmutabilityTest
Tests run: 12, Failures: 0, Errors: 0, Skipped: 0, Time elapsed: 0.019 sec
Running joptsimple.ParsingSeparatedStringOptionValuesTest
Tests run: 6, Failures: 0, Errors: 6, Skipped: 0, Time elapsed: 0.019 sec <<< FAILURE!
Running joptsimple.OptionParserAlternateHelpFormatterTest
Tests run: 2, Failures: 0, Errors: 0, Skipped: 0, Time elapsed: 0.007 sec
Running joptsimple.InterleavedArgumentsTest
Tests run: 9, Failures: 0, Errors: 9, Skipped: 0, Time elapsed: 0.017 sec <<< FAILURE!
Running joptsimple.ClusterVersusLongOptionTest
Tests run: 5, Failures: 0, Errors: 5, Skipped: 0, Time elapsed: 0.01 sec <<< FAILURE!
Running joptsimple.OptionSynonymOptionalArgumentTest
Tests run: 4, Failures: 0, Errors: 4, Skipped: 0, Time elapsed: 0.007 sec <<< FAILURE!
Running joptsimple.OptionSynonymRequiredArgumentTest
Tests run: 4, Failures: 0, Errors: 4, Skipped: 0, Time elapsed: 0.009 sec <<< FAILURE!
Running joptsimple.internal.ObjectsUtilityClassTest
Tests run: 1, Failures: 0, Errors: 0, Skipped: 0, Time elapsed: 0.002 sec
Running joptsimple.internal.RowEqualsHashCodeTest
Tests run: 9, Failures: 0, Errors: 0, Skipped: 0, Time elapsed: 0.011 sec
Running joptsimple.internal.RowsTest
Tests run: 3, Failures: 0, Errors: 0, Skipped: 0, Time elapsed: 0.004 sec
Running joptsimple.internal.AbbreviationMapTest
Tests run: 22, Failures: 0, Errors: 0, Skipped: 0, Time elapsed: 0.024 sec
Running joptsimple.internal.AbbreviationMapToJavaUtilMapTest
Tests run: 12, Failures: 0, Errors: 0, Skipped: 0, Time elapsed: 0.011 sec
Running joptsimple.internal.ReflectionUtilityClassTest
Tests run: 1, Failures: 0, Errors: 0, Skipped: 0, Time elapsed: 0 sec
Running joptsimple.internal.ClassesUtilityClassTest
Tests run: 1, Failures: 0, Errors: 0, Skipped: 0, Time elapsed: 0.001 sec
Running joptsimple.internal.StringsUtilityClassTest
Tests run: 1, Failures: 0, Errors: 0, Skipped: 0, Time elapsed: 0.002 sec
Running joptsimple.internal.ReflectionTest
Tests run: 6, Failures: 0, Errors: 0, Skipped: 0, Time elapsed: 0.009 sec
Running joptsimple.OptionSetAsMapTest
Tests run: 1, Failures: 0, Errors: 1, Skipped: 0, Time elapsed: 0.002 sec <<< FAILURE!
Running joptsimple.NoArgumentOptionSpecOptionsImmutabilityTest
Tests run: 12, Failures: 0, Errors: 0, Skipped: 0, Time elapsed: 0.012 sec
Running joptsimple.LongOptionOptionalArgumentTest
Tests run: 3, Failures: 0, Errors: 3, Skipped: 0, Time elapsed: 0.007 sec <<< FAILURE!
Running joptsimple.ClusterVersusLongOptionWithRequiredArgumentTest
Tests run: 9, Failures: 0, Errors: 8, Skipped: 0, Time elapsed: 0.016 sec <<< FAILURE!
Running joptsimple.OptionalArgumentOptionSpecTest
Tests run: 11, Failures: 0, Errors: 0, Skipped: 0, Time elapsed: 0.011 sec
Running joptsimple.OptionSetValuesOfSpecImmutabilityTest
Tests run: 12, Failures: 0, Errors: 0, Skipped: 0, Time elapsed: 0.013 sec
Running joptsimple.OptionSpecTokenizerTest
Tests run: 17, Failures: 0, Errors: 0, Skipped: 0, Time elapsed: 0.02 sec
Running joptsimple.SingleHyphenTest
Tests run: 3, Failures: 0, Errors: 3, Skipped: 0, Time elapsed: 0.006 sec <<< FAILURE!
Running joptsimple.WExtensionNoArgumentTest
Tests run: 2, Failures: 0, Errors: 1, Skipped: 0, Time elapsed: 0.004 sec <<< FAILURE!
Running joptsimple.RequiredArgumentOptionSpecOptionsImmutabilityTest
Tests run: 12, Failures: 0, Errors: 0, Skipped: 0, Time elapsed: 0.014 sec
Running joptsimple.ParserRulesUtilityClassTest
Tests run: 1, Failures: 0, Errors: 0, Skipped: 0, Time elapsed: 0.002 sec
Running joptsimple.ConfigurableOptionParserHelpTest
Tests run: 27, Failures: 0, Errors: 0, Skipped: 0, Time elapsed: 0.057 sec
Running joptsimple.NonOptionArgumentSpecTest
Tests run: 7, Failures: 0, Errors: 5, Skipped: 0, Time elapsed: 0.013 sec <<< FAILURE!
Running joptsimple.OptionExceptionMessageTest
Tests run: 8, Failures: 0, Errors: 0, Skipped: 0, Time elapsed: 0.013 sec
Running joptsimple.LongOptionNoArgumentTest
Tests run: 4, Failures: 0, Errors: 3, Skipped: 0, Time elapsed: 0.009 sec <<< FAILURE!
Running joptsimple.ArgumentAcceptingOptionSpecDefaultValuesImmutabilityTest
Tests run: 12, Failures: 0, Errors: 0, Skipped: 0, Time elapsed: 0.015 sec
Running joptsimple.ParsingSeparatedConvertedOptionValuesTest
Tests run: 4, Failures: 0, Errors: 4, Skipped: 0, Time elapsed: 0.01 sec <<< FAILURE!
Running joptsimple.HandlingDefaultValuesForOptionArgumentsTest
Tests run: 9, Failures: 0, Errors: 8, Skipped: 0, Time elapsed: 0.024 sec <<< FAILURE!
Running joptsimple.ShortOptionsRequiredArgumentTest
Tests run: 9, Failures: 0, Errors: 7, Skipped: 0, Time elapsed: 0.021 sec <<< FAILURE!
Running joptsimple.CreateWithOptionSpecificationStringTest
Tests run: 1, Failures: 0, Errors: 1, Skipped: 0, Time elapsed: 0.002 sec <<< FAILURE!
Running joptsimple.EmptyOptionSetTest
Tests run: 8, Failures: 0, Errors: 0, Skipped: 0, Time elapsed: 0.009 sec
Running joptsimple.OptionParserArgumentExceptionTest
Tests run: 9, Failures: 0, Errors: 0, Skipped: 0, Time elapsed: 0.013 sec
Running joptsimple.RequiredIfTest
Tests run: 8, Failures: 0, Errors: 3, Skipped: 0, Time elapsed: 0.018 sec <<< FAILURE!
Running joptsimple.NoArgumentOptionSpecValuesImmutabilityTest
Tests run: 12, Failures: 0, Errors: 0, Skipped: 0, Time elapsed: 0.014 sec
Running joptsimple.WAsAbbreviationForLongOptionTest
Tests run: 2, Failures: 0, Errors: 1, Skipped: 0, Time elapsed: 0.005 sec <<< FAILURE!
Running joptsimple.OptionSynonymOverwritingTest
Tests run: 1, Failures: 0, Errors: 1, Skipped: 0, Time elapsed: 0.003 sec <<< FAILURE!
Running joptsimple.OptionParserRecognizedOptionsTest
Tests run: 2, Failures: 0, Errors: 0, Skipped: 0, Time elapsed: 0.004 sec
Running joptsimple.OptionSetNonOptionArgumentsImmutabilityTest
Tests run: 12, Failures: 0, Errors: 0, Skipped: 0, Time elapsed: 0.027 sec
Running joptsimple.OptionParserUnrecognizedOptionsAllowedTest
Tests run: 2, Failures: 0, Errors: 1, Skipped: 0, Time elapsed: 0.004 sec <<< FAILURE!
Running joptsimple.PosixlyCorrectOptionParserTest
Tests run: 2, Failures: 0, Errors: 2, Skipped: 0, Time elapsed: 0.006 sec <<< FAILURE!
Running joptsimple.examples.ShortOptionsWithArgumentPositioningTest
Tests run: 1, Failures: 0, Errors: 1, Skipped: 0, Time elapsed: 0.001 sec <<< FAILURE!
Running joptsimple.examples.OptionArgumentConverterTest
Tests run: 1, Failures: 0, Errors: 1, Skipped: 0, Time elapsed: 0.002 sec <<< FAILURE!
Running joptsimple.examples.RequiredOptionsTest
Tests run: 3, Failures: 0, Errors: 1, Skipped: 0, Time elapsed: 0.004 sec <<< FAILURE!
Running joptsimple.examples.DefaultValuesForOptionArgumentsTest
Tests run: 1, Failures: 0, Errors: 1, Skipped: 0, Time elapsed: 0.014 sec <<< FAILURE!
Running joptsimple.examples.OptionSynonymTest
Tests run: 1, Failures: 0, Errors: 1, Skipped: 0, Time elapsed: 0.002 sec <<< FAILURE!
Running joptsimple.examples.ShortOptionsWithArgumentsTest
Tests run: 1, Failures: 0, Errors: 1, Skipped: 0, Time elapsed: 0.001 sec <<< FAILURE!
Running joptsimple.examples.AlternativeLongOptionsTest
Tests run: 1, Failures: 0, Errors: 1, Skipped: 0, Time elapsed: 0.002 sec <<< FAILURE!
Running joptsimple.examples.LongOptionsWithArgumentPositioningTest
Tests run: 1, Failures: 0, Errors: 1, Skipped: 0, Time elapsed: 0.001 sec <<< FAILURE!
Running joptsimple.examples.PosixlyCorrectTest
Tests run: 1, Failures: 0, Errors: 1, Skipped: 0, Time elapsed: 0.002 sec <<< FAILURE!
Running joptsimple.examples.OptionArgumentValueTypeTest
Tests run: 1, Failures: 0, Errors: 1, Skipped: 0, Time elapsed: 0.001 sec <<< FAILURE!
Running joptsimple.examples.UnrecognizedOptionsAllowedTest
Tests run: 1, Failures: 0, Errors: 1, Skipped: 0, Time elapsed: 0 sec <<< FAILURE!
Running joptsimple.examples.LongOptionsTest
Tests run: 1, Failures: 0, Errors: 1, Skipped: 0, Time elapsed: 0.001 sec <<< FAILURE!
Running joptsimple.examples.ShortOptionsClusteringTest
Tests run: 1, Failures: 0, Errors: 1, Skipped: 0, Time elapsed: 0.001 sec <<< FAILURE!
Running joptsimple.examples.ShortOptionsClusteringWithArgumentTest
Tests run: 1, Failures: 0, Errors: 1, Skipped: 0, Time elapsed: 0.002 sec <<< FAILURE!
Running joptsimple.examples.SignallingEndOfOptionsTest
Tests run: 1, Failures: 0, Errors: 1, Skipped: 0, Time elapsed: 0.002 sec <<< FAILURE!
Running joptsimple.examples.MultipleDelimitedArgumentsTest
Tests run: 1, Failures: 0, Errors: 1, Skipped: 0, Time elapsed: 0.002 sec <<< FAILURE!
Running joptsimple.examples.SpecialOptionalArgumentHandlingTest
Tests run: 1, Failures: 0, Errors: 1, Skipped: 0, Time elapsed: 0.001 sec <<< FAILURE!
Running joptsimple.examples.ShortOptionsWithMultipleArgumentsForSingleOptionTest
Tests run: 1, Failures: 0, Errors: 1, Skipped: 0, Time elapsed: 0.002 sec <<< FAILURE!
Running joptsimple.examples.ShortOptionsTest
Tests run: 1, Failures: 0, Errors: 0, Skipped: 0, Time elapsed: 0.001 sec
Running joptsimple.examples.LongOptionsWithArgumentsTest
Tests run: 1, Failures: 0, Errors: 1, Skipped: 0, Time elapsed: 0.001 sec <<< FAILURE!
Running joptsimple.examples.ExportOptionsTest
Tests run: 1, Failures: 0, Errors: 1, Skipped: 0, Time elapsed: 0.001 sec <<< FAILURE!
Running joptsimple.examples.TypesafeOptionArgumentRetrievalTest
Tests run: 1, Failures: 0, Errors: 1, Skipped: 0, Time elapsed: 0.003 sec <<< FAILURE!
Running joptsimple.TypesafeOptionArgumentRetrievalTest
Tests run: 22, Failures: 0, Errors: 21, Skipped: 0, Time elapsed: 0.034 sec <<< FAILURE!
Running joptsimple.OptionSetEqualsHashCodeTest
Tests run: 9, Failures: 0, Errors: 0, Skipped: 0, Time elapsed: 0 sec

Results :

Tests in error: 
  parsingJVMSystemPropertiesArguments(joptsimple.JVMSystemPropertiesArgumentParsingTest): Missing required option(s) []
  wIsLegal(joptsimple.WAsShortOptionTest): Missing required option(s) []
  acceptsCommandLineWithConditionallyRequiredOptionsPresent(joptsimple.RequiredIfAnyTest): Missing required option(s) []
  acceptsOptionWithPrerequisiteAsNormalIfPrerequisiteNotInPlay(joptsimple.RequiredIfAnyTest): Missing required option(s) []
  oxfPermutationWithFollowingArg(joptsimple.ClusterWhereManyOptionsAcceptArgumentsTest): Missing required option(s) []
  ofxPermutationWithFollowingArg(joptsimple.ClusterWhereManyOptionsAcceptArgumentsTest): Missing required option(s) []
  ofxPermutation(joptsimple.ClusterWhereManyOptionsAcceptArgumentsTest): Missing required option(s) []
  oxfPermutation(joptsimple.ClusterWhereManyOptionsAcceptArgumentsTest): Missing required option(s) []
  fxoPermutationWithFollowingArg(joptsimple.ClusterWhereManyOptionsAcceptArgumentsTest): Missing required option(s) []
  foxPermutationWithFollowingArg(joptsimple.ClusterWhereManyOptionsAcceptArgumentsTest): Missing required option(s) []
  foxPermutation(joptsimple.ClusterWhereManyOptionsAcceptArgumentsTest): Missing required option(s) []
  xofPermutationWithFollowingArg(joptsimple.ClusterWhereManyOptionsAcceptArgumentsTest): Missing required option(s) []
  xfoPermutationWithFollowingArg(joptsimple.ClusterWhereManyOptionsAcceptArgumentsTest): Missing required option(s) []
  fxoPermutation(joptsimple.ClusterWhereManyOptionsAcceptArgumentsTest): Missing required option(s) []
  xfoPermutation(joptsimple.ClusterWhereManyOptionsAcceptArgumentsTest): Missing required option(s) []
  xofPermutation(joptsimple.ClusterWhereManyOptionsAcceptArgumentsTest): Missing required option(s) []
  separateArgument(joptsimple.WExtensionWithArgumentTest): Missing required option(s) []
  typedTogetherArg(joptsimple.WExtensionWithArgumentTest): Missing required option(s) []
  typedSeparateArg(joptsimple.WExtensionWithArgumentTest): Missing required option(s) []
  abbreviationWithTogetherArgument(joptsimple.WExtensionWithArgumentTest): Missing required option(s) []
  togetherArgument(joptsimple.WExtensionWithArgumentTest): Missing required option(s) []
  allowsDotAsShortOption(joptsimple.PunctuationInShortOptionTest): Missing required option(s) []
  allowsUnderscoreAsShortOption(joptsimple.PunctuationInShortOptionTest): Missing required option(s) []
  allowsQuestionMarkAsShortOption(joptsimple.PunctuationInShortOptionTest): Missing required option(s) []
  allowsDotInOptionNames(joptsimple.PunctuationInLongOptionTest): Missing required option(s) []
  allowsHyphensPrettyMuchAnywhereButTheFront(joptsimple.PunctuationInLongOptionTest): Missing required option(s) []
  allowsUnderscoreInOptionNames(joptsimple.PunctuationInLongOptionTest): Missing required option(s) []
  allowsQuestionMarkInOptionNames(joptsimple.PunctuationInLongOptionTest): Missing required option(s) []
  allowsHyphensInTheMiddleOfOptionNames(joptsimple.PunctuationInLongOptionTest): Missing required option(s) []
  argumentSeparate(joptsimple.LongOptionRequiredArgumentTest): Missing required option(s) []
  argumentFollowedByLegalOption(joptsimple.LongOptionRequiredArgumentTest): Missing required option(s) []
  argumentTogether(joptsimple.LongOptionRequiredArgumentTest): Missing required option(s) []
  shortOptionSpecifiedAsLongOptionWithArgument(joptsimple.LongOptionRequiredArgumentTest): Missing required option(s) []
  whenEndOfOptionsMarkerIsInPlaceOfRequiredArgument(joptsimple.LongOptionRequiredArgumentTest): Missing required option(s) []
  givesSpecsInOrderOfCommandLinePresentation(joptsimple.OptionSetDetectedOptionsTest): Missing required option(s) []
  clusteredOptions(joptsimple.ShortOptionsNoArgumentTest): Missing required option(s) []
  optionsTerminator(joptsimple.ShortOptionsNoArgumentTest): Missing required option(s) []
  singleOptionWithOneNonOptionArgument(joptsimple.ShortOptionsNoArgumentTest): Missing required option(s) []
  twoSingleOptions(joptsimple.ShortOptionsNoArgumentTest): Missing required option(s) []
  singleOption(joptsimple.ShortOptionsNoArgumentTest): Missing required option(s) []
  appearingMultipleTimes(joptsimple.ShortOptionsNoArgumentTest): Missing required option(s) []
  optionWithOptionalArgumentFollowedByLegalOption(joptsimple.ShortOptionsOptionalArgumentTest): Missing required option(s) []
  multipleOfSameOptionSomeWithArgsAndSomeWithout(joptsimple.ShortOptionsOptionalArgumentTest): Missing required option(s) []
  optionWithOptionalArgumentPresent(joptsimple.ShortOptionsOptionalArgumentTest): Missing required option(s) []
  optionWithOptionalArgumentNotPresent(joptsimple.ShortOptionsOptionalArgumentTest): Missing required option(s) []
  optionWithOptionalArgumentThatLooksLikeAValidOption(joptsimple.ShortOptionsOptionalArgumentTest): Missing required option(s) []
  parsesSeparatedValuesWhenArgumentAbuttedWithEquals(joptsimple.ParsingSeparatedTypedOptionValuesTest): Missing required option(s) []
  parsesSeparatedValuesAbutting(joptsimple.ParsingSeparatedTypedOptionValuesTest): Missing required option(s) []
  parsesEqualsSeparatedValuesWhenArgumentAbuttedWithEquals(joptsimple.ParsingSeparatedTypedOptionValuesTest): Missing required option(s) []
  parsesSeparatedValuesAsSeparateArgument(joptsimple.ParsingSeparatedTypedOptionValuesTest): Missing required option(s) []
  hasAllSynonymsWhenSecondSynonymParsed(joptsimple.OptionSynonymNoArgumentTest): Missing required option(s) []
  hasAllSynonymsWhenFirstSynonymParsed(joptsimple.OptionSynonymNoArgumentTest): Missing required option(s) []
  hasAllSynonymsWhenThirdSynonymParsed(joptsimple.OptionSynonymNoArgumentTest): Missing required option(s) []
  valueOfWhenMultiples(joptsimple.OptionParserOptionExceptionTest): Missing required option(s) []
  resolvesToLongOptionEvenWithMatchingShortOptions(joptsimple.ClusterVersusLongOptionWithOptionalArgumentTest): Missing required option(s) []
  resolvesShortOptionToShortOption(joptsimple.ClusterVersusLongOptionWithOptionalArgumentTest): Missing required option(s) []
  shortOptionsInDifferentOrder(joptsimple.ClusterVersusLongOptionWithOptionalArgumentTest): Missing required option(s) []
  resolvesToLongOptionWithSingleDashEvenWithMatchingShortOptions(joptsimple.ClusterVersusLongOptionWithOptionalArgumentTest): Missing required option(s) []
  withArgumentComingAfterCluster(joptsimple.ClusterVersusLongOptionWithOptionalArgumentTest): Missing required option(s) []
  resolvesAbbreviationToLongOption(joptsimple.ClusterVersusLongOptionWithOptionalArgumentTest): Missing required option(s) []
  resolvesShortOptionToShortOptionEvenWithDoubleHyphen(joptsimple.ClusterVersusLongOptionWithOptionalArgumentTest): Missing required option(s) []
  resolvesToShortOptionsWithArgumentFollowingX(joptsimple.ClusterVersusLongOptionWithOptionalArgumentTest): Missing required option(s) []
  commandLineMissingConditionallyRequiredOption(joptsimple.RequiredUnlessAnyTest): Missing required option(s) []
  acceptsCommandLineWithConditionallyRequiredOptionsPresent(joptsimple.RequiredUnlessAnyTest): Missing required option(s) []
  acceptsOptionWithPrerequisiteAsNormalIfPrerequisiteNotInPlay(joptsimple.RequiredUnlessAnyTest): Missing required option(s) []
  commandLineWithNotAllConditionallyRequiredOptionsPresent(joptsimple.RequiredUnlessAnyTest): Missing required option(s) []
  optionsWithOptionalNegativeNumberArgumentsAndNumberOptions(joptsimple.OptionParserNewDeclarationTest): Missing required option(s) []
  shortArgumentType(joptsimple.OptionParserNewDeclarationTest): Missing required option(s) []
  sqlDateArgumentType(joptsimple.OptionParserNewDeclarationTest): Missing required option(s) []
  booleanArgumentType(joptsimple.OptionParserNewDeclarationTest): Missing required option(s) []
  doubleArgumentType(joptsimple.OptionParserNewDeclarationTest): Missing required option(s) []
  integerArgumentType(joptsimple.OptionParserNewDeclarationTest): Missing required option(s) []
  floatArgumentType(joptsimple.OptionParserNewDeclarationTest): Missing required option(s) []
  sqlTimestampArgumentType(joptsimple.OptionParserNewDeclarationTest): Missing required option(s) []
  optionsWithNegativeNumberArgumentsAndNonNumberOptions(joptsimple.OptionParserNewDeclarationTest): Missing required option(s) []
  optionsWithOptionalNegativeNumberArguments(joptsimple.OptionParserNewDeclarationTest): Missing required option(s) []
  longArgumentType(joptsimple.OptionParserNewDeclarationTest): Missing required option(s) []
  byteArgumentType(joptsimple.OptionParserNewDeclarationTest): Missing required option(s) []
  sqlTimeArgumentType(joptsimple.OptionParserNewDeclarationTest): Missing required option(s) []
  parsingSixthPrefix(joptsimple.OptionSynonymCommonPrefixesTest): Missing required option(s) []
  parsingFifthPrefix(joptsimple.OptionSynonymCommonPrefixesTest): Missing required option(s) []
  parsingFirstPrefix(joptsimple.OptionSynonymCommonPrefixesTest): Missing required option(s) []
  parsingThirdPrefix(joptsimple.OptionSynonymCommonPrefixesTest): Missing required option(s) []
  parsingFourthPrefix(joptsimple.OptionSynonymCommonPrefixesTest): Missing required option(s) []
  parsingSeventhPrefix(joptsimple.OptionSynonymCommonPrefixesTest): Missing required option(s) []
  parsingSecondPrefix(joptsimple.OptionSynonymCommonPrefixesTest): Missing required option(s) []
  acceptsOptionWithPrerequisiteAsNormal(joptsimple.RequiredUnlessTest): Missing required option(s) []
  presenceOfHelpOptionNegatesRequiredUnlessness(joptsimple.RequiredUnlessTest): Missing required option(s) [userid/username, password/pwd]
  acceptsCommandLineWithConditionallyRequiredOptionsPresent(joptsimple.RequiredUnlessTest): Missing required option(s) []
  acceptsOptionWithPrerequisite(joptsimple.RequiredUnlessTest): Missing required option(s) []
  allowsWhitespaceyStringAsArgumentOfOption(joptsimple.OptionParserTest): Missing required option(s) []
  typedArguments(joptsimple.OptionParserTest): Missing required option(s) []
  allowsEmbeddedWhitespaceInArgumentOfOption(joptsimple.OptionParserTest): Missing required option(s) []
  resetHappensAfterParsing(joptsimple.OptionParserTest): Missing required option(s) []
  shortOptionSpecifiedAsLongOptionWithoutArgument(joptsimple.OptionParserTest): Missing required option(s) []
  longOptionLeadsWithSingleDashAmbiguousButShortsAreLegal(joptsimple.OptionParserTest): Missing required option(s) []
  allowsEmptyStringAsArgumentOfOption(joptsimple.OptionParserTest): Missing required option(s) []
  disallowsMixingOfOptionsAndNonOptionsUnderPosixlyCorrect(joptsimple.OptionParserTest): Missing required option(s) []
  longOptionLeadsWithSingleDashAmbiguousButAShortAcceptsAnArgument(joptsimple.OptionParserTest): Missing required option(s) []
  longOptionLeadsWithSingleDash(joptsimple.OptionParserTest): Missing required option(s) []
  optionsAndNonOptionsInterspersed(joptsimple.OptionParserTest): Missing required option(s) []
  doubleHyphenSignalsEndsOfOptions(joptsimple.OptionParserTest): Missing required option(s) []
  allowsMixingOfOptionsAndNonOptions(joptsimple.OptionParserTest): Missing required option(s) []
  requiredOptionButHelpOptionPresent(joptsimple.OptionParserTest): Missing required option(s) [t]
  nonOptionsOnly(joptsimple.PlainOldOptionParserTest): Missing required option(s) []
  handlesConsecutiveDelimiters(joptsimple.ParsingSeparatedStringOptionValuesTest): Missing required option(s) []
  parsesSeparatedValuesWhenArgumentAbuttedWithEquals(joptsimple.ParsingSeparatedStringOptionValuesTest): Missing required option(s) []
  parsesHyphenSeparatedValuesAbutting(joptsimple.ParsingSeparatedStringOptionValuesTest): Missing required option(s) []
  parsesSeparatedValuesAbutting(joptsimple.ParsingSeparatedStringOptionValuesTest): Missing required option(s) []
  parsesEqualsSeparatedValuesWhenArgumentAbuttedWithEquals(joptsimple.ParsingSeparatedStringOptionValuesTest): Missing required option(s) []
  parsesSeparatedValuesAsSeparateArgument(joptsimple.ParsingSeparatedStringOptionValuesTest): Missing required option(s) []
  optionalAbuttedArgumentVersusPosixlyCorrect(joptsimple.InterleavedArgumentsTest): Missing required option(s) []
  leadingNonOptionCausesPosixlyCorrectToIgnoreRemainder(joptsimple.InterleavedArgumentsTest): Missing required option(s) []
  optionalArgumentAndPosixlyCorrect(joptsimple.InterleavedArgumentsTest): Missing required option(s) []
  requiredArgumentAndPosixlyCorrect(joptsimple.InterleavedArgumentsTest): Missing required option(s) []
  requiredArgument(joptsimple.InterleavedArgumentsTest): Missing required option(s) []
  optionalKeyValuePairArgumentVersusPosixlyCorrect(joptsimple.InterleavedArgumentsTest): Missing required option(s) []
  onlyAppearingToHaveOptionArgumentsButPosixlyCorrect(joptsimple.InterleavedArgumentsTest): Missing required option(s) []
  optionalArgument(joptsimple.InterleavedArgumentsTest): Missing required option(s) []
  onlyAppearingToHaveOptionArguments(joptsimple.InterleavedArgumentsTest): Missing required option(s) []
  resolvesToLongOptionEvenWithMatchingShortOptions(joptsimple.ClusterVersusLongOptionTest): Missing required option(s) []
  resolvesShortOptionToShortOption(joptsimple.ClusterVersusLongOptionTest): Missing required option(s) []
  resolvesToLongOptionWithSingleDashEvenWithMatchingShortOptions(joptsimple.ClusterVersusLongOptionTest): Missing required option(s) []
  resolvesAbbreviationToLongOption(joptsimple.ClusterVersusLongOptionTest): Missing required option(s) []
  resolvesShortOptionToShortOptionEvenWithDoubleHyphen(joptsimple.ClusterVersusLongOptionTest): Missing required option(s) []
  hasAllSynonymsWhenSecondSynonymParsed(joptsimple.OptionSynonymOptionalArgumentTest): Missing required option(s) []
  hasAllSynonymsWhenFirstSynonymParsed(joptsimple.OptionSynonymOptionalArgumentTest): Missing required option(s) []
  hasAllSynonymsWhenThirdSynonymParsed(joptsimple.OptionSynonymOptionalArgumentTest): Missing required option(s) []
  reportsSameListOfArgumentsForEverySynonymOption(joptsimple.OptionSynonymOptionalArgumentTest): Missing required option(s) []
  hasAllSynonymsWhenSecondSynonymParsed(joptsimple.OptionSynonymRequiredArgumentTest): Missing required option(s) []
  hasAllSynonymsWhenFirstSynonymParsed(joptsimple.OptionSynonymRequiredArgumentTest): Missing required option(s) []
  hasAllSynonymsWhenThirdSynonymParsed(joptsimple.OptionSynonymRequiredArgumentTest): Missing required option(s) []
  reportsSameListOfArgumentsForEverySynonymOption(joptsimple.OptionSynonymRequiredArgumentTest): Missing required option(s) []
  gives(joptsimple.OptionSetAsMapTest): Missing required option(s) []
  argumentSeparate(joptsimple.LongOptionOptionalArgumentTest): Missing required option(s) []
  argumentTogether(joptsimple.LongOptionOptionalArgumentTest): Missing required option(s) []
  argumentMissingTrailedByAnotherOption(joptsimple.LongOptionOptionalArgumentTest): Missing required option(s) []
  resolvesToLongOptionEvenWithMatchingShortOptions(joptsimple.ClusterVersusLongOptionWithRequiredArgumentTest): Missing required option(s) []
  resolvesShortOptionToShortOption(joptsimple.ClusterVersusLongOptionWithRequiredArgumentTest): Missing required option(s) []
  shortOptionsInDifferentOrder(joptsimple.ClusterVersusLongOptionWithRequiredArgumentTest): Missing required option(s) []
  resolvesToLongOptionWithSingleDashEvenWithMatchingShortOptions(joptsimple.ClusterVersusLongOptionWithRequiredArgumentTest): Missing required option(s) []
  withArgumentComingAfterCluster(joptsimple.ClusterVersusLongOptionWithRequiredArgumentTest): Missing required option(s) []
  resolvesAbbreviationToLongOption(joptsimple.ClusterVersusLongOptionWithRequiredArgumentTest): Missing required option(s) []
  resolvesShortOptionToShortOptionEvenWithDoubleHyphen(joptsimple.ClusterVersusLongOptionWithRequiredArgumentTest): Missing required option(s) []
  resolvesToShortOptionsWithArgumentFollowingX(joptsimple.ClusterVersusLongOptionWithRequiredArgumentTest): Missing required option(s) []
  asArgumentOfOption(joptsimple.SingleHyphenTest): Missing required option(s) []
  asArgumentOfOptionInSameToken(joptsimple.SingleHyphenTest): Missing required option(s) []
  singleHyphen(joptsimple.SingleHyphenTest): Missing required option(s) []
  wExtensionWithLongOptionWithoutAnArgument(joptsimple.WExtensionNoArgumentTest): Missing required option(s) []
  allowsDescriptionOfNonOptionArguments(joptsimple.NonOptionArgumentSpecTest): Missing required option(s) []
  allowsArgumentDescriptionForNonOptionArguments(joptsimple.NonOptionArgumentSpecTest): Missing required option(s) []
  convertingUsingConverter(joptsimple.NonOptionArgumentSpecTest): Missing required option(s) []
  allowsTypeAndDescriptionOfNonOptionArguments(joptsimple.NonOptionArgumentSpecTest): Missing required option(s) []
  allowsTypingOfNonOptionArguments(joptsimple.NonOptionArgumentSpecTest): Missing required option(s) []
  abbreviationIsALegalOption(joptsimple.LongOptionNoArgumentTest): Missing required option(s) []
  singleLongOptionAbbreviated(joptsimple.LongOptionNoArgumentTest): Missing required option(s) []
  singleLongOption(joptsimple.LongOptionNoArgumentTest): Missing required option(s) []
  parsesSeparatedValuesWhenArgumentAbuttedWithEquals(joptsimple.ParsingSeparatedConvertedOptionValuesTest): Missing required option(s) []
  parsesSeparatedValuesAbutting(joptsimple.ParsingSeparatedConvertedOptionValuesTest): Missing required option(s) []
  parsesEqualsSeparatedValuesWhenArgumentAbuttedWithEquals(joptsimple.ParsingSeparatedConvertedOptionValuesTest): Missing required option(s) []
  parsesSeparatedValuesAsSeparateArgument(joptsimple.ParsingSeparatedConvertedOptionValuesTest): Missing required option(s) []
  optionalArgOptionWithDefaultGivesDefaultIfOptionNotOnCommandLine(joptsimple.HandlingDefaultValuesForOptionArgumentsTest): Missing required option(s) []
  withCompileTimeArraySpecifyingDefaults(joptsimple.HandlingDefaultValuesForOptionArgumentsTest): Missing required option(s) []
  optionalArgOptionWithDefaultGivesArgIfSpecifiedOnCommandLine(joptsimple.HandlingDefaultValuesForOptionArgumentsTest): Missing required option(s) []
  optionalArgOptionWithDefaultGivesDefaultIfArgNotSpecifiedOnCommandLine(joptsimple.HandlingDefaultValuesForOptionArgumentsTest): Missing required option(s) []
  requiredArgOptionWithDefaultGivesDefaultIfOptionNotOnCommandLine(joptsimple.HandlingDefaultValuesForOptionArgumentsTest): Missing required option(s) []
  specifiedOptionArgumentsTrumpsListOfDefaults(joptsimple.HandlingDefaultValuesForOptionArgumentsTest): Missing required option(s) []
  requiredArgOptionWithDefaultGivesArgIfArgSpecifiedOnCommandLine(joptsimple.HandlingDefaultValuesForOptionArgumentsTest): Missing required option(s) []
  allowsListOfDefaults(joptsimple.HandlingDefaultValuesForOptionArgumentsTest): Missing required option(s) []
  clusteredOptionsWithOneAcceptingAnArgument(joptsimple.ShortOptionsRequiredArgumentTest): Missing required option(s) []
  inSameToken(joptsimple.ShortOptionsRequiredArgumentTest): Missing required option(s) []
  clusteredOptionsWithLastOneAcceptingAnArgument(joptsimple.ShortOptionsRequiredArgumentTest): Missing required option(s) []
  argumentNotPresentFollowedByAnotherOption(joptsimple.ShortOptionsRequiredArgumentTest): Missing required option(s) []
  withArgument(joptsimple.ShortOptionsRequiredArgumentTest): Missing required option(s) []
  appearingMultipleTimes(joptsimple.ShortOptionsRequiredArgumentTest): Missing required option(s) []
  whenEndOfOptionsMarkerIsInPlaceOfRequiredArgument(joptsimple.ShortOptionsRequiredArgumentTest): Missing required option(s) []
  createsParserWithOptionSpecificationString(joptsimple.CreateWithOptionSpecificationStringTest): Missing required option(s) []
  acceptsCommandLineWithConditionallyRequiredOptionsPresent(joptsimple.RequiredIfTest): Missing required option(s) []
  acceptsOptionWithPrerequisiteAsNormalIfPrerequisiteNotInPlay(joptsimple.RequiredIfTest): Missing required option(s) []
  presenceOfHelpOptionNegatesRequiredIfness(joptsimple.RequiredIfTest): Missing required option(s) [userid/username, password/pwd]
  abbreviation(joptsimple.WAsAbbreviationForLongOptionTest): Missing required option(s) []
  treatsHAsThoughItWereLastDefinedSynonymOfH(joptsimple.OptionSynonymOverwritingTest): Missing required option(s) []
  unrecognizedOptionAllowed(joptsimple.OptionParserUnrecognizedOptionsAllowedTest): Missing required option(s) []
  parseWithPosixlyCorrect[0](joptsimple.PosixlyCorrectOptionParserTest): Missing required option(s) []
  parseWithPosixlyCorrect[1](joptsimple.PosixlyCorrectOptionParserTest): Missing required option(s) []
  allowsDifferentFormsOfPairingArgumentWithOption(joptsimple.examples.ShortOptionsWithArgumentPositioningTest): Missing required option(s) []
  usesConvertersOnOptionArgumentsWhenTold(joptsimple.examples.OptionArgumentConverterTest): Missing required option(s) []
  aHelpOptionMeansRequiredOptionsNeedNotBePresent(joptsimple.examples.RequiredOptionsTest): Missing required option(s) [password, userid]
  allowsSpecificationOfDefaultValues(joptsimple.examples.DefaultValuesForOptionArgumentsTest): Missing required option(s) []
  supportsOptionSynonyms(joptsimple.examples.OptionSynonymTest): Missing required option(s) []
  allowsOptionsToAcceptArguments(joptsimple.examples.ShortOptionsWithArgumentsTest): Missing required option(s) []
  handlesAlternativeLongOptions(joptsimple.examples.AlternativeLongOptionsTest): Missing required option(s) []
  allowsDifferentFormsOfPairingArgumentWithOption(joptsimple.examples.LongOptionsWithArgumentPositioningTest): Missing required option(s) []
  supportsPosixlyCorrectBehavior(joptsimple.examples.PosixlyCorrectTest): Missing required option(s) []
  convertsArgumentsToJavaValueTypes(joptsimple.examples.OptionArgumentValueTypeTest): Missing required option(s) []
  acceptsLongOptions(joptsimple.examples.UnrecognizedOptionsAllowedTest): Missing required option(s) []
  acceptsLongOptions(joptsimple.examples.LongOptionsTest): Missing required option(s) []
  allowsClusteringShortOptions(joptsimple.examples.ShortOptionsClusteringTest): Missing required option(s) []
  allowsClusteringShortOptionsThatAcceptArguments(joptsimple.examples.ShortOptionsClusteringWithArgumentTest): Missing required option(s) []
  doubleHyphenSignalsEndOfOptions(joptsimple.examples.SignallingEndOfOptionsTest): Missing required option(s) []
  supportsMultipleDelimitedArguments(joptsimple.examples.MultipleDelimitedArgumentsTest): Missing required option(s) []
  handlesNegativeNumberOptionalArguments(joptsimple.examples.SpecialOptionalArgumentHandlingTest): Missing required option(s) []
  allowsMultipleValuesForAnOption(joptsimple.examples.ShortOptionsWithMultipleArgumentsForSingleOptionTest): Missing required option(s) []
  supportsLongOptionsWithArgumentsAndAbbreviations(joptsimple.examples.LongOptionsWithArgumentsTest): Missing required option(s) []
  allowsExportOfOptions(joptsimple.examples.ExportOptionsTest): Missing required option(s) []
  allowsTypesafeRetrievalOfOptionArguments(joptsimple.examples.TypesafeOptionArgumentRetrievalTest): Missing required option(s) []
  primitiveIntAllowedAsTypeSpecifier(joptsimple.TypesafeOptionArgumentRetrievalTest): Missing required option(s) []
  retrievalOfTypedOptionalArgumentsInATypesafeManner(joptsimple.TypesafeOptionArgumentRetrievalTest): Missing required option(s) []
  retrievalOfUntypedRequiredArgumentsInATypesafeManner(joptsimple.TypesafeOptionArgumentRetrievalTest): Missing required option(s) []
  canSubvertTypeSafetyIfYouUseAnOptionSpecAsTheWrongType(joptsimple.TypesafeOptionArgumentRetrievalTest): Unexpected exception, expected<java.lang.ClassCastException> but was<joptsimple.MissingRequiredOptionsException>
  wrapsValueConversionExceptionsRaisedByConverter(joptsimple.TypesafeOptionArgumentRetrievalTest): Missing required option(s) []
  cannotFoolValuesOfWithAnOptionNotIssuedFromBuilder(joptsimple.TypesafeOptionArgumentRetrievalTest): Missing required option(s) []
  primitiveLongAllowedAsTypeSpecifier(joptsimple.TypesafeOptionArgumentRetrievalTest): Missing required option(s) []
  canSubvertTypeSafetyIfYouGiveAnOptionSpecToOptionSetAsTheWrongType(joptsimple.TypesafeOptionArgumentRetrievalTest): Unexpected exception, expected<java.lang.ClassCastException> but was<joptsimple.MissingRequiredOptionsException>
  retrievalOfTypedRequiredArgumentsInATypesafeManner(joptsimple.TypesafeOptionArgumentRetrievalTest): Missing required option(s) []
  primitiveShortAllowedAsTypeSpecifier(joptsimple.TypesafeOptionArgumentRetrievalTest): Missing required option(s) []
  cannotFoolHasWithAnOptionNotIssuedFromBuilder(joptsimple.TypesafeOptionArgumentRetrievalTest): Missing required option(s) []
  usesConverterIfProvided(joptsimple.TypesafeOptionArgumentRetrievalTest): Missing required option(s) []
  cannotFoolHasArgumentWithAnOptionNotIssuedFromBuilder(joptsimple.TypesafeOptionArgumentRetrievalTest): Missing required option(s) []
  cannotFoolValueOfWithAnOptionNotIssuedFromBuilder(joptsimple.TypesafeOptionArgumentRetrievalTest): Missing required option(s) []
  primitiveByteAllowedAsTypeSpecifier(joptsimple.TypesafeOptionArgumentRetrievalTest): Missing required option(s) []
  retrievalWithVoidOption(joptsimple.TypesafeOptionArgumentRetrievalTest): Missing required option(s) []
  retrievalOfUntypedOptionalArgumentsInATypesafeManner(joptsimple.TypesafeOptionArgumentRetrievalTest): Missing required option(s) []
  primitiveFloatAllowedAsTypeSpecifier(joptsimple.TypesafeOptionArgumentRetrievalTest): Missing required option(s) []
  primitiveBooleanAllowedAsTypeSpecifier(joptsimple.TypesafeOptionArgumentRetrievalTest): Missing required option(s) []
  primitiveDoubleAllowedAsTypeSpecifier(joptsimple.TypesafeOptionArgumentRetrievalTest): Missing required option(s) []
  canUseBooleanType(joptsimple.TypesafeOptionArgumentRetrievalTest): Missing required option(s) []

Tests run: 745, Failures: 0, Errors: 227, Skipped: 0

[INFO] ------------------------------------------------------------------------
[INFO] BUILD FAILURE
[INFO] ------------------------------------------------------------------------
[INFO] Total time: 7.971s
[INFO] Finished at: Sun Aug 02 00:03:05 BST 2015
[INFO] Final Memory: 20M/289M
[INFO] ------------------------------------------------------------------------
[ERROR] Failed to execute goal org.apache.maven.plugins:maven-surefire-plugin:2.10:test (default-test) on project jopt-simple: There are test failures.
[ERROR] 
[ERROR] Please refer to /home/perham/Study/LittleDarwin/Cases/jopt-simple-4.8/target/surefire-reports for the individual test results.
[ERROR] -> [Help 1]
[ERROR] 
[ERROR] To see the full stack trace of the errors, re-run Maven with the -e switch.
[ERROR] Re-run Maven using the -X switch to enable full debug logging.
[ERROR] 
[ERROR] For more information about the errors and possible solutions, please read the following articles:
[ERROR] [Help 1] http://cwiki.apache.org/confluence/display/MAVEN/MojoFailureException
