[INFO] Scanning for projects...
[INFO]                                                                         
[INFO] ------------------------------------------------------------------------
[INFO] Building JOpt Simple 4.8
[INFO] ------------------------------------------------------------------------
[WARNING] The POM for com.googlecode.jmockit:jmockit:jar:1.6 is invalid, transitive dependencies (if any) will not be available, enable debug logging for more details
[INFO] 
[INFO] --- maven-enforcer-plugin:1.0:enforce (enforce-maven) @ jopt-simple ---
[INFO] 
[INFO] --- maven-resources-plugin:2.3:resources (default-resources) @ jopt-simple ---
[INFO] Using 'UTF-8' encoding to copy filtered resources.
[INFO] Copying 1 resource
[INFO] 
[INFO] --- maven-compiler-plugin:3.1:compile (default-compile) @ jopt-simple ---
[INFO] Changes detected - recompiling the module!
[INFO] Compiling 44 source files to /home/perham/Study/LittleDarwin/Cases/jopt-simple-4.8/target/classes
[WARNING] /home/perham/Study/LittleDarwin/Cases/jopt-simple-4.8/src/main/java/joptsimple/OptionMissingRequiredArgumentException.java: /home/perham/Study/LittleDarwin/Cases/jopt-simple-4.8/src/main/java/joptsimple/OptionMissingRequiredArgumentException.java uses unchecked or unsafe operations.
[WARNING] /home/perham/Study/LittleDarwin/Cases/jopt-simple-4.8/src/main/java/joptsimple/OptionMissingRequiredArgumentException.java: Recompile with -Xlint:unchecked for details.
[INFO] 
[INFO] >>> maven-pmd-plugin:3.2:cpd-check (default) @ jopt-simple >>>
[INFO] 
[INFO] --- maven-pmd-plugin:3.2:cpd (cpd) @ jopt-simple ---
[WARNING] Unable to locate Source XRef to link to - DISABLED
[INFO] 
[INFO] <<< maven-pmd-plugin:3.2:cpd-check (default) @ jopt-simple <<<
[INFO] 
[INFO] --- maven-pmd-plugin:3.2:cpd-check (default) @ jopt-simple ---
[INFO] 
[INFO] 
[INFO] --- animal-sniffer-maven-plugin:1.11:check (check-signature) @ jopt-simple ---
[INFO] Checking unresolved references to org.codehaus.mojo.signature:java15:1.0
[INFO] 
[INFO] --- maven-resources-plugin:2.3:testResources (default-testResources) @ jopt-simple ---
[INFO] Using 'UTF-8' encoding to copy filtered resources.
[INFO] skip non existing resourceDirectory /home/perham/Study/LittleDarwin/Cases/jopt-simple-4.8/src/test/resources
[INFO] 
[INFO] --- maven-compiler-plugin:3.1:testCompile (default-testCompile) @ jopt-simple ---
[INFO] Nothing to compile - all classes are up to date
[INFO] 
[INFO] --- maven-surefire-plugin:2.10:test (default-test) @ jopt-simple ---
[INFO] Surefire report directory: /home/perham/Study/LittleDarwin/Cases/jopt-simple-4.8/target/surefire-reports

-------------------------------------------------------
 T E S T S
-------------------------------------------------------
Running joptsimple.OptionSpecBuilderOptionsImmutabilityTest
Tests run: 12, Failures: 0, Errors: 0, Skipped: 0, Time elapsed: 0.49 sec
Running joptsimple.JVMSystemPropertiesArgumentParsingTest
Tests run: 1, Failures: 1, Errors: 0, Skipped: 0, Time elapsed: 0.017 sec <<< FAILURE!
Running joptsimple.WAsShortOptionTest
Tests run: 2, Failures: 2, Errors: 0, Skipped: 0, Time elapsed: 0.013 sec <<< FAILURE!
Running joptsimple.OptionSetValuesOfOptionStringImmutabilityTest
Tests run: 12, Failures: 0, Errors: 0, Skipped: 0, Time elapsed: 0.018 sec
Running joptsimple.ArgumentListHasNoMoreArgsTest
Tests run: 3, Failures: 0, Errors: 0, Skipped: 0, Time elapsed: 0.005 sec
Running joptsimple.util.KeyValuePairUnequalValuesTest
Tests run: 8, Failures: 0, Errors: 0, Skipped: 0, Time elapsed: 0.007 sec
Running joptsimple.util.DateConverterTest
Tests run: 11, Failures: 0, Errors: 0, Skipped: 0, Time elapsed: 0.138 sec
Running joptsimple.util.KeyValuePairUnequalKeysTest
Tests run: 8, Failures: 0, Errors: 0, Skipped: 0, Time elapsed: 0.013 sec
Running joptsimple.util.InetAddressConverterTest
Tests run: 2, Failures: 0, Errors: 0, Skipped: 0, Time elapsed: 0.023 sec
Running joptsimple.util.KeyValuePairTest
Tests run: 7, Failures: 0, Errors: 0, Skipped: 0, Time elapsed: 0.011 sec
Running joptsimple.util.RegexMatcherTest
Tests run: 6, Failures: 0, Errors: 0, Skipped: 0, Time elapsed: 0.01 sec
Running joptsimple.OptionSetSpecsImmutabilityTest
Tests run: 12, Failures: 0, Errors: 0, Skipped: 0, Time elapsed: 0.016 sec
Running joptsimple.ArgumentAcceptingOptionSpecTest
Tests run: 16, Failures: 0, Errors: 0, Skipped: 0, Time elapsed: 0.021 sec
Running joptsimple.AlternativeLongOptionSpecValuesImmutabilityTest
Tests run: 12, Failures: 0, Errors: 0, Skipped: 0, Time elapsed: 0.012 sec
Running joptsimple.RequiredIfAnyTest
Tests run: 5, Failures: 5, Errors: 0, Skipped: 0, Time elapsed: 0.012 sec <<< FAILURE!
Running joptsimple.ClusterWhereManyOptionsAcceptArgumentsTest
Tests run: 12, Failures: 12, Errors: 0, Skipped: 0, Time elapsed: 0.021 sec <<< FAILURE!
Running joptsimple.OptionSpecsReportTheirOptionsSortedSpeciallyTest
Tests run: 1, Failures: 0, Errors: 0, Skipped: 0, Time elapsed: 0 sec
Running joptsimple.DefaultSettingsOptionParserHelpTest
Tests run: 39, Failures: 0, Errors: 0, Skipped: 0, Time elapsed: 0.082 sec
Running joptsimple.WExtensionWithArgumentTest
Tests run: 7, Failures: 7, Errors: 0, Skipped: 0, Time elapsed: 0.023 sec <<< FAILURE!
Running joptsimple.PunctuationInShortOptionTest
Tests run: 4, Failures: 3, Errors: 0, Skipped: 0, Time elapsed: 0.006 sec <<< FAILURE!
Running joptsimple.PunctuationInLongOptionTest
Tests run: 6, Failures: 5, Errors: 0, Skipped: 0, Time elapsed: 0.009 sec <<< FAILURE!
Running joptsimple.LongOptionRequiredArgumentTest
Tests run: 6, Failures: 6, Errors: 0, Skipped: 0, Time elapsed: 0.01 sec <<< FAILURE!
Running joptsimple.ToStringTest
Tests run: 3, Failures: 0, Errors: 0, Skipped: 0, Time elapsed: 0.008 sec
Running joptsimple.OptionSetDetectedOptionsTest
Tests run: 1, Failures: 1, Errors: 0, Skipped: 0, Time elapsed: 0.001 sec <<< FAILURE!
Running joptsimple.OptionSpecBuilderValuesImmutabilityTest
Tests run: 12, Failures: 0, Errors: 0, Skipped: 0, Time elapsed: 0.012 sec
Running joptsimple.ShortOptionsNoArgumentTest
Tests run: 6, Failures: 6, Errors: 0, Skipped: 0, Time elapsed: 0.014 sec <<< FAILURE!
Running joptsimple.OptionalArgumentOptionSpecValuesImmutabilityTest
Tests run: 12, Failures: 0, Errors: 0, Skipped: 0, Time elapsed: 0.011 sec
Running joptsimple.AlternativeLongOptionSpecOptionsImmutabilityTest
Tests run: 12, Failures: 0, Errors: 0, Skipped: 0, Time elapsed: 0.012 sec
Running joptsimple.ShortOptionsOptionalArgumentTest
Tests run: 6, Failures: 6, Errors: 0, Skipped: 0, Time elapsed: 0.012 sec <<< FAILURE!
Running joptsimple.ValueConverterAdmitsSubclassesOfValueTypeTest
Tests run: 1, Failures: 0, Errors: 0, Skipped: 0, Time elapsed: 0.001 sec
Running joptsimple.PopulatedOptionSetTest
Tests run: 4, Failures: 0, Errors: 0, Skipped: 0, Time elapsed: 0.004 sec
Running joptsimple.ParsingSeparatedTypedOptionValuesTest
Tests run: 4, Failures: 4, Errors: 0, Skipped: 0, Time elapsed: 0.008 sec <<< FAILURE!
Running joptsimple.OptionSynonymNoArgumentTest
Tests run: 3, Failures: 3, Errors: 0, Skipped: 0, Time elapsed: 0.006 sec <<< FAILURE!
Running joptsimple.OptionParserOptionExceptionTest
Tests run: 5, Failures: 3, Errors: 0, Skipped: 0, Time elapsed: 0.008 sec <<< FAILURE!
Running joptsimple.ClusterVersusLongOptionWithOptionalArgumentTest
Tests run: 9, Failures: 9, Errors: 0, Skipped: 0, Time elapsed: 0.016 sec <<< FAILURE!
Running joptsimple.RequiredUnlessAnyTest
Tests run: 4, Failures: 0, Errors: 4, Skipped: 0, Time elapsed: 0.008 sec <<< FAILURE!
Running joptsimple.OptionParserNewDeclarationTest
Tests run: 16, Failures: 15, Errors: 0, Skipped: 0, Time elapsed: 0.038 sec <<< FAILURE!
Running joptsimple.RequiredArgumentOptionSpecEqualsHashCodeTest
Tests run: 10, Failures: 0, Errors: 0, Skipped: 0, Time elapsed: 0.012 sec
Running joptsimple.OptionSynonymCommonPrefixesTest
Tests run: 7, Failures: 7, Errors: 0, Skipped: 0, Time elapsed: 0.018 sec <<< FAILURE!
Running joptsimple.OptionalArgumentOptionSpecOptionsImmutabilityTest
Tests run: 12, Failures: 0, Errors: 0, Skipped: 0, Time elapsed: 0.016 sec
Running joptsimple.RequiredUnlessTest
Tests run: 8, Failures: 0, Errors: 4, Skipped: 0, Time elapsed: 0.026 sec <<< FAILURE!
Running joptsimple.ArgumentListTest
Tests run: 2, Failures: 2, Errors: 0, Skipped: 0, Time elapsed: 0.004 sec <<< FAILURE!
Running joptsimple.NoArgumentOptionSpecTest
Tests run: 11, Failures: 0, Errors: 0, Skipped: 0, Time elapsed: 0.015 sec
Running joptsimple.RequiredArgumentOptionSpecValuesImmutabilityTest
Tests run: 12, Failures: 0, Errors: 0, Skipped: 0, Time elapsed: 0.015 sec
Running joptsimple.OptionParserTest
Tests run: 17, Failures: 15, Errors: 1, Skipped: 0, Time elapsed: 0.033 sec <<< FAILURE!
Running joptsimple.PlainOldOptionParserTest
Tests run: 1, Failures: 1, Errors: 0, Skipped: 0, Time elapsed: 0 sec <<< FAILURE!
Running joptsimple.OptionExceptionOptionsImmutabilityTest
Tests run: 12, Failures: 0, Errors: 0, Skipped: 0, Time elapsed: 0.018 sec
Running joptsimple.ParsingSeparatedStringOptionValuesTest
Tests run: 6, Failures: 6, Errors: 0, Skipped: 0, Time elapsed: 0.005 sec <<< FAILURE!
Running joptsimple.OptionParserAlternateHelpFormatterTest
Tests run: 2, Failures: 0, Errors: 0, Skipped: 0, Time elapsed: 0.007 sec
Running joptsimple.InterleavedArgumentsTest
Tests run: 9, Failures: 9, Errors: 0, Skipped: 0, Time elapsed: 0.015 sec <<< FAILURE!
Running joptsimple.ClusterVersusLongOptionTest
Tests run: 5, Failures: 5, Errors: 0, Skipped: 0, Time elapsed: 0.011 sec <<< FAILURE!
Running joptsimple.OptionSynonymOptionalArgumentTest
Tests run: 4, Failures: 4, Errors: 0, Skipped: 0, Time elapsed: 0.008 sec <<< FAILURE!
Running joptsimple.OptionSynonymRequiredArgumentTest
Tests run: 4, Failures: 4, Errors: 0, Skipped: 0, Time elapsed: 0.011 sec <<< FAILURE!
Running joptsimple.internal.ObjectsUtilityClassTest
Tests run: 1, Failures: 0, Errors: 0, Skipped: 0, Time elapsed: 0.002 sec
Running joptsimple.internal.RowEqualsHashCodeTest
Tests run: 9, Failures: 0, Errors: 0, Skipped: 0, Time elapsed: 0.013 sec
Running joptsimple.internal.RowsTest
Tests run: 3, Failures: 0, Errors: 0, Skipped: 0, Time elapsed: 0.005 sec
Running joptsimple.internal.AbbreviationMapTest
Tests run: 22, Failures: 0, Errors: 0, Skipped: 0, Time elapsed: 0.028 sec
Running joptsimple.internal.AbbreviationMapToJavaUtilMapTest
Tests run: 12, Failures: 0, Errors: 0, Skipped: 0, Time elapsed: 0.009 sec
Running joptsimple.internal.ReflectionUtilityClassTest
Tests run: 1, Failures: 0, Errors: 0, Skipped: 0, Time elapsed: 0.001 sec
Running joptsimple.internal.ClassesUtilityClassTest
Tests run: 1, Failures: 0, Errors: 0, Skipped: 0, Time elapsed: 0.002 sec
Running joptsimple.internal.StringsUtilityClassTest
Tests run: 1, Failures: 0, Errors: 0, Skipped: 0, Time elapsed: 0.002 sec
Running joptsimple.internal.ReflectionTest
Tests run: 6, Failures: 0, Errors: 0, Skipped: 0, Time elapsed: 0.008 sec
Running joptsimple.OptionSetAsMapTest
Tests run: 1, Failures: 1, Errors: 0, Skipped: 0, Time elapsed: 0.004 sec <<< FAILURE!
Running joptsimple.NoArgumentOptionSpecOptionsImmutabilityTest
Tests run: 12, Failures: 0, Errors: 0, Skipped: 0, Time elapsed: 0.011 sec
Running joptsimple.LongOptionOptionalArgumentTest
Tests run: 3, Failures: 3, Errors: 0, Skipped: 0, Time elapsed: 0.005 sec <<< FAILURE!
Running joptsimple.ClusterVersusLongOptionWithRequiredArgumentTest
Tests run: 9, Failures: 9, Errors: 0, Skipped: 0, Time elapsed: 0.013 sec <<< FAILURE!
Running joptsimple.OptionalArgumentOptionSpecTest
Tests run: 11, Failures: 0, Errors: 0, Skipped: 0, Time elapsed: 0.007 sec
Running joptsimple.OptionSetValuesOfSpecImmutabilityTest
Tests run: 12, Failures: 0, Errors: 0, Skipped: 0, Time elapsed: 0.011 sec
Running joptsimple.OptionSpecTokenizerTest
Tests run: 17, Failures: 0, Errors: 0, Skipped: 0, Time elapsed: 0.015 sec
Running joptsimple.SingleHyphenTest
Tests run: 3, Failures: 3, Errors: 0, Skipped: 0, Time elapsed: 0.006 sec <<< FAILURE!
Running joptsimple.WExtensionNoArgumentTest
Tests run: 2, Failures: 2, Errors: 0, Skipped: 0, Time elapsed: 0.002 sec <<< FAILURE!
Running joptsimple.RequiredArgumentOptionSpecOptionsImmutabilityTest
Tests run: 12, Failures: 0, Errors: 0, Skipped: 0, Time elapsed: 0.017 sec
Running joptsimple.ParserRulesUtilityClassTest
Tests run: 1, Failures: 0, Errors: 0, Skipped: 0, Time elapsed: 0.002 sec
Running joptsimple.ConfigurableOptionParserHelpTest
Tests run: 27, Failures: 0, Errors: 0, Skipped: 0, Time elapsed: 0.047 sec
Running joptsimple.NonOptionArgumentSpecTest
Tests run: 7, Failures: 5, Errors: 0, Skipped: 0, Time elapsed: 0.014 sec <<< FAILURE!
Running joptsimple.OptionExceptionMessageTest
Tests run: 8, Failures: 0, Errors: 0, Skipped: 0, Time elapsed: 0.011 sec
Running joptsimple.LongOptionNoArgumentTest
Tests run: 4, Failures: 4, Errors: 0, Skipped: 0, Time elapsed: 0.008 sec <<< FAILURE!
Running joptsimple.ArgumentAcceptingOptionSpecDefaultValuesImmutabilityTest
Tests run: 12, Failures: 0, Errors: 0, Skipped: 0, Time elapsed: 0.013 sec
Running joptsimple.ParsingSeparatedConvertedOptionValuesTest
Tests run: 4, Failures: 4, Errors: 0, Skipped: 0, Time elapsed: 0.008 sec <<< FAILURE!
Running joptsimple.HandlingDefaultValuesForOptionArgumentsTest
Tests run: 9, Failures: 5, Errors: 4, Skipped: 0, Time elapsed: 0.014 sec <<< FAILURE!
Running joptsimple.ShortOptionsRequiredArgumentTest
Tests run: 9, Failures: 9, Errors: 0, Skipped: 0, Time elapsed: 0.015 sec <<< FAILURE!
Running joptsimple.CreateWithOptionSpecificationStringTest
Tests run: 1, Failures: 0, Errors: 0, Skipped: 0, Time elapsed: 0.001 sec
Running joptsimple.EmptyOptionSetTest
Tests run: 8, Failures: 0, Errors: 0, Skipped: 0, Time elapsed: 0.008 sec
Running joptsimple.OptionParserArgumentExceptionTest
Tests run: 9, Failures: 0, Errors: 0, Skipped: 0, Time elapsed: 0.011 sec
Running joptsimple.RequiredIfTest
Tests run: 8, Failures: 6, Errors: 0, Skipped: 0, Time elapsed: 0.016 sec <<< FAILURE!
Running joptsimple.NoArgumentOptionSpecValuesImmutabilityTest
Tests run: 12, Failures: 0, Errors: 0, Skipped: 0, Time elapsed: 0.019 sec
Running joptsimple.WAsAbbreviationForLongOptionTest
Tests run: 2, Failures: 2, Errors: 0, Skipped: 0, Time elapsed: 0.005 sec <<< FAILURE!
Running joptsimple.OptionSynonymOverwritingTest
Tests run: 1, Failures: 1, Errors: 0, Skipped: 0, Time elapsed: 0.002 sec <<< FAILURE!
Running joptsimple.OptionParserRecognizedOptionsTest
Tests run: 2, Failures: 0, Errors: 0, Skipped: 0, Time elapsed: 0.004 sec
Running joptsimple.OptionSetNonOptionArgumentsImmutabilityTest
Tests run: 12, Failures: 0, Errors: 0, Skipped: 0, Time elapsed: 0.019 sec
Running joptsimple.OptionParserUnrecognizedOptionsAllowedTest
Tests run: 2, Failures: 2, Errors: 0, Skipped: 0, Time elapsed: 0.004 sec <<< FAILURE!
Running joptsimple.PosixlyCorrectOptionParserTest
Tests run: 2, Failures: 2, Errors: 0, Skipped: 0, Time elapsed: 0.005 sec <<< FAILURE!
Running joptsimple.examples.ShortOptionsWithArgumentPositioningTest
Tests run: 1, Failures: 1, Errors: 0, Skipped: 0, Time elapsed: 0.002 sec <<< FAILURE!
Running joptsimple.examples.OptionArgumentConverterTest
Tests run: 1, Failures: 1, Errors: 0, Skipped: 0, Time elapsed: 0.002 sec <<< FAILURE!
Running joptsimple.examples.RequiredOptionsTest
Tests run: 3, Failures: 0, Errors: 1, Skipped: 0, Time elapsed: 0.004 sec <<< FAILURE!
Running joptsimple.examples.DefaultValuesForOptionArgumentsTest
Tests run: 1, Failures: 1, Errors: 0, Skipped: 0, Time elapsed: 0.015 sec <<< FAILURE!
Running joptsimple.examples.OptionSynonymTest
Tests run: 1, Failures: 1, Errors: 0, Skipped: 0, Time elapsed: 0.002 sec <<< FAILURE!
Running joptsimple.examples.ShortOptionsWithArgumentsTest
Tests run: 1, Failures: 1, Errors: 0, Skipped: 0, Time elapsed: 0.001 sec <<< FAILURE!
Running joptsimple.examples.AlternativeLongOptionsTest
Tests run: 1, Failures: 1, Errors: 0, Skipped: 0, Time elapsed: 0.002 sec <<< FAILURE!
Running joptsimple.examples.LongOptionsWithArgumentPositioningTest
Tests run: 1, Failures: 1, Errors: 0, Skipped: 0, Time elapsed: 0.002 sec <<< FAILURE!
Running joptsimple.examples.PosixlyCorrectTest
Tests run: 1, Failures: 1, Errors: 0, Skipped: 0, Time elapsed: 0.002 sec <<< FAILURE!
Running joptsimple.examples.OptionArgumentValueTypeTest
Tests run: 1, Failures: 1, Errors: 0, Skipped: 0, Time elapsed: 0.002 sec <<< FAILURE!
Running joptsimple.examples.UnrecognizedOptionsAllowedTest
Tests run: 1, Failures: 1, Errors: 0, Skipped: 0, Time elapsed: 0.001 sec <<< FAILURE!
Running joptsimple.examples.LongOptionsTest
Tests run: 1, Failures: 1, Errors: 0, Skipped: 0, Time elapsed: 0.001 sec <<< FAILURE!
Running joptsimple.examples.ShortOptionsClusteringTest
Tests run: 1, Failures: 1, Errors: 0, Skipped: 0, Time elapsed: 0.002 sec <<< FAILURE!
Running joptsimple.examples.ShortOptionsClusteringWithArgumentTest
Tests run: 1, Failures: 1, Errors: 0, Skipped: 0, Time elapsed: 0.001 sec <<< FAILURE!
Running joptsimple.examples.SignallingEndOfOptionsTest
Tests run: 1, Failures: 1, Errors: 0, Skipped: 0, Time elapsed: 0.002 sec <<< FAILURE!
Running joptsimple.examples.MultipleDelimitedArgumentsTest
Tests run: 1, Failures: 1, Errors: 0, Skipped: 0, Time elapsed: 0.002 sec <<< FAILURE!
Running joptsimple.examples.SpecialOptionalArgumentHandlingTest
Tests run: 1, Failures: 1, Errors: 0, Skipped: 0, Time elapsed: 0.001 sec <<< FAILURE!
Running joptsimple.examples.ShortOptionsWithMultipleArgumentsForSingleOptionTest
Tests run: 1, Failures: 1, Errors: 0, Skipped: 0, Time elapsed: 0.002 sec <<< FAILURE!
Running joptsimple.examples.ShortOptionsTest
Tests run: 1, Failures: 1, Errors: 0, Skipped: 0, Time elapsed: 0.001 sec <<< FAILURE!
Running joptsimple.examples.LongOptionsWithArgumentsTest
Tests run: 1, Failures: 1, Errors: 0, Skipped: 0, Time elapsed: 0.002 sec <<< FAILURE!
Running joptsimple.examples.ExportOptionsTest
Tests run: 1, Failures: 1, Errors: 0, Skipped: 0, Time elapsed: 0.003 sec <<< FAILURE!
Running joptsimple.examples.TypesafeOptionArgumentRetrievalTest
Tests run: 1, Failures: 1, Errors: 0, Skipped: 0, Time elapsed: 0.002 sec <<< FAILURE!
Running joptsimple.TypesafeOptionArgumentRetrievalTest
Tests run: 22, Failures: 15, Errors: 2, Skipped: 0, Time elapsed: 0.031 sec <<< FAILURE!
Running joptsimple.OptionSetEqualsHashCodeTest
Tests run: 9, Failures: 0, Errors: 0, Skipped: 0, Time elapsed: 0.018 sec

Results :

Failed tests:   parsingJVMSystemPropertiesArguments(joptsimple.JVMSystemPropertiesArgumentParsingTest): expected:<[file.encoding=UTF-8, path.separator=:]> but was:<[]>
  wIsLegal(joptsimple.WAsShortOptionTest): option 'W' not detected?
  recognizeLongOptionsTrumpsShortOptionW(joptsimple.WAsShortOptionTest): Expected test to throw (an instance of joptsimple.UnrecognizedOptionException and an OptionException indicating the option "silent")
  rejectsCommandLineMissingConditionallyRequiredOption(joptsimple.RequiredIfAnyTest): Expected test to throw an instance of joptsimple.MissingRequiredOptionsException
  rejectsCommandLineWithNotAllConditionallyRequiredOptionsPresent(joptsimple.RequiredIfAnyTest): Expected test to throw an instance of joptsimple.MissingRequiredOptionsException
  acceptsCommandLineWithConditionallyRequiredOptionsPresent(joptsimple.RequiredIfAnyTest): option 'b' not detected?
  acceptsOptionWithPrerequisiteAsNormalIfPrerequisiteNotInPlay(joptsimple.RequiredIfAnyTest): option 'n' not detected?
  rejectsCommandLineMissingOtherConditionallyRequiredOption(joptsimple.RequiredIfAnyTest): Expected test to throw an instance of joptsimple.MissingRequiredOptionsException
  oxfPermutationWithFollowingArg(joptsimple.ClusterWhereManyOptionsAcceptArgumentsTest)
  ofxPermutationWithFollowingArg(joptsimple.ClusterWhereManyOptionsAcceptArgumentsTest)
  ofxPermutation(joptsimple.ClusterWhereManyOptionsAcceptArgumentsTest)
  oxfPermutation(joptsimple.ClusterWhereManyOptionsAcceptArgumentsTest)
  fxoPermutationWithFollowingArg(joptsimple.ClusterWhereManyOptionsAcceptArgumentsTest)
  foxPermutationWithFollowingArg(joptsimple.ClusterWhereManyOptionsAcceptArgumentsTest)
  foxPermutation(joptsimple.ClusterWhereManyOptionsAcceptArgumentsTest)
  xofPermutationWithFollowingArg(joptsimple.ClusterWhereManyOptionsAcceptArgumentsTest)
  xfoPermutationWithFollowingArg(joptsimple.ClusterWhereManyOptionsAcceptArgumentsTest)
  fxoPermutation(joptsimple.ClusterWhereManyOptionsAcceptArgumentsTest)
  xfoPermutation(joptsimple.ClusterWhereManyOptionsAcceptArgumentsTest)
  xofPermutation(joptsimple.ClusterWhereManyOptionsAcceptArgumentsTest)
  separateArgument(joptsimple.WExtensionWithArgumentTest): option 'silent' not detected?
  typedTogetherArg(joptsimple.WExtensionWithArgumentTest): option 'level' not detected?
  typedSeparateArg(joptsimple.WExtensionWithArgumentTest): option 'floor' not detected?
  abbreviationWithTogetherArgument(joptsimple.WExtensionWithArgumentTest): option 'silent' not detected?
  togetherArgument(joptsimple.WExtensionWithArgumentTest): option 'silent' not detected?
  illegalLongOption(joptsimple.WExtensionWithArgumentTest): Expected test to throw (an instance of joptsimple.UnrecognizedOptionException and an OptionException indicating the option "foo")
  noMoreArguments(joptsimple.WExtensionWithArgumentTest): Expected test to throw (an instance of joptsimple.OptionMissingRequiredArgumentException and an OptionException indicating the option "W")
  allowsDotAsShortOption(joptsimple.PunctuationInShortOptionTest)
  allowsUnderscoreAsShortOption(joptsimple.PunctuationInShortOptionTest)
  allowsQuestionMarkAsShortOption(joptsimple.PunctuationInShortOptionTest)
  allowsDotInOptionNames(joptsimple.PunctuationInLongOptionTest)
  allowsHyphensPrettyMuchAnywhereButTheFront(joptsimple.PunctuationInLongOptionTest)
  allowsUnderscoreInOptionNames(joptsimple.PunctuationInLongOptionTest)
  allowsQuestionMarkInOptionNames(joptsimple.PunctuationInLongOptionTest)
  allowsHyphensInTheMiddleOfOptionNames(joptsimple.PunctuationInLongOptionTest)
  argumentSeparate(joptsimple.LongOptionRequiredArgumentTest): option 'quiet' not detected?
  argumentFollowedByLegalOption(joptsimple.LongOptionRequiredArgumentTest): option 'quiet' not detected?
  argumentTogether(joptsimple.LongOptionRequiredArgumentTest): option 'quiet' not detected?
  argumentMissing(joptsimple.LongOptionRequiredArgumentTest): Expected test to throw (an instance of joptsimple.OptionMissingRequiredArgumentException and an OptionException indicating the option "quiet")
  shortOptionSpecifiedAsLongOptionWithArgument(joptsimple.LongOptionRequiredArgumentTest): option 'y' not detected?
  whenEndOfOptionsMarkerIsInPlaceOfRequiredArgument(joptsimple.LongOptionRequiredArgumentTest): option 'quiet' not detected?
  givesSpecsInOrderOfCommandLinePresentation(joptsimple.OptionSetDetectedOptionsTest): expected:<[[a], [e], [c], [d], [b], [d], [e]]> but was:<[]>
  clusteredOptions(joptsimple.ShortOptionsNoArgumentTest): option 'a' not detected?
  optionsTerminator(joptsimple.ShortOptionsNoArgumentTest): option 'a' not detected?
  singleOptionWithOneNonOptionArgument(joptsimple.ShortOptionsNoArgumentTest): option 'c' not detected?
  twoSingleOptions(joptsimple.ShortOptionsNoArgumentTest): option 'a' not detected?
  singleOption(joptsimple.ShortOptionsNoArgumentTest): option 'a' not detected?
  appearingMultipleTimes(joptsimple.ShortOptionsNoArgumentTest): option 'b' not detected?
  optionWithOptionalArgumentFollowedByLegalOption(joptsimple.ShortOptionsOptionalArgumentTest): option 'f' not detected?
  multipleOfSameOptionSomeWithArgsAndSomeWithout(joptsimple.ShortOptionsOptionalArgumentTest): expected:<[foo, bar]> but was:<[]>
  optionWithOptionalArgumentThatLooksLikeAnInvalidOption(joptsimple.ShortOptionsOptionalArgumentTest): Expected test to throw (an instance of joptsimple.UnrecognizedOptionException and an OptionException indicating the option "biz")
  optionWithOptionalArgumentPresent(joptsimple.ShortOptionsOptionalArgumentTest): option 'f' not detected?
  optionWithOptionalArgumentNotPresent(joptsimple.ShortOptionsOptionalArgumentTest): option 'f' not detected?
  optionWithOptionalArgumentThatLooksLikeAValidOption(joptsimple.ShortOptionsOptionalArgumentTest): option 'f' not detected?
  parsesSeparatedValuesWhenArgumentAbuttedWithEquals(joptsimple.ParsingSeparatedTypedOptionValuesTest): expected:<[/usr, /opt, /var]> but was:<[]>
  parsesSeparatedValuesAbutting(joptsimple.ParsingSeparatedTypedOptionValuesTest): expected:<[/usr, /opt, /var]> but was:<[]>
  parsesEqualsSeparatedValuesWhenArgumentAbuttedWithEquals(joptsimple.ParsingSeparatedTypedOptionValuesTest): expected:<[/usr, /opt, /var]> but was:<[]>
  parsesSeparatedValuesAsSeparateArgument(joptsimple.ParsingSeparatedTypedOptionValuesTest): expected:<[/usr, /opt, /var]> but was:<[]>
  hasAllSynonymsWhenSecondSynonymParsed(joptsimple.OptionSynonymNoArgumentTest): option 'N' not detected?
  hasAllSynonymsWhenFirstSynonymParsed(joptsimple.OptionSynonymNoArgumentTest): option 'N' not detected?
  hasAllSynonymsWhenThirdSynonymParsed(joptsimple.OptionSynonymNoArgumentTest): option 'N' not detected?
  tooManyHyphens(joptsimple.OptionParserOptionExceptionTest): Expected test to throw (an instance of joptsimple.UnrecognizedOptionException and an OptionException indicating the option "-b")
  valueOfWhenMultiples(joptsimple.OptionParserOptionExceptionTest): Expected test to throw (an instance of joptsimple.MultipleArgumentsForOptionException and an OptionException indicating the option "e")
  unrecognizedOption(joptsimple.OptionParserOptionExceptionTest): Expected test to throw (an instance of joptsimple.UnrecognizedOptionException and an OptionException indicating the option "a")
  resolvesToLongOptionEvenWithMatchingShortOptions(joptsimple.ClusterVersusLongOptionWithOptionalArgumentTest)
  resolvesShortOptionToShortOption(joptsimple.ClusterVersusLongOptionWithOptionalArgumentTest)
  shortOptionsInDifferentOrder(joptsimple.ClusterVersusLongOptionWithOptionalArgumentTest)
  resolvesToLongOptionWithSingleDashEvenWithMatchingShortOptions(joptsimple.ClusterVersusLongOptionWithOptionalArgumentTest)
  withArgumentComingAfterCluster(joptsimple.ClusterVersusLongOptionWithOptionalArgumentTest)
  resolvesAbbreviationToLongOption(joptsimple.ClusterVersusLongOptionWithOptionalArgumentTest)
  resolvesShortOptionToShortOptionEvenWithDoubleHyphen(joptsimple.ClusterVersusLongOptionWithOptionalArgumentTest)
  resolvesToShortOptionsWithArgumentFollowingX(joptsimple.ClusterVersusLongOptionWithOptionalArgumentTest)
  longOptionWithMessedUpOrder(joptsimple.ClusterVersusLongOptionWithOptionalArgumentTest): Expected exception: joptsimple.UnrecognizedOptionException
  optionsWithOptionalNegativeNumberArgumentsAndNumberOptions(joptsimple.OptionParserNewDeclarationTest): option '1' not detected?
  shortArgumentType(joptsimple.OptionParserNewDeclarationTest): option 'a' not detected?
  sqlDateArgumentType(joptsimple.OptionParserNewDeclarationTest): option 'a' not detected?
  booleanArgumentType(joptsimple.OptionParserNewDeclarationTest): option 'a' not detected?
  doubleArgumentType(joptsimple.OptionParserNewDeclarationTest): option 'a' not detected?
  illegalOptionArgumentMethodConversion(joptsimple.OptionParserNewDeclarationTest): Expected exception: joptsimple.OptionException
  integerArgumentType(joptsimple.OptionParserNewDeclarationTest): option 'a' not detected?
  floatArgumentType(joptsimple.OptionParserNewDeclarationTest): option 'a' not detected?
  sqlTimestampArgumentType(joptsimple.OptionParserNewDeclarationTest): option 'a' not detected?
  optionsWithNegativeNumberArgumentsAndNonNumberOptions(joptsimple.OptionParserNewDeclarationTest): option '1' not detected?
  optionsWithOptionalNegativeNumberArguments(joptsimple.OptionParserNewDeclarationTest): option 'a' not detected?
  longArgumentType(joptsimple.OptionParserNewDeclarationTest): option 'a' not detected?
  illegalOptionArgumentConstructorConversion(joptsimple.OptionParserNewDeclarationTest): Expected exception: joptsimple.OptionException
  byteArgumentType(joptsimple.OptionParserNewDeclarationTest): option 'a' not detected?
  sqlTimeArgumentType(joptsimple.OptionParserNewDeclarationTest): option 'a' not detected?
  parsingSixthPrefix(joptsimple.OptionSynonymCommonPrefixesTest): option 'v' not detected?
  parsingFifthPrefix(joptsimple.OptionSynonymCommonPrefixesTest): option 'v' not detected?
  parsingFirstPrefix(joptsimple.OptionSynonymCommonPrefixesTest): option 'v' not detected?
  parsingThirdPrefix(joptsimple.OptionSynonymCommonPrefixesTest): option 'v' not detected?
  parsingFourthPrefix(joptsimple.OptionSynonymCommonPrefixesTest): option 'v' not detected?
  parsingSeventhPrefix(joptsimple.OptionSynonymCommonPrefixesTest): option 'v' not detected?
  parsingSecondPrefix(joptsimple.OptionSynonymCommonPrefixesTest): option 'v' not detected?
  nextAndPeek(joptsimple.ArgumentListTest): no more arguments?
  treatNextAsLongOption(joptsimple.ArgumentListTest): no more arguments?
  requiredOptionWithArgMissing(joptsimple.OptionParserTest): 
  allowsWhitespaceyStringAsArgumentOfOption(joptsimple.OptionParserTest): option 'j' not detected?
  typedArguments(joptsimple.OptionParserTest): option 'a' not detected?
  allowsEmbeddedWhitespaceInArgumentOfOption(joptsimple.OptionParserTest): option 'j' not detected?
  shortOptionSpecifiedAsLongOptionWithoutArgument(joptsimple.OptionParserTest): option 'x' not detected?
  longOptionLeadsWithSingleDashAmbiguousButShortsAreLegal(joptsimple.OptionParserTest): option 'q' not detected?
  allowsEmptyStringAsArgumentOfOption(joptsimple.OptionParserTest): option 'i' not detected?
  disallowsMixingOfOptionsAndNonOptionsUnderPosixlyCorrect(joptsimple.OptionParserTest): expected:<[a, b, c, -i, boo, d, e, -k, f, -j]> but was:<[]>
  longOptionLeadsWithSingleDashAmbiguousButAShortAcceptsAnArgument(joptsimple.OptionParserTest): option 'q' not detected?
  longOptionLeadsWithSingleDash(joptsimple.OptionParserTest): option 'quiet' not detected?
  longOptionLeadsWithSingleDashAmbiguousButAShortIsIllegal(joptsimple.OptionParserTest): Expected test to throw (an instance of joptsimple.UnrecognizedOptionException and an OptionException indicating the option "u")
  optionsAndNonOptionsInterspersed(joptsimple.OptionParserTest): option 'i' not detected?
  longOptionLeadsWithSingleDashAmbiguous(joptsimple.OptionParserTest): Expected test to throw (an instance of joptsimple.UnrecognizedOptionException and an OptionException indicating the option "q")
  doubleHyphenSignalsEndsOfOptions(joptsimple.OptionParserTest): option 'a' not detected?
  allowsMixingOfOptionsAndNonOptions(joptsimple.OptionParserTest): option 'i' not detected?
  nonOptionsOnly(joptsimple.PlainOldOptionParserTest): expected:<[foo, bar]> but was:<[]>
  handlesConsecutiveDelimiters(joptsimple.ParsingSeparatedStringOptionValuesTest): expected:<[/usr, /opt, /var]> but was:<[]>
  parsesSeparatedValuesWhenArgumentAbuttedWithEquals(joptsimple.ParsingSeparatedStringOptionValuesTest): expected:<[/usr, /opt, /var]> but was:<[]>
  parsesHyphenSeparatedValuesAbutting(joptsimple.ParsingSeparatedStringOptionValuesTest): expected:<[/usr, /opt, /var]> but was:<[]>
  parsesSeparatedValuesAbutting(joptsimple.ParsingSeparatedStringOptionValuesTest): expected:<[/usr, /opt, /var]> but was:<[]>
  parsesEqualsSeparatedValuesWhenArgumentAbuttedWithEquals(joptsimple.ParsingSeparatedStringOptionValuesTest): expected:<[/usr, /opt, /var]> but was:<[]>
  parsesSeparatedValuesAsSeparateArgument(joptsimple.ParsingSeparatedStringOptionValuesTest): expected:<[/usr, /opt, /var]> but was:<[]>
  optionalAbuttedArgumentVersusPosixlyCorrect(joptsimple.InterleavedArgumentsTest)
  leadingNonOptionCausesPosixlyCorrectToIgnoreRemainder(joptsimple.InterleavedArgumentsTest): expected:<[boo, -c, a, -c, b, -c, c, -c, d]> but was:<[]>
  optionalArgumentAndPosixlyCorrect(joptsimple.InterleavedArgumentsTest)
  requiredArgumentAndPosixlyCorrect(joptsimple.InterleavedArgumentsTest)
  requiredArgument(joptsimple.InterleavedArgumentsTest)
  optionalKeyValuePairArgumentVersusPosixlyCorrect(joptsimple.InterleavedArgumentsTest)
  onlyAppearingToHaveOptionArgumentsButPosixlyCorrect(joptsimple.InterleavedArgumentsTest)
  optionalArgument(joptsimple.InterleavedArgumentsTest)
  onlyAppearingToHaveOptionArguments(joptsimple.InterleavedArgumentsTest)
  resolvesToLongOptionEvenWithMatchingShortOptions(joptsimple.ClusterVersusLongOptionTest)
  resolvesShortOptionToShortOption(joptsimple.ClusterVersusLongOptionTest)
  resolvesToLongOptionWithSingleDashEvenWithMatchingShortOptions(joptsimple.ClusterVersusLongOptionTest)
  resolvesAbbreviationToLongOption(joptsimple.ClusterVersusLongOptionTest)
  resolvesShortOptionToShortOptionEvenWithDoubleHyphen(joptsimple.ClusterVersusLongOptionTest)
  hasAllSynonymsWhenSecondSynonymParsed(joptsimple.OptionSynonymOptionalArgumentTest): expected:<[tmp]> but was:<[]>
  hasAllSynonymsWhenFirstSynonymParsed(joptsimple.OptionSynonymOptionalArgumentTest): expected:<[tmp]> but was:<[]>
  hasAllSynonymsWhenThirdSynonymParsed(joptsimple.OptionSynonymOptionalArgumentTest): expected:<[tmp]> but was:<[]>
  reportsSameListOfArgumentsForEverySynonymOption(joptsimple.OptionSynonymOptionalArgumentTest): expected:<[opt, tmp, usr]> but was:<[]>
  hasAllSynonymsWhenSecondSynonymParsed(joptsimple.OptionSynonymRequiredArgumentTest): expected:<[2000]> but was:<[]>
  hasAllSynonymsWhenFirstSynonymParsed(joptsimple.OptionSynonymRequiredArgumentTest): expected:<[2000]> but was:<[]>
  hasAllSynonymsWhenThirdSynonymParsed(joptsimple.OptionSynonymRequiredArgumentTest): expected:<[2000]> but was:<[]>
  reportsSameListOfArgumentsForEverySynonymOption(joptsimple.OptionSynonymRequiredArgumentTest): expected:<[1, 2, 3]> but was:<[]>
  gives(joptsimple.OptionSetAsMapTest): 
  argumentSeparate(joptsimple.LongOptionOptionalArgumentTest)
  argumentTogether(joptsimple.LongOptionOptionalArgumentTest)
  argumentMissingTrailedByAnotherOption(joptsimple.LongOptionOptionalArgumentTest)
  resolvesToLongOptionEvenWithMatchingShortOptions(joptsimple.ClusterVersusLongOptionWithRequiredArgumentTest)
  resolvesShortOptionToShortOption(joptsimple.ClusterVersusLongOptionWithRequiredArgumentTest)
  shortOptionsInDifferentOrder(joptsimple.ClusterVersusLongOptionWithRequiredArgumentTest)
  resolvesToLongOptionWithSingleDashEvenWithMatchingShortOptions(joptsimple.ClusterVersusLongOptionWithRequiredArgumentTest)
  withArgumentComingAfterCluster(joptsimple.ClusterVersusLongOptionWithRequiredArgumentTest)
  resolvesAbbreviationToLongOption(joptsimple.ClusterVersusLongOptionWithRequiredArgumentTest)
  resolvesShortOptionToShortOptionEvenWithDoubleHyphen(joptsimple.ClusterVersusLongOptionWithRequiredArgumentTest)
  resolvesToShortOptionsWithArgumentFollowingX(joptsimple.ClusterVersusLongOptionWithRequiredArgumentTest)
  longOptionWithMessedUpOrder(joptsimple.ClusterVersusLongOptionWithRequiredArgumentTest): Expected exception: joptsimple.UnrecognizedOptionException
  asArgumentOfOption(joptsimple.SingleHyphenTest): option 'o' not detected?
  asArgumentOfOptionInSameToken(joptsimple.SingleHyphenTest): option 'o' not detected?
  singleHyphen(joptsimple.SingleHyphenTest): expected:<[-]> but was:<[]>
  turnOffWExtension(joptsimple.WExtensionNoArgumentTest): Expected test to throw (an instance of joptsimple.UnrecognizedOptionException and an OptionException indicating the option "W")
  wExtensionWithLongOptionWithoutAnArgument(joptsimple.WExtensionNoArgumentTest): option 'silent' not detected?
  allowsDescriptionOfNonOptionArguments(joptsimple.NonOptionArgumentSpecTest): expected:<[/opt, /var]> but was:<[]>
  allowsArgumentDescriptionForNonOptionArguments(joptsimple.NonOptionArgumentSpecTest): expected:<[/opt, /var]> but was:<[]>
  convertingUsingConverter(joptsimple.NonOptionArgumentSpecTest): expected:<[Thu Jan 24 00:00:00 GMT 2013]> but was:<[]>
  allowsTypeAndDescriptionOfNonOptionArguments(joptsimple.NonOptionArgumentSpecTest): expected:<[/opt, /var]> but was:<[]>
  allowsTypingOfNonOptionArguments(joptsimple.NonOptionArgumentSpecTest): expected:<[/opt, /var]> but was:<[]>
  abbreviationIsALegalOption(joptsimple.LongOptionNoArgumentTest)
  ambiguousAbbreviation(joptsimple.LongOptionNoArgumentTest): Expected test to throw (an instance of joptsimple.UnrecognizedOptionException and an OptionException indicating the option "ver")
  singleLongOptionAbbreviated(joptsimple.LongOptionNoArgumentTest)
  singleLongOption(joptsimple.LongOptionNoArgumentTest)
  parsesSeparatedValuesWhenArgumentAbuttedWithEquals(joptsimple.ParsingSeparatedConvertedOptionValuesTest): expected:<[/usr, /opt, /var]> but was:<[]>
  parsesSeparatedValuesAbutting(joptsimple.ParsingSeparatedConvertedOptionValuesTest): expected:<[/usr, /opt, /var]> but was:<[]>
  parsesEqualsSeparatedValuesWhenArgumentAbuttedWithEquals(joptsimple.ParsingSeparatedConvertedOptionValuesTest): expected:<[/usr, /opt, /var]> but was:<[]>
  parsesSeparatedValuesAsSeparateArgument(joptsimple.ParsingSeparatedConvertedOptionValuesTest): expected:<[/usr, /opt, /var]> but was:<[]>
  optionalArgOptionWithDefaultGivesArgIfSpecifiedOnCommandLine(joptsimple.HandlingDefaultValuesForOptionArgumentsTest)
  optionalArgOptionWithDefaultGivesDefaultIfArgNotSpecifiedOnCommandLine(joptsimple.HandlingDefaultValuesForOptionArgumentsTest)
  specifiedOptionArgumentsTrumpsListOfDefaults(joptsimple.HandlingDefaultValuesForOptionArgumentsTest): expected:<[4, 5, 6, 7, 8]> but was:<[1, 2, 3]>
  requiredArgOptionWithDefaultGivesArgIfArgSpecifiedOnCommandLine(joptsimple.HandlingDefaultValuesForOptionArgumentsTest)
  requiredArgOptionWithDefaultStillsFailToParseIfArgNotSpecifiedOnCommandLine(joptsimple.HandlingDefaultValuesForOptionArgumentsTest): Expected exception: joptsimple.OptionMissingRequiredArgumentException
  clusteredOptionsWithOneAcceptingAnArgument(joptsimple.ShortOptionsRequiredArgumentTest): option 'f' not detected?
  inSameToken(joptsimple.ShortOptionsRequiredArgumentTest): option 'd' not detected?
  clusteredOptionsWithLastOneAcceptingAnArgument(joptsimple.ShortOptionsRequiredArgumentTest): option 'd' not detected?
  argumentNotPresentFollowedByAnotherOption(joptsimple.ShortOptionsRequiredArgumentTest): option 'd' not detected?
  withArgument(joptsimple.ShortOptionsRequiredArgumentTest): option 'd' not detected?
  argumentNotPresent(joptsimple.ShortOptionsRequiredArgumentTest): Expected test to throw (an instance of joptsimple.OptionMissingRequiredArgumentException and an OptionException indicating the option "d")
  appearingMultipleTimes(joptsimple.ShortOptionsRequiredArgumentTest): option 'd' not detected?
  clusteredOptionsWithLastOneAcceptingAnArgumentButMissing(joptsimple.ShortOptionsRequiredArgumentTest): Expected test to throw an instance of joptsimple.OptionMissingRequiredArgumentException
  whenEndOfOptionsMarkerIsInPlaceOfRequiredArgument(joptsimple.ShortOptionsRequiredArgumentTest): option 'd' not detected?
  rejectsCommandLineMissingConditionallyRequiredOptionSynonym(joptsimple.RequiredIfTest): Expected test to throw an instance of joptsimple.MissingRequiredOptionsException
  rejectsCommandLineMissingConditionallyRequiredOption(joptsimple.RequiredIfTest): Expected test to throw an instance of joptsimple.MissingRequiredOptionsException
  rejectsCommandLineWithNotAllConditionallyRequiredOptionsPresent(joptsimple.RequiredIfTest): Expected test to throw an instance of joptsimple.MissingRequiredOptionsException
  acceptsCommandLineWithConditionallyRequiredOptionsPresent(joptsimple.RequiredIfTest): option 'ftp' not detected?
  acceptsOptionWithPrerequisiteAsNormalIfPrerequisiteNotInPlay(joptsimple.RequiredIfTest): option 'pwd' not detected?
  presenceOfHelpOptionNegatesRequiredIfness(joptsimple.RequiredIfTest): option 'ftp' not detected?
  recognizeLongOptionsTrumpsLongOptionAbbreviation(joptsimple.WAsAbbreviationForLongOptionTest): Expected test to throw (an instance of joptsimple.UnrecognizedOptionException and an OptionException indicating the option "silent")
  abbreviation(joptsimple.WAsAbbreviationForLongOptionTest): option 'Wally' not detected?
  treatsHAsThoughItWereLastDefinedSynonymOfH(joptsimple.OptionSynonymOverwritingTest): option 'h' not detected?
  unrecognizedOptionAllowed(joptsimple.OptionParserUnrecognizedOptionsAllowedTest): expected:<[-a]> but was:<[]>
  unrecognizedOptionDisallowed(joptsimple.OptionParserUnrecognizedOptionsAllowedTest): Expected test to throw (an instance of joptsimple.UnrecognizedOptionException and an OptionException indicating the option "a")
  parseWithPosixlyCorrect[0](joptsimple.PosixlyCorrectOptionParserTest): i?
  parseWithPosixlyCorrect[1](joptsimple.PosixlyCorrectOptionParserTest): i?
  allowsDifferentFormsOfPairingArgumentWithOption(joptsimple.examples.ShortOptionsWithArgumentPositioningTest)
  usesConvertersOnOptionArgumentsWhenTold(joptsimple.examples.OptionArgumentConverterTest): expected:<Thu Feb 24 00:00:00 GMT 2005> but was:<null>
  allowsSpecificationOfDefaultValues(joptsimple.examples.DefaultValuesForOptionArgumentsTest): expected:</etc/passwd> but was:</tmp/aFile8660150367256242508.txt>
  supportsOptionSynonyms(joptsimple.examples.OptionSynonymTest): message
  allowsOptionsToAcceptArguments(joptsimple.examples.ShortOptionsWithArgumentsTest)
  handlesAlternativeLongOptions(joptsimple.examples.AlternativeLongOptionsTest)
  allowsDifferentFormsOfPairingArgumentWithOption(joptsimple.examples.LongOptionsWithArgumentPositioningTest)
  supportsPosixlyCorrectBehavior(joptsimple.examples.PosixlyCorrectTest)
  convertsArgumentsToJavaValueTypes(joptsimple.examples.OptionArgumentValueTypeTest)
  acceptsLongOptions(joptsimple.examples.UnrecognizedOptionsAllowedTest)
  acceptsLongOptions(joptsimple.examples.LongOptionsTest)
  allowsClusteringShortOptions(joptsimple.examples.ShortOptionsClusteringTest)
  allowsClusteringShortOptionsThatAcceptArguments(joptsimple.examples.ShortOptionsClusteringWithArgumentTest)
  doubleHyphenSignalsEndOfOptions(joptsimple.examples.SignallingEndOfOptionsTest)
  supportsMultipleDelimitedArguments(joptsimple.examples.MultipleDelimitedArgumentsTest)
  handlesNegativeNumberOptionalArguments(joptsimple.examples.SpecialOptionalArgumentHandlingTest)
  allowsMultipleValuesForAnOption(joptsimple.examples.ShortOptionsWithMultipleArgumentsForSingleOptionTest)
  supportsShortOptions(joptsimple.examples.ShortOptionsTest)
  supportsLongOptionsWithArgumentsAndAbbreviations(joptsimple.examples.LongOptionsWithArgumentsTest)
  allowsExportOfOptions(joptsimple.examples.ExportOptionsTest): expected:<{rice.verbose=true, rice.output-dir=/tmp, rice.count=3, rice.fun=false}> but was:<{rice.verbose=false, rice.output-dir=false, rice.count=false, rice.fun=false}>
  allowsTypesafeRetrievalOfOptionArguments(joptsimple.examples.TypesafeOptionArgumentRetrievalTest)
  primitiveIntAllowedAsTypeSpecifier(joptsimple.TypesafeOptionArgumentRetrievalTest)
  retrievalOfTypedOptionalArgumentsInATypesafeManner(joptsimple.TypesafeOptionArgumentRetrievalTest)
  retrievalOfUntypedRequiredArgumentsInATypesafeManner(joptsimple.TypesafeOptionArgumentRetrievalTest)
  canSubvertTypeSafetyIfYouUseAnOptionSpecAsTheWrongType(joptsimple.TypesafeOptionArgumentRetrievalTest): Expected exception: java.lang.ClassCastException
  wrapsValueConversionExceptionsRaisedByConverter(joptsimple.TypesafeOptionArgumentRetrievalTest): Expected test to throw (an instance of joptsimple.OptionArgumentConversionException and an exception with cause of type <class joptsimple.ValueConversionException>)
  primitiveLongAllowedAsTypeSpecifier(joptsimple.TypesafeOptionArgumentRetrievalTest)
  retrievalOfTypedRequiredArgumentsInATypesafeManner(joptsimple.TypesafeOptionArgumentRetrievalTest)
  primitiveShortAllowedAsTypeSpecifier(joptsimple.TypesafeOptionArgumentRetrievalTest)
  usesConverterIfProvided(joptsimple.TypesafeOptionArgumentRetrievalTest): expected:<34> but was:<null>
  primitiveByteAllowedAsTypeSpecifier(joptsimple.TypesafeOptionArgumentRetrievalTest)
  retrievalWithVoidOption(joptsimple.TypesafeOptionArgumentRetrievalTest)
  retrievalOfUntypedOptionalArgumentsInATypesafeManner(joptsimple.TypesafeOptionArgumentRetrievalTest)
  primitiveFloatAllowedAsTypeSpecifier(joptsimple.TypesafeOptionArgumentRetrievalTest)
  primitiveBooleanAllowedAsTypeSpecifier(joptsimple.TypesafeOptionArgumentRetrievalTest)
  primitiveDoubleAllowedAsTypeSpecifier(joptsimple.TypesafeOptionArgumentRetrievalTest)

Tests in error: 
  commandLineMissingConditionallyRequiredOption(joptsimple.RequiredUnlessAnyTest): Missing required option(s) [n]
  acceptsCommandLineWithConditionallyRequiredOptionsPresent(joptsimple.RequiredUnlessAnyTest): Missing required option(s) [n]
  acceptsOptionWithPrerequisiteAsNormalIfPrerequisiteNotInPlay(joptsimple.RequiredUnlessAnyTest): Missing required option(s) [n]
  commandLineWithNotAllConditionallyRequiredOptionsPresent(joptsimple.RequiredUnlessAnyTest): Missing required option(s) [n]
  acceptsOptionWithPrerequisiteAsNormal(joptsimple.RequiredUnlessTest): Missing required option(s) [userid/username, password/pwd]
  presenceOfHelpOptionNegatesRequiredUnlessness(joptsimple.RequiredUnlessTest): Missing required option(s) [userid/username, password/pwd]
  acceptsCommandLineWithConditionallyRequiredOptionsPresent(joptsimple.RequiredUnlessTest): Missing required option(s) [userid/username, password/pwd]
  acceptsOptionWithPrerequisite(joptsimple.RequiredUnlessTest): Missing required option(s) [userid/username, password/pwd]
  requiredOptionButHelpOptionPresent(joptsimple.OptionParserTest): Missing required option(s) [t]
  optionalArgOptionWithDefaultGivesDefaultIfOptionNotOnCommandLine(joptsimple.HandlingDefaultValuesForOptionArgumentsTest): 0
  withCompileTimeArraySpecifyingDefaults(joptsimple.HandlingDefaultValuesForOptionArgumentsTest): 0
  requiredArgOptionWithDefaultGivesDefaultIfOptionNotOnCommandLine(joptsimple.HandlingDefaultValuesForOptionArgumentsTest): 0
  allowsListOfDefaults(joptsimple.HandlingDefaultValuesForOptionArgumentsTest): 0
  aHelpOptionMeansRequiredOptionsNeedNotBePresent(joptsimple.examples.RequiredOptionsTest): Missing required option(s) [password, userid]
  canSubvertTypeSafetyIfYouGiveAnOptionSpecToOptionSetAsTheWrongType(joptsimple.TypesafeOptionArgumentRetrievalTest): Unexpected exception, expected<java.lang.ClassCastException> but was<java.lang.IndexOutOfBoundsException>
  canUseBooleanType(joptsimple.TypesafeOptionArgumentRetrievalTest)

Tests run: 745, Failures: 235, Errors: 16, Skipped: 0

[INFO] ------------------------------------------------------------------------
[INFO] BUILD FAILURE
[INFO] ------------------------------------------------------------------------
[INFO] Total time: 8.011s
[INFO] Finished at: Sat Aug 01 23:55:13 BST 2015
[INFO] Final Memory: 20M/218M
[INFO] ------------------------------------------------------------------------
[ERROR] Failed to execute goal org.apache.maven.plugins:maven-surefire-plugin:2.10:test (default-test) on project jopt-simple: There are test failures.
[ERROR] 
[ERROR] Please refer to /home/perham/Study/LittleDarwin/Cases/jopt-simple-4.8/target/surefire-reports for the individual test results.
[ERROR] -> [Help 1]
[ERROR] 
[ERROR] To see the full stack trace of the errors, re-run Maven with the -e switch.
[ERROR] Re-run Maven using the -X switch to enable full debug logging.
[ERROR] 
[ERROR] For more information about the errors and possible solutions, please read the following articles:
[ERROR] [Help 1] http://cwiki.apache.org/confluence/display/MAVEN/MojoFailureException
