[INFO] Scanning for projects...
[INFO]                                                                         
[INFO] ------------------------------------------------------------------------
[INFO] Building JOpt Simple 4.8
[INFO] ------------------------------------------------------------------------
[WARNING] The POM for com.googlecode.jmockit:jmockit:jar:1.6 is invalid, transitive dependencies (if any) will not be available, enable debug logging for more details
[INFO] 
[INFO] --- maven-enforcer-plugin:1.0:enforce (enforce-maven) @ jopt-simple ---
[INFO] 
[INFO] --- maven-resources-plugin:2.3:resources (default-resources) @ jopt-simple ---
[INFO] Using 'UTF-8' encoding to copy filtered resources.
[INFO] Copying 1 resource
[INFO] 
[INFO] --- maven-compiler-plugin:3.1:compile (default-compile) @ jopt-simple ---
[INFO] Changes detected - recompiling the module!
[INFO] Compiling 44 source files to /home/perham/Study/LittleDarwin/Cases/jopt-simple-4.8/target/classes
[WARNING] /home/perham/Study/LittleDarwin/Cases/jopt-simple-4.8/src/main/java/joptsimple/OptionMissingRequiredArgumentException.java: /home/perham/Study/LittleDarwin/Cases/jopt-simple-4.8/src/main/java/joptsimple/OptionMissingRequiredArgumentException.java uses unchecked or unsafe operations.
[WARNING] /home/perham/Study/LittleDarwin/Cases/jopt-simple-4.8/src/main/java/joptsimple/OptionMissingRequiredArgumentException.java: Recompile with -Xlint:unchecked for details.
[INFO] 
[INFO] >>> maven-pmd-plugin:3.2:cpd-check (default) @ jopt-simple >>>
[INFO] 
[INFO] --- maven-pmd-plugin:3.2:cpd (cpd) @ jopt-simple ---
[WARNING] Unable to locate Source XRef to link to - DISABLED
[INFO] 
[INFO] <<< maven-pmd-plugin:3.2:cpd-check (default) @ jopt-simple <<<
[INFO] 
[INFO] --- maven-pmd-plugin:3.2:cpd-check (default) @ jopt-simple ---
[INFO] 
[INFO] 
[INFO] --- animal-sniffer-maven-plugin:1.11:check (check-signature) @ jopt-simple ---
[INFO] Checking unresolved references to org.codehaus.mojo.signature:java15:1.0
[INFO] 
[INFO] --- maven-resources-plugin:2.3:testResources (default-testResources) @ jopt-simple ---
[INFO] Using 'UTF-8' encoding to copy filtered resources.
[INFO] skip non existing resourceDirectory /home/perham/Study/LittleDarwin/Cases/jopt-simple-4.8/src/test/resources
[INFO] 
[INFO] --- maven-compiler-plugin:3.1:testCompile (default-testCompile) @ jopt-simple ---
[INFO] Nothing to compile - all classes are up to date
[INFO] 
[INFO] --- maven-surefire-plugin:2.10:test (default-test) @ jopt-simple ---
[INFO] Surefire report directory: /home/perham/Study/LittleDarwin/Cases/jopt-simple-4.8/target/surefire-reports

-------------------------------------------------------
 T E S T S
-------------------------------------------------------
Running joptsimple.OptionSpecBuilderOptionsImmutabilityTest
Tests run: 12, Failures: 0, Errors: 0, Skipped: 0, Time elapsed: 0.498 sec
Running joptsimple.JVMSystemPropertiesArgumentParsingTest
Tests run: 1, Failures: 0, Errors: 1, Skipped: 0, Time elapsed: 0.018 sec <<< FAILURE!
Running joptsimple.WAsShortOptionTest
Tests run: 2, Failures: 1, Errors: 1, Skipped: 0, Time elapsed: 0.021 sec <<< FAILURE!
Running joptsimple.OptionSetValuesOfOptionStringImmutabilityTest
Tests run: 12, Failures: 0, Errors: 0, Skipped: 0, Time elapsed: 0.019 sec
Running joptsimple.ArgumentListHasNoMoreArgsTest
Tests run: 3, Failures: 0, Errors: 0, Skipped: 0, Time elapsed: 0.006 sec
Running joptsimple.util.KeyValuePairUnequalValuesTest
Tests run: 8, Failures: 0, Errors: 0, Skipped: 0, Time elapsed: 0.008 sec
Running joptsimple.util.DateConverterTest
Tests run: 11, Failures: 0, Errors: 0, Skipped: 0, Time elapsed: 0.136 sec
Running joptsimple.util.KeyValuePairUnequalKeysTest
Tests run: 8, Failures: 0, Errors: 0, Skipped: 0, Time elapsed: 0.011 sec
Running joptsimple.util.InetAddressConverterTest
Tests run: 2, Failures: 0, Errors: 0, Skipped: 0, Time elapsed: 0.02 sec
Running joptsimple.util.KeyValuePairTest
Tests run: 7, Failures: 0, Errors: 0, Skipped: 0, Time elapsed: 0.006 sec
Running joptsimple.util.RegexMatcherTest
Tests run: 6, Failures: 0, Errors: 0, Skipped: 0, Time elapsed: 0.014 sec
Running joptsimple.OptionSetSpecsImmutabilityTest
Tests run: 12, Failures: 0, Errors: 0, Skipped: 0, Time elapsed: 0.011 sec
Running joptsimple.ArgumentAcceptingOptionSpecTest
Tests run: 16, Failures: 0, Errors: 0, Skipped: 0, Time elapsed: 0.022 sec
Running joptsimple.AlternativeLongOptionSpecValuesImmutabilityTest
Tests run: 12, Failures: 0, Errors: 0, Skipped: 0, Time elapsed: 0.014 sec
Running joptsimple.RequiredIfAnyTest
Tests run: 5, Failures: 3, Errors: 2, Skipped: 0, Time elapsed: 0.01 sec <<< FAILURE!
Running joptsimple.ClusterWhereManyOptionsAcceptArgumentsTest
Tests run: 12, Failures: 0, Errors: 12, Skipped: 0, Time elapsed: 0.02 sec <<< FAILURE!
Running joptsimple.OptionSpecsReportTheirOptionsSortedSpeciallyTest
Tests run: 1, Failures: 0, Errors: 0, Skipped: 0, Time elapsed: 0 sec
Running joptsimple.DefaultSettingsOptionParserHelpTest
Tests run: 39, Failures: 0, Errors: 0, Skipped: 0, Time elapsed: 0.1 sec
Running joptsimple.WExtensionWithArgumentTest
Tests run: 7, Failures: 2, Errors: 5, Skipped: 0, Time elapsed: 0.023 sec <<< FAILURE!
Running joptsimple.PunctuationInShortOptionTest
Tests run: 4, Failures: 0, Errors: 3, Skipped: 0, Time elapsed: 0.007 sec <<< FAILURE!
Running joptsimple.PunctuationInLongOptionTest
Tests run: 6, Failures: 0, Errors: 5, Skipped: 0, Time elapsed: 0.013 sec <<< FAILURE!
Running joptsimple.LongOptionRequiredArgumentTest
Tests run: 6, Failures: 1, Errors: 5, Skipped: 0, Time elapsed: 0.015 sec <<< FAILURE!
Running joptsimple.ToStringTest
Tests run: 3, Failures: 0, Errors: 0, Skipped: 0, Time elapsed: 0.01 sec
Running joptsimple.OptionSetDetectedOptionsTest
Tests run: 1, Failures: 0, Errors: 1, Skipped: 0, Time elapsed: 0.003 sec <<< FAILURE!
Running joptsimple.OptionSpecBuilderValuesImmutabilityTest
Tests run: 12, Failures: 0, Errors: 0, Skipped: 0, Time elapsed: 0.011 sec
Running joptsimple.ShortOptionsNoArgumentTest
Tests run: 6, Failures: 0, Errors: 6, Skipped: 0, Time elapsed: 0.013 sec <<< FAILURE!
Running joptsimple.OptionalArgumentOptionSpecValuesImmutabilityTest
Tests run: 12, Failures: 0, Errors: 0, Skipped: 0, Time elapsed: 0.013 sec
Running joptsimple.AlternativeLongOptionSpecOptionsImmutabilityTest
Tests run: 12, Failures: 0, Errors: 0, Skipped: 0, Time elapsed: 0.01 sec
Running joptsimple.ShortOptionsOptionalArgumentTest
Tests run: 6, Failures: 1, Errors: 5, Skipped: 0, Time elapsed: 0.012 sec <<< FAILURE!
Running joptsimple.ValueConverterAdmitsSubclassesOfValueTypeTest
Tests run: 1, Failures: 0, Errors: 0, Skipped: 0, Time elapsed: 0 sec
Running joptsimple.PopulatedOptionSetTest
Tests run: 4, Failures: 0, Errors: 0, Skipped: 0, Time elapsed: 0.004 sec
Running joptsimple.ParsingSeparatedTypedOptionValuesTest
Tests run: 4, Failures: 0, Errors: 4, Skipped: 0, Time elapsed: 0.006 sec <<< FAILURE!
Running joptsimple.OptionSynonymNoArgumentTest
Tests run: 3, Failures: 0, Errors: 3, Skipped: 0, Time elapsed: 0.005 sec <<< FAILURE!
Running joptsimple.OptionParserOptionExceptionTest
Tests run: 5, Failures: 0, Errors: 1, Skipped: 0, Time elapsed: 0.006 sec <<< FAILURE!
Running joptsimple.ClusterVersusLongOptionWithOptionalArgumentTest
Tests run: 9, Failures: 0, Errors: 8, Skipped: 0, Time elapsed: 0.015 sec <<< FAILURE!
Running joptsimple.RequiredUnlessAnyTest
Tests run: 4, Failures: 0, Errors: 4, Skipped: 0, Time elapsed: 0.007 sec <<< FAILURE!
Running joptsimple.OptionParserNewDeclarationTest
Tests run: 16, Failures: 0, Errors: 15, Skipped: 0, Time elapsed: 0.032 sec <<< FAILURE!
Running joptsimple.RequiredArgumentOptionSpecEqualsHashCodeTest
Tests run: 10, Failures: 0, Errors: 0, Skipped: 0, Time elapsed: 0.007 sec
Running joptsimple.OptionSynonymCommonPrefixesTest
Tests run: 7, Failures: 0, Errors: 7, Skipped: 0, Time elapsed: 0.016 sec <<< FAILURE!
Running joptsimple.OptionalArgumentOptionSpecOptionsImmutabilityTest
Tests run: 12, Failures: 0, Errors: 0, Skipped: 0, Time elapsed: 0.009 sec
Running joptsimple.RequiredUnlessTest
Tests run: 8, Failures: 2, Errors: 4, Skipped: 0, Time elapsed: 0.022 sec <<< FAILURE!
Running joptsimple.ArgumentListTest
Tests run: 2, Failures: 0, Errors: 2, Skipped: 0, Time elapsed: 0.002 sec <<< FAILURE!
Running joptsimple.NoArgumentOptionSpecTest
Tests run: 11, Failures: 0, Errors: 0, Skipped: 0, Time elapsed: 0.011 sec
Running joptsimple.RequiredArgumentOptionSpecValuesImmutabilityTest
Tests run: 12, Failures: 0, Errors: 0, Skipped: 0, Time elapsed: 0.011 sec
Running joptsimple.OptionParserTest
Tests run: 17, Failures: 0, Errors: 14, Skipped: 0, Time elapsed: 0.026 sec <<< FAILURE!
Running joptsimple.PlainOldOptionParserTest
Tests run: 1, Failures: 0, Errors: 1, Skipped: 0, Time elapsed: 0.001 sec <<< FAILURE!
Running joptsimple.OptionExceptionOptionsImmutabilityTest
Tests run: 12, Failures: 0, Errors: 0, Skipped: 0, Time elapsed: 0.012 sec
Running joptsimple.ParsingSeparatedStringOptionValuesTest
Tests run: 6, Failures: 0, Errors: 6, Skipped: 0, Time elapsed: 0.007 sec <<< FAILURE!
Running joptsimple.OptionParserAlternateHelpFormatterTest
Tests run: 2, Failures: 0, Errors: 0, Skipped: 0, Time elapsed: 0.003 sec
Running joptsimple.InterleavedArgumentsTest
Tests run: 9, Failures: 0, Errors: 9, Skipped: 0, Time elapsed: 0.012 sec <<< FAILURE!
Running joptsimple.ClusterVersusLongOptionTest
Tests run: 5, Failures: 0, Errors: 5, Skipped: 0, Time elapsed: 0.01 sec <<< FAILURE!
Running joptsimple.OptionSynonymOptionalArgumentTest
Tests run: 4, Failures: 0, Errors: 4, Skipped: 0, Time elapsed: 0.006 sec <<< FAILURE!
Running joptsimple.OptionSynonymRequiredArgumentTest
Tests run: 4, Failures: 0, Errors: 4, Skipped: 0, Time elapsed: 0.009 sec <<< FAILURE!
Running joptsimple.internal.ObjectsUtilityClassTest
Tests run: 1, Failures: 0, Errors: 0, Skipped: 0, Time elapsed: 0.001 sec
Running joptsimple.internal.RowEqualsHashCodeTest
Tests run: 9, Failures: 0, Errors: 0, Skipped: 0, Time elapsed: 0.009 sec
Running joptsimple.internal.RowsTest
Tests run: 3, Failures: 0, Errors: 0, Skipped: 0, Time elapsed: 0.003 sec
Running joptsimple.internal.AbbreviationMapTest
Tests run: 22, Failures: 0, Errors: 0, Skipped: 0, Time elapsed: 0.019 sec
Running joptsimple.internal.AbbreviationMapToJavaUtilMapTest
Tests run: 12, Failures: 0, Errors: 0, Skipped: 0, Time elapsed: 0.01 sec
Running joptsimple.internal.ReflectionUtilityClassTest
Tests run: 1, Failures: 0, Errors: 0, Skipped: 0, Time elapsed: 0.001 sec
Running joptsimple.internal.ClassesUtilityClassTest
Tests run: 1, Failures: 0, Errors: 0, Skipped: 0, Time elapsed: 0.002 sec
Running joptsimple.internal.StringsUtilityClassTest
Tests run: 1, Failures: 0, Errors: 0, Skipped: 0, Time elapsed: 0.002 sec
Running joptsimple.internal.ReflectionTest
Tests run: 6, Failures: 0, Errors: 0, Skipped: 0, Time elapsed: 0.007 sec
Running joptsimple.OptionSetAsMapTest
Tests run: 1, Failures: 0, Errors: 1, Skipped: 0, Time elapsed: 0.003 sec <<< FAILURE!
Running joptsimple.NoArgumentOptionSpecOptionsImmutabilityTest
Tests run: 12, Failures: 0, Errors: 0, Skipped: 0, Time elapsed: 0.01 sec
Running joptsimple.LongOptionOptionalArgumentTest
Tests run: 3, Failures: 0, Errors: 3, Skipped: 0, Time elapsed: 0.005 sec <<< FAILURE!
Running joptsimple.ClusterVersusLongOptionWithRequiredArgumentTest
Tests run: 9, Failures: 0, Errors: 8, Skipped: 0, Time elapsed: 0.014 sec <<< FAILURE!
Running joptsimple.OptionalArgumentOptionSpecTest
Tests run: 11, Failures: 0, Errors: 0, Skipped: 0, Time elapsed: 0.009 sec
Running joptsimple.OptionSetValuesOfSpecImmutabilityTest
Tests run: 12, Failures: 0, Errors: 0, Skipped: 0, Time elapsed: 0.01 sec
Running joptsimple.OptionSpecTokenizerTest
Tests run: 17, Failures: 0, Errors: 0, Skipped: 0, Time elapsed: 0.016 sec
Running joptsimple.SingleHyphenTest
Tests run: 3, Failures: 0, Errors: 3, Skipped: 0, Time elapsed: 0.003 sec <<< FAILURE!
Running joptsimple.WExtensionNoArgumentTest
Tests run: 2, Failures: 0, Errors: 1, Skipped: 0, Time elapsed: 0.005 sec <<< FAILURE!
Running joptsimple.RequiredArgumentOptionSpecOptionsImmutabilityTest
Tests run: 12, Failures: 0, Errors: 0, Skipped: 0, Time elapsed: 0.011 sec
Running joptsimple.ParserRulesUtilityClassTest
Tests run: 1, Failures: 0, Errors: 0, Skipped: 0, Time elapsed: 0.001 sec
Running joptsimple.ConfigurableOptionParserHelpTest
Tests run: 27, Failures: 0, Errors: 0, Skipped: 0, Time elapsed: 0.042 sec
Running joptsimple.NonOptionArgumentSpecTest
Tests run: 7, Failures: 0, Errors: 5, Skipped: 0, Time elapsed: 0.009 sec <<< FAILURE!
Running joptsimple.OptionExceptionMessageTest
Tests run: 8, Failures: 0, Errors: 0, Skipped: 0, Time elapsed: 0.01 sec
Running joptsimple.LongOptionNoArgumentTest
Tests run: 4, Failures: 0, Errors: 3, Skipped: 0, Time elapsed: 0.007 sec <<< FAILURE!
Running joptsimple.ArgumentAcceptingOptionSpecDefaultValuesImmutabilityTest
Tests run: 12, Failures: 0, Errors: 0, Skipped: 0, Time elapsed: 0.012 sec
Running joptsimple.ParsingSeparatedConvertedOptionValuesTest
Tests run: 4, Failures: 0, Errors: 4, Skipped: 0, Time elapsed: 0.007 sec <<< FAILURE!
Running joptsimple.HandlingDefaultValuesForOptionArgumentsTest
Tests run: 9, Failures: 0, Errors: 5, Skipped: 0, Time elapsed: 0.014 sec <<< FAILURE!
Running joptsimple.ShortOptionsRequiredArgumentTest
Tests run: 9, Failures: 2, Errors: 7, Skipped: 0, Time elapsed: 0.023 sec <<< FAILURE!
Running joptsimple.CreateWithOptionSpecificationStringTest
Tests run: 1, Failures: 0, Errors: 1, Skipped: 0, Time elapsed: 0.001 sec <<< FAILURE!
Running joptsimple.EmptyOptionSetTest
Tests run: 8, Failures: 0, Errors: 0, Skipped: 0, Time elapsed: 0.008 sec
Running joptsimple.OptionParserArgumentExceptionTest
Tests run: 9, Failures: 0, Errors: 0, Skipped: 0, Time elapsed: 0.011 sec
Running joptsimple.RequiredIfTest
Tests run: 8, Failures: 3, Errors: 3, Skipped: 0, Time elapsed: 0.017 sec <<< FAILURE!
Running joptsimple.NoArgumentOptionSpecValuesImmutabilityTest
Tests run: 12, Failures: 0, Errors: 0, Skipped: 0, Time elapsed: 0.011 sec
Running joptsimple.WAsAbbreviationForLongOptionTest
Tests run: 2, Failures: 1, Errors: 1, Skipped: 0, Time elapsed: 0.005 sec <<< FAILURE!
Running joptsimple.OptionSynonymOverwritingTest
Tests run: 1, Failures: 0, Errors: 1, Skipped: 0, Time elapsed: 0.003 sec <<< FAILURE!
Running joptsimple.OptionParserRecognizedOptionsTest
Tests run: 2, Failures: 0, Errors: 0, Skipped: 0, Time elapsed: 0.003 sec
Running joptsimple.OptionSetNonOptionArgumentsImmutabilityTest
Tests run: 12, Failures: 0, Errors: 0, Skipped: 0, Time elapsed: 0.022 sec
Running joptsimple.OptionParserUnrecognizedOptionsAllowedTest
Tests run: 2, Failures: 0, Errors: 1, Skipped: 0, Time elapsed: 0.003 sec <<< FAILURE!
Running joptsimple.PosixlyCorrectOptionParserTest
Tests run: 2, Failures: 0, Errors: 2, Skipped: 0, Time elapsed: 0.005 sec <<< FAILURE!
Running joptsimple.examples.ShortOptionsWithArgumentPositioningTest
Tests run: 1, Failures: 0, Errors: 1, Skipped: 0, Time elapsed: 0.002 sec <<< FAILURE!
Running joptsimple.examples.OptionArgumentConverterTest
Tests run: 1, Failures: 0, Errors: 1, Skipped: 0, Time elapsed: 0.002 sec <<< FAILURE!
Running joptsimple.examples.RequiredOptionsTest
Tests run: 3, Failures: 0, Errors: 3, Skipped: 0, Time elapsed: 0.005 sec <<< FAILURE!
Running joptsimple.examples.DefaultValuesForOptionArgumentsTest
Tests run: 1, Failures: 0, Errors: 1, Skipped: 0, Time elapsed: 0.015 sec <<< FAILURE!
Running joptsimple.examples.OptionSynonymTest
Tests run: 1, Failures: 0, Errors: 1, Skipped: 0, Time elapsed: 0.002 sec <<< FAILURE!
Running joptsimple.examples.ShortOptionsWithArgumentsTest
Tests run: 1, Failures: 0, Errors: 1, Skipped: 0, Time elapsed: 0.001 sec <<< FAILURE!
Running joptsimple.examples.AlternativeLongOptionsTest
Tests run: 1, Failures: 0, Errors: 1, Skipped: 0, Time elapsed: 0.001 sec <<< FAILURE!
Running joptsimple.examples.LongOptionsWithArgumentPositioningTest
Tests run: 1, Failures: 0, Errors: 1, Skipped: 0, Time elapsed: 0.002 sec <<< FAILURE!
Running joptsimple.examples.PosixlyCorrectTest
Tests run: 1, Failures: 0, Errors: 1, Skipped: 0, Time elapsed: 0.002 sec <<< FAILURE!
Running joptsimple.examples.OptionArgumentValueTypeTest
Tests run: 1, Failures: 0, Errors: 1, Skipped: 0, Time elapsed: 0.001 sec <<< FAILURE!
Running joptsimple.examples.UnrecognizedOptionsAllowedTest
Tests run: 1, Failures: 0, Errors: 1, Skipped: 0, Time elapsed: 0.001 sec <<< FAILURE!
Running joptsimple.examples.LongOptionsTest
Tests run: 1, Failures: 0, Errors: 1, Skipped: 0, Time elapsed: 0.001 sec <<< FAILURE!
Running joptsimple.examples.ShortOptionsClusteringTest
Tests run: 1, Failures: 0, Errors: 1, Skipped: 0, Time elapsed: 0.002 sec <<< FAILURE!
Running joptsimple.examples.ShortOptionsClusteringWithArgumentTest
Tests run: 1, Failures: 0, Errors: 1, Skipped: 0, Time elapsed: 0.002 sec <<< FAILURE!
Running joptsimple.examples.SignallingEndOfOptionsTest
Tests run: 1, Failures: 0, Errors: 1, Skipped: 0, Time elapsed: 0.001 sec <<< FAILURE!
Running joptsimple.examples.MultipleDelimitedArgumentsTest
Tests run: 1, Failures: 0, Errors: 1, Skipped: 0, Time elapsed: 0.003 sec <<< FAILURE!
Running joptsimple.examples.SpecialOptionalArgumentHandlingTest
Tests run: 1, Failures: 0, Errors: 1, Skipped: 0, Time elapsed: 0.001 sec <<< FAILURE!
Running joptsimple.examples.ShortOptionsWithMultipleArgumentsForSingleOptionTest
Tests run: 1, Failures: 0, Errors: 1, Skipped: 0, Time elapsed: 0.002 sec <<< FAILURE!
Running joptsimple.examples.ShortOptionsTest
Tests run: 1, Failures: 0, Errors: 1, Skipped: 0, Time elapsed: 0.002 sec <<< FAILURE!
Running joptsimple.examples.LongOptionsWithArgumentsTest
Tests run: 1, Failures: 0, Errors: 1, Skipped: 0, Time elapsed: 0.002 sec <<< FAILURE!
Running joptsimple.examples.ExportOptionsTest
Tests run: 1, Failures: 0, Errors: 1, Skipped: 0, Time elapsed: 0.002 sec <<< FAILURE!
Running joptsimple.examples.TypesafeOptionArgumentRetrievalTest
Tests run: 1, Failures: 0, Errors: 1, Skipped: 0, Time elapsed: 0.001 sec <<< FAILURE!
Running joptsimple.TypesafeOptionArgumentRetrievalTest
Tests run: 22, Failures: 0, Errors: 21, Skipped: 0, Time elapsed: 0.036 sec <<< FAILURE!
Running joptsimple.OptionSetEqualsHashCodeTest
Tests run: 9, Failures: 0, Errors: 0, Skipped: 0, Time elapsed: 0.018 sec

Results :

Failed tests:   recognizeLongOptionsTrumpsShortOptionW(joptsimple.WAsShortOptionTest): 
  rejectsCommandLineMissingConditionallyRequiredOption(joptsimple.RequiredIfAnyTest): 
  rejectsCommandLineWithNotAllConditionallyRequiredOptionsPresent(joptsimple.RequiredIfAnyTest): 
  rejectsCommandLineMissingOtherConditionallyRequiredOption(joptsimple.RequiredIfAnyTest): 
  illegalLongOption(joptsimple.WExtensionWithArgumentTest): 
  noMoreArguments(joptsimple.WExtensionWithArgumentTest): 
  argumentMissing(joptsimple.LongOptionRequiredArgumentTest): 
  optionWithOptionalArgumentThatLooksLikeAnInvalidOption(joptsimple.ShortOptionsOptionalArgumentTest): 
  rejectsCommandLineMissingConditionallyRequiredOption(joptsimple.RequiredUnlessTest): 
  rejectsCommandLineWithNotAllConditionallyRequiredOptionsPresent(joptsimple.RequiredUnlessTest): 
  argumentNotPresent(joptsimple.ShortOptionsRequiredArgumentTest): 
  clusteredOptionsWithLastOneAcceptingAnArgumentButMissing(joptsimple.ShortOptionsRequiredArgumentTest): 
  rejectsCommandLineMissingConditionallyRequiredOptionSynonym(joptsimple.RequiredIfTest): 
  rejectsCommandLineMissingConditionallyRequiredOption(joptsimple.RequiredIfTest): 
  rejectsCommandLineWithNotAllConditionallyRequiredOptionsPresent(joptsimple.RequiredIfTest): 
  recognizeLongOptionsTrumpsLongOptionAbbreviation(joptsimple.WAsAbbreviationForLongOptionTest): 

Tests in error: 
  parsingJVMSystemPropertiesArguments(joptsimple.JVMSystemPropertiesArgumentParsingTest): -1
  wIsLegal(joptsimple.WAsShortOptionTest): -1
  acceptsCommandLineWithConditionallyRequiredOptionsPresent(joptsimple.RequiredIfAnyTest): -1
  acceptsOptionWithPrerequisiteAsNormalIfPrerequisiteNotInPlay(joptsimple.RequiredIfAnyTest): -1
  oxfPermutationWithFollowingArg(joptsimple.ClusterWhereManyOptionsAcceptArgumentsTest): -1
  ofxPermutationWithFollowingArg(joptsimple.ClusterWhereManyOptionsAcceptArgumentsTest): -1
  ofxPermutation(joptsimple.ClusterWhereManyOptionsAcceptArgumentsTest): -1
  oxfPermutation(joptsimple.ClusterWhereManyOptionsAcceptArgumentsTest): -1
  fxoPermutationWithFollowingArg(joptsimple.ClusterWhereManyOptionsAcceptArgumentsTest): -1
  foxPermutationWithFollowingArg(joptsimple.ClusterWhereManyOptionsAcceptArgumentsTest): -1
  foxPermutation(joptsimple.ClusterWhereManyOptionsAcceptArgumentsTest): -1
  xofPermutationWithFollowingArg(joptsimple.ClusterWhereManyOptionsAcceptArgumentsTest): -1
  xfoPermutationWithFollowingArg(joptsimple.ClusterWhereManyOptionsAcceptArgumentsTest): -1
  fxoPermutation(joptsimple.ClusterWhereManyOptionsAcceptArgumentsTest): -1
  xfoPermutation(joptsimple.ClusterWhereManyOptionsAcceptArgumentsTest): -1
  xofPermutation(joptsimple.ClusterWhereManyOptionsAcceptArgumentsTest): -1
  separateArgument(joptsimple.WExtensionWithArgumentTest): -1
  typedTogetherArg(joptsimple.WExtensionWithArgumentTest): -1
  typedSeparateArg(joptsimple.WExtensionWithArgumentTest): -1
  abbreviationWithTogetherArgument(joptsimple.WExtensionWithArgumentTest): -1
  togetherArgument(joptsimple.WExtensionWithArgumentTest): -1
  allowsDotAsShortOption(joptsimple.PunctuationInShortOptionTest): -1
  allowsUnderscoreAsShortOption(joptsimple.PunctuationInShortOptionTest): -1
  allowsQuestionMarkAsShortOption(joptsimple.PunctuationInShortOptionTest): -1
  allowsDotInOptionNames(joptsimple.PunctuationInLongOptionTest): -1
  allowsHyphensPrettyMuchAnywhereButTheFront(joptsimple.PunctuationInLongOptionTest): -1
  allowsUnderscoreInOptionNames(joptsimple.PunctuationInLongOptionTest): -1
  allowsQuestionMarkInOptionNames(joptsimple.PunctuationInLongOptionTest): -1
  allowsHyphensInTheMiddleOfOptionNames(joptsimple.PunctuationInLongOptionTest): -1
  argumentSeparate(joptsimple.LongOptionRequiredArgumentTest): -1
  argumentFollowedByLegalOption(joptsimple.LongOptionRequiredArgumentTest): -1
  argumentTogether(joptsimple.LongOptionRequiredArgumentTest): -1
  shortOptionSpecifiedAsLongOptionWithArgument(joptsimple.LongOptionRequiredArgumentTest): -1
  whenEndOfOptionsMarkerIsInPlaceOfRequiredArgument(joptsimple.LongOptionRequiredArgumentTest): -1
  givesSpecsInOrderOfCommandLinePresentation(joptsimple.OptionSetDetectedOptionsTest): -1
  clusteredOptions(joptsimple.ShortOptionsNoArgumentTest): -1
  optionsTerminator(joptsimple.ShortOptionsNoArgumentTest): -1
  singleOptionWithOneNonOptionArgument(joptsimple.ShortOptionsNoArgumentTest): -1
  twoSingleOptions(joptsimple.ShortOptionsNoArgumentTest): -1
  singleOption(joptsimple.ShortOptionsNoArgumentTest): -1
  appearingMultipleTimes(joptsimple.ShortOptionsNoArgumentTest): -1
  optionWithOptionalArgumentFollowedByLegalOption(joptsimple.ShortOptionsOptionalArgumentTest): -1
  multipleOfSameOptionSomeWithArgsAndSomeWithout(joptsimple.ShortOptionsOptionalArgumentTest): -1
  optionWithOptionalArgumentPresent(joptsimple.ShortOptionsOptionalArgumentTest): -1
  optionWithOptionalArgumentNotPresent(joptsimple.ShortOptionsOptionalArgumentTest): -1
  optionWithOptionalArgumentThatLooksLikeAValidOption(joptsimple.ShortOptionsOptionalArgumentTest): -1
  parsesSeparatedValuesWhenArgumentAbuttedWithEquals(joptsimple.ParsingSeparatedTypedOptionValuesTest): -1
  parsesSeparatedValuesAbutting(joptsimple.ParsingSeparatedTypedOptionValuesTest): -1
  parsesEqualsSeparatedValuesWhenArgumentAbuttedWithEquals(joptsimple.ParsingSeparatedTypedOptionValuesTest): -1
  parsesSeparatedValuesAsSeparateArgument(joptsimple.ParsingSeparatedTypedOptionValuesTest): -1
  hasAllSynonymsWhenSecondSynonymParsed(joptsimple.OptionSynonymNoArgumentTest): -1
  hasAllSynonymsWhenFirstSynonymParsed(joptsimple.OptionSynonymNoArgumentTest): -1
  hasAllSynonymsWhenThirdSynonymParsed(joptsimple.OptionSynonymNoArgumentTest): -1
  valueOfWhenMultiples(joptsimple.OptionParserOptionExceptionTest): -1
  resolvesToLongOptionEvenWithMatchingShortOptions(joptsimple.ClusterVersusLongOptionWithOptionalArgumentTest): -1
  resolvesShortOptionToShortOption(joptsimple.ClusterVersusLongOptionWithOptionalArgumentTest): -1
  shortOptionsInDifferentOrder(joptsimple.ClusterVersusLongOptionWithOptionalArgumentTest): -1
  resolvesToLongOptionWithSingleDashEvenWithMatchingShortOptions(joptsimple.ClusterVersusLongOptionWithOptionalArgumentTest): -1
  withArgumentComingAfterCluster(joptsimple.ClusterVersusLongOptionWithOptionalArgumentTest): -1
  resolvesAbbreviationToLongOption(joptsimple.ClusterVersusLongOptionWithOptionalArgumentTest): -1
  resolvesShortOptionToShortOptionEvenWithDoubleHyphen(joptsimple.ClusterVersusLongOptionWithOptionalArgumentTest): -1
  resolvesToShortOptionsWithArgumentFollowingX(joptsimple.ClusterVersusLongOptionWithOptionalArgumentTest): -1
  commandLineMissingConditionallyRequiredOption(joptsimple.RequiredUnlessAnyTest): -1
  acceptsCommandLineWithConditionallyRequiredOptionsPresent(joptsimple.RequiredUnlessAnyTest): -1
  acceptsOptionWithPrerequisiteAsNormalIfPrerequisiteNotInPlay(joptsimple.RequiredUnlessAnyTest): -1
  commandLineWithNotAllConditionallyRequiredOptionsPresent(joptsimple.RequiredUnlessAnyTest): -1
  optionsWithOptionalNegativeNumberArgumentsAndNumberOptions(joptsimple.OptionParserNewDeclarationTest): -1
  shortArgumentType(joptsimple.OptionParserNewDeclarationTest): -1
  sqlDateArgumentType(joptsimple.OptionParserNewDeclarationTest): -1
  booleanArgumentType(joptsimple.OptionParserNewDeclarationTest): -1
  doubleArgumentType(joptsimple.OptionParserNewDeclarationTest): -1
  illegalOptionArgumentMethodConversion(joptsimple.OptionParserNewDeclarationTest): Unexpected exception, expected<joptsimple.OptionException> but was<java.lang.ArrayIndexOutOfBoundsException>
  integerArgumentType(joptsimple.OptionParserNewDeclarationTest): -1
  floatArgumentType(joptsimple.OptionParserNewDeclarationTest): -1
  sqlTimestampArgumentType(joptsimple.OptionParserNewDeclarationTest): -1
  optionsWithNegativeNumberArgumentsAndNonNumberOptions(joptsimple.OptionParserNewDeclarationTest): -1
  optionsWithOptionalNegativeNumberArguments(joptsimple.OptionParserNewDeclarationTest): -1
  longArgumentType(joptsimple.OptionParserNewDeclarationTest): -1
  illegalOptionArgumentConstructorConversion(joptsimple.OptionParserNewDeclarationTest): Unexpected exception, expected<joptsimple.OptionException> but was<java.lang.ArrayIndexOutOfBoundsException>
  byteArgumentType(joptsimple.OptionParserNewDeclarationTest): -1
  sqlTimeArgumentType(joptsimple.OptionParserNewDeclarationTest): -1
  parsingSixthPrefix(joptsimple.OptionSynonymCommonPrefixesTest): -1
  parsingFifthPrefix(joptsimple.OptionSynonymCommonPrefixesTest): -1
  parsingFirstPrefix(joptsimple.OptionSynonymCommonPrefixesTest): -1
  parsingThirdPrefix(joptsimple.OptionSynonymCommonPrefixesTest): -1
  parsingFourthPrefix(joptsimple.OptionSynonymCommonPrefixesTest): -1
  parsingSeventhPrefix(joptsimple.OptionSynonymCommonPrefixesTest): -1
  parsingSecondPrefix(joptsimple.OptionSynonymCommonPrefixesTest): -1
  acceptsOptionWithPrerequisiteAsNormal(joptsimple.RequiredUnlessTest): -1
  presenceOfHelpOptionNegatesRequiredUnlessness(joptsimple.RequiredUnlessTest): -1
  acceptsCommandLineWithConditionallyRequiredOptionsPresent(joptsimple.RequiredUnlessTest): -1
  acceptsOptionWithPrerequisite(joptsimple.RequiredUnlessTest): -1
  nextAndPeek(joptsimple.ArgumentListTest): -1
  treatNextAsLongOption(joptsimple.ArgumentListTest): -1
  allowsWhitespaceyStringAsArgumentOfOption(joptsimple.OptionParserTest): -1
  typedArguments(joptsimple.OptionParserTest): -1
  allowsEmbeddedWhitespaceInArgumentOfOption(joptsimple.OptionParserTest): -1
  resetHappensAfterParsing(joptsimple.OptionParserTest): -1
  shortOptionSpecifiedAsLongOptionWithoutArgument(joptsimple.OptionParserTest): -1
  longOptionLeadsWithSingleDashAmbiguousButShortsAreLegal(joptsimple.OptionParserTest): -1
  allowsEmptyStringAsArgumentOfOption(joptsimple.OptionParserTest): -1
  disallowsMixingOfOptionsAndNonOptionsUnderPosixlyCorrect(joptsimple.OptionParserTest): -1
  longOptionLeadsWithSingleDashAmbiguousButAShortAcceptsAnArgument(joptsimple.OptionParserTest): -1
  longOptionLeadsWithSingleDash(joptsimple.OptionParserTest): -1
  optionsAndNonOptionsInterspersed(joptsimple.OptionParserTest): -1
  doubleHyphenSignalsEndsOfOptions(joptsimple.OptionParserTest): -1
  allowsMixingOfOptionsAndNonOptions(joptsimple.OptionParserTest): -1
  requiredOptionButHelpOptionPresent(joptsimple.OptionParserTest): -1
  nonOptionsOnly(joptsimple.PlainOldOptionParserTest): -1
  handlesConsecutiveDelimiters(joptsimple.ParsingSeparatedStringOptionValuesTest): -1
  parsesSeparatedValuesWhenArgumentAbuttedWithEquals(joptsimple.ParsingSeparatedStringOptionValuesTest): -1
  parsesHyphenSeparatedValuesAbutting(joptsimple.ParsingSeparatedStringOptionValuesTest): -1
  parsesSeparatedValuesAbutting(joptsimple.ParsingSeparatedStringOptionValuesTest): -1
  parsesEqualsSeparatedValuesWhenArgumentAbuttedWithEquals(joptsimple.ParsingSeparatedStringOptionValuesTest): -1
  parsesSeparatedValuesAsSeparateArgument(joptsimple.ParsingSeparatedStringOptionValuesTest): -1
  optionalAbuttedArgumentVersusPosixlyCorrect(joptsimple.InterleavedArgumentsTest): -1
  leadingNonOptionCausesPosixlyCorrectToIgnoreRemainder(joptsimple.InterleavedArgumentsTest): -1
  optionalArgumentAndPosixlyCorrect(joptsimple.InterleavedArgumentsTest): -1
  requiredArgumentAndPosixlyCorrect(joptsimple.InterleavedArgumentsTest): -1
  requiredArgument(joptsimple.InterleavedArgumentsTest): -1
  optionalKeyValuePairArgumentVersusPosixlyCorrect(joptsimple.InterleavedArgumentsTest): -1
  onlyAppearingToHaveOptionArgumentsButPosixlyCorrect(joptsimple.InterleavedArgumentsTest): -1
  optionalArgument(joptsimple.InterleavedArgumentsTest): -1
  onlyAppearingToHaveOptionArguments(joptsimple.InterleavedArgumentsTest): -1
  resolvesToLongOptionEvenWithMatchingShortOptions(joptsimple.ClusterVersusLongOptionTest): -1
  resolvesShortOptionToShortOption(joptsimple.ClusterVersusLongOptionTest): -1
  resolvesToLongOptionWithSingleDashEvenWithMatchingShortOptions(joptsimple.ClusterVersusLongOptionTest): -1
  resolvesAbbreviationToLongOption(joptsimple.ClusterVersusLongOptionTest): -1
  resolvesShortOptionToShortOptionEvenWithDoubleHyphen(joptsimple.ClusterVersusLongOptionTest): -1
  hasAllSynonymsWhenSecondSynonymParsed(joptsimple.OptionSynonymOptionalArgumentTest): -1
  hasAllSynonymsWhenFirstSynonymParsed(joptsimple.OptionSynonymOptionalArgumentTest): -1
  hasAllSynonymsWhenThirdSynonymParsed(joptsimple.OptionSynonymOptionalArgumentTest): -1
  reportsSameListOfArgumentsForEverySynonymOption(joptsimple.OptionSynonymOptionalArgumentTest): -1
  hasAllSynonymsWhenSecondSynonymParsed(joptsimple.OptionSynonymRequiredArgumentTest): -1
  hasAllSynonymsWhenFirstSynonymParsed(joptsimple.OptionSynonymRequiredArgumentTest): -1
  hasAllSynonymsWhenThirdSynonymParsed(joptsimple.OptionSynonymRequiredArgumentTest): -1
  reportsSameListOfArgumentsForEverySynonymOption(joptsimple.OptionSynonymRequiredArgumentTest): -1
  gives(joptsimple.OptionSetAsMapTest): -1
  argumentSeparate(joptsimple.LongOptionOptionalArgumentTest): -1
  argumentTogether(joptsimple.LongOptionOptionalArgumentTest): -1
  argumentMissingTrailedByAnotherOption(joptsimple.LongOptionOptionalArgumentTest): -1
  resolvesToLongOptionEvenWithMatchingShortOptions(joptsimple.ClusterVersusLongOptionWithRequiredArgumentTest): -1
  resolvesShortOptionToShortOption(joptsimple.ClusterVersusLongOptionWithRequiredArgumentTest): -1
  shortOptionsInDifferentOrder(joptsimple.ClusterVersusLongOptionWithRequiredArgumentTest): -1
  resolvesToLongOptionWithSingleDashEvenWithMatchingShortOptions(joptsimple.ClusterVersusLongOptionWithRequiredArgumentTest): -1
  withArgumentComingAfterCluster(joptsimple.ClusterVersusLongOptionWithRequiredArgumentTest): -1
  resolvesAbbreviationToLongOption(joptsimple.ClusterVersusLongOptionWithRequiredArgumentTest): -1
  resolvesShortOptionToShortOptionEvenWithDoubleHyphen(joptsimple.ClusterVersusLongOptionWithRequiredArgumentTest): -1
  resolvesToShortOptionsWithArgumentFollowingX(joptsimple.ClusterVersusLongOptionWithRequiredArgumentTest): -1
  asArgumentOfOption(joptsimple.SingleHyphenTest): -1
  asArgumentOfOptionInSameToken(joptsimple.SingleHyphenTest): -1
  singleHyphen(joptsimple.SingleHyphenTest): -1
  wExtensionWithLongOptionWithoutAnArgument(joptsimple.WExtensionNoArgumentTest): -1
  allowsDescriptionOfNonOptionArguments(joptsimple.NonOptionArgumentSpecTest): -1
  allowsArgumentDescriptionForNonOptionArguments(joptsimple.NonOptionArgumentSpecTest): -1
  convertingUsingConverter(joptsimple.NonOptionArgumentSpecTest): -1
  allowsTypeAndDescriptionOfNonOptionArguments(joptsimple.NonOptionArgumentSpecTest): -1
  allowsTypingOfNonOptionArguments(joptsimple.NonOptionArgumentSpecTest): -1
  abbreviationIsALegalOption(joptsimple.LongOptionNoArgumentTest): -1
  singleLongOptionAbbreviated(joptsimple.LongOptionNoArgumentTest): -1
  singleLongOption(joptsimple.LongOptionNoArgumentTest): -1
  parsesSeparatedValuesWhenArgumentAbuttedWithEquals(joptsimple.ParsingSeparatedConvertedOptionValuesTest): -1
  parsesSeparatedValuesAbutting(joptsimple.ParsingSeparatedConvertedOptionValuesTest): -1
  parsesEqualsSeparatedValuesWhenArgumentAbuttedWithEquals(joptsimple.ParsingSeparatedConvertedOptionValuesTest): -1
  parsesSeparatedValuesAsSeparateArgument(joptsimple.ParsingSeparatedConvertedOptionValuesTest): -1
  optionalArgOptionWithDefaultGivesArgIfSpecifiedOnCommandLine(joptsimple.HandlingDefaultValuesForOptionArgumentsTest): -1
  optionalArgOptionWithDefaultGivesDefaultIfArgNotSpecifiedOnCommandLine(joptsimple.HandlingDefaultValuesForOptionArgumentsTest): -1
  specifiedOptionArgumentsTrumpsListOfDefaults(joptsimple.HandlingDefaultValuesForOptionArgumentsTest): -1
  requiredArgOptionWithDefaultGivesArgIfArgSpecifiedOnCommandLine(joptsimple.HandlingDefaultValuesForOptionArgumentsTest): -1
  requiredArgOptionWithDefaultStillsFailToParseIfArgNotSpecifiedOnCommandLine(joptsimple.HandlingDefaultValuesForOptionArgumentsTest): Unexpected exception, expected<joptsimple.OptionMissingRequiredArgumentException> but was<java.lang.ArrayIndexOutOfBoundsException>
  clusteredOptionsWithOneAcceptingAnArgument(joptsimple.ShortOptionsRequiredArgumentTest): -1
  inSameToken(joptsimple.ShortOptionsRequiredArgumentTest): -1
  clusteredOptionsWithLastOneAcceptingAnArgument(joptsimple.ShortOptionsRequiredArgumentTest): -1
  argumentNotPresentFollowedByAnotherOption(joptsimple.ShortOptionsRequiredArgumentTest): -1
  withArgument(joptsimple.ShortOptionsRequiredArgumentTest): -1
  appearingMultipleTimes(joptsimple.ShortOptionsRequiredArgumentTest): -1
  whenEndOfOptionsMarkerIsInPlaceOfRequiredArgument(joptsimple.ShortOptionsRequiredArgumentTest): -1
  createsParserWithOptionSpecificationString(joptsimple.CreateWithOptionSpecificationStringTest): -1
  acceptsCommandLineWithConditionallyRequiredOptionsPresent(joptsimple.RequiredIfTest): -1
  acceptsOptionWithPrerequisiteAsNormalIfPrerequisiteNotInPlay(joptsimple.RequiredIfTest): -1
  presenceOfHelpOptionNegatesRequiredIfness(joptsimple.RequiredIfTest): -1
  abbreviation(joptsimple.WAsAbbreviationForLongOptionTest): -1
  treatsHAsThoughItWereLastDefinedSynonymOfH(joptsimple.OptionSynonymOverwritingTest): -1
  unrecognizedOptionAllowed(joptsimple.OptionParserUnrecognizedOptionsAllowedTest): -1
  parseWithPosixlyCorrect[0](joptsimple.PosixlyCorrectOptionParserTest): -1
  parseWithPosixlyCorrect[1](joptsimple.PosixlyCorrectOptionParserTest): -1
  allowsDifferentFormsOfPairingArgumentWithOption(joptsimple.examples.ShortOptionsWithArgumentPositioningTest): -1
  usesConvertersOnOptionArgumentsWhenTold(joptsimple.examples.OptionArgumentConverterTest): -1
  aHelpOptionMeansRequiredOptionsNeedNotBePresent(joptsimple.examples.RequiredOptionsTest): -1
  missingHelpOptionMeansRequiredOptionsMustBePresent(joptsimple.examples.RequiredOptionsTest): Unexpected exception, expected<joptsimple.OptionException> but was<java.lang.ArrayIndexOutOfBoundsException>
  allowsSpecificationOfRequiredOptions(joptsimple.examples.RequiredOptionsTest): Unexpected exception, expected<joptsimple.OptionException> but was<java.lang.ArrayIndexOutOfBoundsException>
  allowsSpecificationOfDefaultValues(joptsimple.examples.DefaultValuesForOptionArgumentsTest): -1
  supportsOptionSynonyms(joptsimple.examples.OptionSynonymTest): -1
  allowsOptionsToAcceptArguments(joptsimple.examples.ShortOptionsWithArgumentsTest): -1
  handlesAlternativeLongOptions(joptsimple.examples.AlternativeLongOptionsTest): -1
  allowsDifferentFormsOfPairingArgumentWithOption(joptsimple.examples.LongOptionsWithArgumentPositioningTest): -1
  supportsPosixlyCorrectBehavior(joptsimple.examples.PosixlyCorrectTest): -1
  convertsArgumentsToJavaValueTypes(joptsimple.examples.OptionArgumentValueTypeTest): -1
  acceptsLongOptions(joptsimple.examples.UnrecognizedOptionsAllowedTest): -1
  acceptsLongOptions(joptsimple.examples.LongOptionsTest): -1
  allowsClusteringShortOptions(joptsimple.examples.ShortOptionsClusteringTest): -1
  allowsClusteringShortOptionsThatAcceptArguments(joptsimple.examples.ShortOptionsClusteringWithArgumentTest): -1
  doubleHyphenSignalsEndOfOptions(joptsimple.examples.SignallingEndOfOptionsTest): -1
  supportsMultipleDelimitedArguments(joptsimple.examples.MultipleDelimitedArgumentsTest): -1
  handlesNegativeNumberOptionalArguments(joptsimple.examples.SpecialOptionalArgumentHandlingTest): -1
  allowsMultipleValuesForAnOption(joptsimple.examples.ShortOptionsWithMultipleArgumentsForSingleOptionTest): -1
  supportsShortOptions(joptsimple.examples.ShortOptionsTest): -1
  supportsLongOptionsWithArgumentsAndAbbreviations(joptsimple.examples.LongOptionsWithArgumentsTest): -1
  allowsExportOfOptions(joptsimple.examples.ExportOptionsTest): -1
  allowsTypesafeRetrievalOfOptionArguments(joptsimple.examples.TypesafeOptionArgumentRetrievalTest): -1
  primitiveIntAllowedAsTypeSpecifier(joptsimple.TypesafeOptionArgumentRetrievalTest): -1
  retrievalOfTypedOptionalArgumentsInATypesafeManner(joptsimple.TypesafeOptionArgumentRetrievalTest): -1
  retrievalOfUntypedRequiredArgumentsInATypesafeManner(joptsimple.TypesafeOptionArgumentRetrievalTest): -1
  canSubvertTypeSafetyIfYouUseAnOptionSpecAsTheWrongType(joptsimple.TypesafeOptionArgumentRetrievalTest): Unexpected exception, expected<java.lang.ClassCastException> but was<java.lang.ArrayIndexOutOfBoundsException>
  wrapsValueConversionExceptionsRaisedByConverter(joptsimple.TypesafeOptionArgumentRetrievalTest): -1
  cannotFoolValuesOfWithAnOptionNotIssuedFromBuilder(joptsimple.TypesafeOptionArgumentRetrievalTest): -1
  primitiveLongAllowedAsTypeSpecifier(joptsimple.TypesafeOptionArgumentRetrievalTest): -1
  canSubvertTypeSafetyIfYouGiveAnOptionSpecToOptionSetAsTheWrongType(joptsimple.TypesafeOptionArgumentRetrievalTest): Unexpected exception, expected<java.lang.ClassCastException> but was<java.lang.ArrayIndexOutOfBoundsException>
  retrievalOfTypedRequiredArgumentsInATypesafeManner(joptsimple.TypesafeOptionArgumentRetrievalTest): -1
  primitiveShortAllowedAsTypeSpecifier(joptsimple.TypesafeOptionArgumentRetrievalTest): -1
  cannotFoolHasWithAnOptionNotIssuedFromBuilder(joptsimple.TypesafeOptionArgumentRetrievalTest): -1
  usesConverterIfProvided(joptsimple.TypesafeOptionArgumentRetrievalTest): -1
  cannotFoolHasArgumentWithAnOptionNotIssuedFromBuilder(joptsimple.TypesafeOptionArgumentRetrievalTest): -1
  cannotFoolValueOfWithAnOptionNotIssuedFromBuilder(joptsimple.TypesafeOptionArgumentRetrievalTest): -1
  primitiveByteAllowedAsTypeSpecifier(joptsimple.TypesafeOptionArgumentRetrievalTest): -1
  retrievalWithVoidOption(joptsimple.TypesafeOptionArgumentRetrievalTest): -1
  retrievalOfUntypedOptionalArgumentsInATypesafeManner(joptsimple.TypesafeOptionArgumentRetrievalTest): -1
  primitiveFloatAllowedAsTypeSpecifier(joptsimple.TypesafeOptionArgumentRetrievalTest): -1
  primitiveBooleanAllowedAsTypeSpecifier(joptsimple.TypesafeOptionArgumentRetrievalTest): -1
  primitiveDoubleAllowedAsTypeSpecifier(joptsimple.TypesafeOptionArgumentRetrievalTest): -1
  canUseBooleanType(joptsimple.TypesafeOptionArgumentRetrievalTest): -1

Tests run: 745, Failures: 16, Errors: 231, Skipped: 0

[INFO] ------------------------------------------------------------------------
[INFO] BUILD FAILURE
[INFO] ------------------------------------------------------------------------
[INFO] Total time: 8.006s
[INFO] Finished at: Sat Aug 01 23:54:53 BST 2015
[INFO] Final Memory: 28M/347M
[INFO] ------------------------------------------------------------------------
[ERROR] Failed to execute goal org.apache.maven.plugins:maven-surefire-plugin:2.10:test (default-test) on project jopt-simple: There are test failures.
[ERROR] 
[ERROR] Please refer to /home/perham/Study/LittleDarwin/Cases/jopt-simple-4.8/target/surefire-reports for the individual test results.
[ERROR] -> [Help 1]
[ERROR] 
[ERROR] To see the full stack trace of the errors, re-run Maven with the -e switch.
[ERROR] Re-run Maven using the -X switch to enable full debug logging.
[ERROR] 
[ERROR] For more information about the errors and possible solutions, please read the following articles:
[ERROR] [Help 1] http://cwiki.apache.org/confluence/display/MAVEN/MojoFailureException
