-------------------------------------------------------------------------------
Test set: org.joda.time.TestAllPackages
-------------------------------------------------------------------------------
Tests run: 4157, Failures: 0, Errors: 2, Skipped: 0, Time elapsed: 5.421 sec <<< FAILURE! - in org.joda.time.TestAllPackages
testProvider(org.joda.time.TestDateTimeZone)  Time elapsed: 0.045 sec  <<< ERROR!
java.lang.RuntimeException: java.io.IOException: File directory doesn't exist: src/test/resources/tzdata
	at org.joda.time.DateTimeZone.getDefaultProvider(DateTimeZone.java:506)
	at org.joda.time.DateTimeZone.setProvider(DateTimeZone.java:437)
	at org.joda.time.TestDateTimeZone.testProvider(TestDateTimeZone.java:501)
Caused by: java.io.IOException: File directory doesn't exist: src/test/resources/tzdata
	at org.joda.time.tz.ZoneInfoProvider.<init>(ZoneInfoProvider.java:27)
	at org.joda.time.DateTimeZone.getDefaultProvider(DateTimeZone.java:503)
	... 28 more

testCompile(org.joda.time.tz.TestCompiler)  Time elapsed: 0.023 sec  <<< ERROR!
java.io.IOException: File directory doesn't exist: /tmp/joda-test-5455574
	at org.joda.time.tz.ZoneInfoProvider.<init>(ZoneInfoProvider.java:27)
	at org.joda.time.tz.TestCompiler.compileAndLoad(TestCompiler.java:134)
	at org.joda.time.tz.TestCompiler.testCompile(TestCompiler.java:112)

