[INFO] Scanning for projects...
[INFO]                                                                         
[INFO] ------------------------------------------------------------------------
[INFO] Building Joda-Time 2.8.1
[INFO] ------------------------------------------------------------------------
[INFO] 
[INFO] --- maven-resources-plugin:2.7:resources (default-resources) @ joda-time ---
[INFO] Using 'UTF-8' encoding to copy filtered resources.
[INFO] Copying 2 resources to META-INF
[INFO] Copying 10 resources
[INFO] 
[INFO] --- maven-compiler-plugin:3.3:compile (default-compile) @ joda-time ---
[INFO] Changes detected - recompiling the module!
[INFO] Compiling 166 source files to /home/perham/Study/LittleDarwin/Cases/joda-time-2.8.1/target/classes
[INFO] 
[INFO] --- exec-maven-plugin:1.4.0:java (compile-tzdb) @ joda-time ---
Writing zoneinfo files
Writing ZoneInfoMap
[INFO] 
[INFO] --- maven-resources-plugin:2.7:testResources (default-testResources) @ joda-time ---
[INFO] Using 'UTF-8' encoding to copy filtered resources.
[INFO] Copying 34 resources
[INFO] 
[INFO] --- maven-compiler-plugin:3.3:testCompile (default-testCompile) @ joda-time ---
[INFO] Nothing to compile - all classes are up to date
[INFO] 
[INFO] --- maven-surefire-plugin:2.18.1:test (default-test) @ joda-time ---
[INFO] Surefire report directory: /home/perham/Study/LittleDarwin/Cases/joda-time-2.8.1/target/surefire-reports

-------------------------------------------------------
 T E S T S
-------------------------------------------------------
Running org.joda.time.TestAllPackages

TestBuddhistChronology.testCalendar

TestCopticChronology.testCalendar

TestEthiopicChronology.testCalendar

TestIslamicChronology.testCalendar

Testing Gregorian chronology over 1000 iterations
100% complete (i=1000)

Testing Julian chronology over 1000 iterations
100% complete (i=1000)
Writing zoneinfo files
Writing ZoneInfoMap
Tests run: 4157, Failures: 0, Errors: 2, Skipped: 0, Time elapsed: 5.421 sec <<< FAILURE! - in org.joda.time.TestAllPackages
testProvider(org.joda.time.TestDateTimeZone)  Time elapsed: 0.045 sec  <<< ERROR!
java.lang.RuntimeException: java.io.IOException: File directory doesn't exist: src/test/resources/tzdata
	at org.joda.time.DateTimeZone.getDefaultProvider(DateTimeZone.java:506)
	at org.joda.time.DateTimeZone.setProvider(DateTimeZone.java:437)
	at org.joda.time.TestDateTimeZone.testProvider(TestDateTimeZone.java:501)
Caused by: java.io.IOException: File directory doesn't exist: src/test/resources/tzdata
	at org.joda.time.tz.ZoneInfoProvider.<init>(ZoneInfoProvider.java:27)
	at org.joda.time.DateTimeZone.getDefaultProvider(DateTimeZone.java:503)
	... 28 more

testCompile(org.joda.time.tz.TestCompiler)  Time elapsed: 0.023 sec  <<< ERROR!
java.io.IOException: File directory doesn't exist: /tmp/joda-test-5455574
	at org.joda.time.tz.ZoneInfoProvider.<init>(ZoneInfoProvider.java:27)
	at org.joda.time.tz.TestCompiler.compileAndLoad(TestCompiler.java:134)
	at org.joda.time.tz.TestCompiler.testCompile(TestCompiler.java:112)


Results :

Tests in error: 
  org.joda.time.TestDateTimeZone#testProvider RuntimeException java.io.IOExcepti...
  org.joda.time.tz.TestCompiler#testCompile IOException File directory doesn't e...

Tests run: 4157, Failures: 0, Errors: 2, Skipped: 0

[INFO] ------------------------------------------------------------------------
[INFO] BUILD FAILURE
[INFO] ------------------------------------------------------------------------
[INFO] Total time: 15.965s
[INFO] Finished at: Thu Aug 06 14:46:02 BST 2015
[INFO] Final Memory: 8M/216M
[INFO] ------------------------------------------------------------------------
[ERROR] Failed to execute goal org.apache.maven.plugins:maven-surefire-plugin:2.18.1:test (default-test) on project joda-time: There are test failures.
[ERROR] 
[ERROR] Please refer to /home/perham/Study/LittleDarwin/Cases/joda-time-2.8.1/target/surefire-reports for the individual test results.
[ERROR] -> [Help 1]
[ERROR] 
[ERROR] To see the full stack trace of the errors, re-run Maven with the -e switch.
[ERROR] Re-run Maven using the -X switch to enable full debug logging.
[ERROR] 
[ERROR] For more information about the errors and possible solutions, please read the following articles:
[ERROR] [Help 1] http://cwiki.apache.org/confluence/display/MAVEN/MojoFailureException
