[INFO] Scanning for projects...
[INFO]                                                                         
[INFO] ------------------------------------------------------------------------
[INFO] Building Joda-Time 2.8.1
[INFO] ------------------------------------------------------------------------
[INFO] 
[INFO] --- maven-resources-plugin:2.7:resources (default-resources) @ joda-time ---
[INFO] Using 'UTF-8' encoding to copy filtered resources.
[INFO] Copying 2 resources to META-INF
[INFO] Copying 10 resources
[INFO] 
[INFO] --- maven-compiler-plugin:3.3:compile (default-compile) @ joda-time ---
[INFO] Changes detected - recompiling the module!
[INFO] Compiling 166 source files to /home/perham/Study/LittleDarwin/Cases/joda-time-2.8.1/target/classes
[INFO] 
[INFO] --- exec-maven-plugin:1.4.0:java (compile-tzdb) @ joda-time ---
Usage: java org.joda.time.tz.ZoneInfoCompiler <options> <source files>
where possible options include:
  -src <directory>    Specify where to read source files
  -dst <directory>    Specify where to write generated files
  -verbose            Output verbosely (default false)
[INFO] 
[INFO] --- maven-resources-plugin:2.7:testResources (default-testResources) @ joda-time ---
[INFO] Using 'UTF-8' encoding to copy filtered resources.
[INFO] Copying 34 resources
[INFO] 
[INFO] --- maven-compiler-plugin:3.3:testCompile (default-testCompile) @ joda-time ---
[INFO] Nothing to compile - all classes are up to date
[INFO] 
[INFO] --- maven-surefire-plugin:2.18.1:test (default-test) @ joda-time ---
[INFO] Surefire report directory: /home/perham/Study/LittleDarwin/Cases/joda-time-2.8.1/target/surefire-reports

-------------------------------------------------------
 T E S T S
-------------------------------------------------------
Running org.joda.time.TestAllPackages

TestBuddhistChronology.testCalendar

TestCopticChronology.testCalendar

TestEthiopicChronology.testCalendar

TestIslamicChronology.testCalendar

Testing Gregorian chronology over 1000 iterations
100% complete (i=1000)

Testing Julian chronology over 1000 iterations
100% complete (i=1000)
Usage: java org.joda.time.tz.ZoneInfoCompiler <options> <source files>
where possible options include:
  -src <directory>    Specify where to read source files
  -dst <directory>    Specify where to write generated files
  -verbose            Output verbosely (default false)
Tests run: 4157, Failures: 0, Errors: 1, Skipped: 0, Time elapsed: 5.361 sec <<< FAILURE! - in org.joda.time.TestAllPackages
testCompile(org.joda.time.tz.TestCompiler)  Time elapsed: 0.006 sec  <<< ERROR!
java.io.FileNotFoundException: /tmp/joda-test-11927362/ZoneInfoMap (No such file or directory)
	at java.io.FileInputStream.open(Native Method)
	at java.io.FileInputStream.<init>(FileInputStream.java:146)
	at org.joda.time.tz.ZoneInfoProvider.openResource(ZoneInfoProvider.java:196)
	at org.joda.time.tz.ZoneInfoProvider.<init>(ZoneInfoProvider.java:74)
	at org.joda.time.tz.TestCompiler.compileAndLoad(TestCompiler.java:134)
	at org.joda.time.tz.TestCompiler.testCompile(TestCompiler.java:112)


Results :

Tests in error: 
  org.joda.time.tz.TestCompiler#testCompile FileNotFoundException /tmp/joda-test...

Tests run: 4157, Failures: 0, Errors: 1, Skipped: 0

[INFO] ------------------------------------------------------------------------
[INFO] BUILD FAILURE
[INFO] ------------------------------------------------------------------------
[INFO] Total time: 13.655s
[INFO] Finished at: Thu Aug 06 14:33:31 BST 2015
[INFO] Final Memory: 11M/341M
[INFO] ------------------------------------------------------------------------
[ERROR] Failed to execute goal org.apache.maven.plugins:maven-surefire-plugin:2.18.1:test (default-test) on project joda-time: There are test failures.
[ERROR] 
[ERROR] Please refer to /home/perham/Study/LittleDarwin/Cases/joda-time-2.8.1/target/surefire-reports for the individual test results.
[ERROR] -> [Help 1]
[ERROR] 
[ERROR] To see the full stack trace of the errors, re-run Maven with the -e switch.
[ERROR] Re-run Maven using the -X switch to enable full debug logging.
[ERROR] 
[ERROR] For more information about the errors and possible solutions, please read the following articles:
[ERROR] [Help 1] http://cwiki.apache.org/confluence/display/MAVEN/MojoFailureException
