[INFO] Scanning for projects...
[INFO]                                                                         
[INFO] ------------------------------------------------------------------------
[INFO] Building Joda-Time 2.8.1
[INFO] ------------------------------------------------------------------------
[INFO] 
[INFO] --- maven-resources-plugin:2.7:resources (default-resources) @ joda-time ---
[INFO] Using 'UTF-8' encoding to copy filtered resources.
[INFO] Copying 2 resources to META-INF
[INFO] Copying 10 resources
[INFO] 
[INFO] --- maven-compiler-plugin:3.3:compile (default-compile) @ joda-time ---
[INFO] Changes detected - recompiling the module!
[INFO] Compiling 166 source files to /home/perham/Study/LittleDarwin/Cases/joda-time-2.8.1/target/classes
[INFO] 
[INFO] --- exec-maven-plugin:1.4.0:java (compile-tzdb) @ joda-time ---
Writing zoneinfo files
*d* Error in EST 1850-01-01T00:00:00.000Z
*d* Error in MST 1850-01-01T00:00:00.000Z
*d* Error in HST 1850-01-01T00:00:00.000Z
*d* Error in Etc/GMT 1850-01-01T00:00:00.000Z
*d* Error in Etc/UTC 1850-01-01T00:00:00.000Z
*d* Error in Etc/UCT 1850-01-01T00:00:00.000Z
*d* Error in Etc/GMT-14 1850-01-01T00:00:00.000Z
*d* Error in Etc/GMT-13 1850-01-01T00:00:00.000Z
*d* Error in Etc/GMT-12 1850-01-01T00:00:00.000Z
*d* Error in Etc/GMT-11 1850-01-01T00:00:00.000Z
*d* Error in Etc/GMT-10 1850-01-01T00:00:00.000Z
*d* Error in Etc/GMT-9 1850-01-01T00:00:00.000Z
*d* Error in Etc/GMT-8 1850-01-01T00:00:00.000Z
*d* Error in Etc/GMT-7 1850-01-01T00:00:00.000Z
*d* Error in Etc/GMT-6 1850-01-01T00:00:00.000Z
*d* Error in Etc/GMT-5 1850-01-01T00:00:00.000Z
*d* Error in Etc/GMT-4 1850-01-01T00:00:00.000Z
*d* Error in Etc/GMT-3 1850-01-01T00:00:00.000Z
*d* Error in Etc/GMT-2 1850-01-01T00:00:00.000Z
*d* Error in Etc/GMT-1 1850-01-01T00:00:00.000Z
*d* Error in Etc/GMT+1 1850-01-01T00:00:00.000Z
*d* Error in Etc/GMT+2 1850-01-01T00:00:00.000Z
*d* Error in Etc/GMT+3 1850-01-01T00:00:00.000Z
*d* Error in Etc/GMT+4 1850-01-01T00:00:00.000Z
*d* Error in Etc/GMT+5 1850-01-01T00:00:00.000Z
*d* Error in Etc/GMT+6 1850-01-01T00:00:00.000Z
*d* Error in Etc/GMT+7 1850-01-01T00:00:00.000Z
*d* Error in Etc/GMT+8 1850-01-01T00:00:00.000Z
*d* Error in Etc/GMT+9 1850-01-01T00:00:00.000Z
*d* Error in Etc/GMT+10 1850-01-01T00:00:00.000Z
*d* Error in Etc/GMT+11 1850-01-01T00:00:00.000Z
*d* Error in Etc/GMT+12 1850-01-01T00:00:00.000Z
Cannot find time zone 'Etc/GMT' to link alias 'GMT' to
Cannot find time zone 'Etc/UTC' to link alias 'Etc/Universal' to
Cannot find time zone 'Etc/UTC' to link alias 'Etc/Zulu' to
Cannot find time zone 'Etc/GMT' to link alias 'Etc/Greenwich' to
Cannot find time zone 'Etc/GMT' to link alias 'Etc/GMT-0' to
Cannot find time zone 'Etc/GMT' to link alias 'Etc/GMT+0' to
Cannot find time zone 'Etc/GMT' to link alias 'Etc/GMT0' to
Cannot find time zone 'Etc/GMT' to link alias 'GMT+0' to
Cannot find time zone 'Etc/GMT' to link alias 'GMT-0' to
Cannot find time zone 'Etc/GMT' to link alias 'GMT0' to
Cannot find time zone 'Etc/GMT' to link alias 'Greenwich' to
Cannot find time zone 'Etc/UCT' to link alias 'UCT' to
Cannot find time zone 'Etc/UTC' to link alias 'UTC' to
Cannot find time zone 'Etc/UTC' to link alias 'Universal' to
Cannot find time zone 'Etc/UTC' to link alias 'Zulu' to
Writing ZoneInfoMap
[INFO] 
[INFO] --- maven-resources-plugin:2.7:testResources (default-testResources) @ joda-time ---
[INFO] Using 'UTF-8' encoding to copy filtered resources.
[INFO] Copying 34 resources
[INFO] 
[INFO] --- maven-compiler-plugin:3.3:testCompile (default-testCompile) @ joda-time ---
[INFO] Nothing to compile - all classes are up to date
[INFO] 
[INFO] --- maven-surefire-plugin:2.18.1:test (default-test) @ joda-time ---
[INFO] Surefire report directory: /home/perham/Study/LittleDarwin/Cases/joda-time-2.8.1/target/surefire-reports

-------------------------------------------------------
 T E S T S
-------------------------------------------------------
Running org.joda.time.TestAllPackages

TestBuddhistChronology.testCalendar

TestCopticChronology.testCalendar

TestEthiopicChronology.testCalendar

TestIslamicChronology.testCalendar

Testing Gregorian chronology over 1000 iterations
100% complete (i=1000)

Testing Julian chronology over 1000 iterations
100% complete (i=1000)
Writing zoneinfo files
Writing ZoneInfoMap
Tests run: 4157, Failures: 0, Errors: 8, Skipped: 0, Time elapsed: 5.449 sec <<< FAILURE! - in org.joda.time.TestAllPackages
testDurationFields(org.joda.time.chrono.TestBuddhistChronology)  Time elapsed: 0.004 sec  <<< ERROR!
java.lang.IllegalArgumentException: The datetime zone id 'Etc/GMT' is not recognised
	at org.joda.time.DateTimeZone.forID(DateTimeZone.java:229)
	at org.joda.time.chrono.TestBuddhistChronology.testDurationFields(TestBuddhistChronology.java:198)

testDurationFields(org.joda.time.chrono.TestCopticChronology)  Time elapsed: 0.002 sec  <<< ERROR!
java.lang.IllegalArgumentException: The datetime zone id 'Etc/GMT' is not recognised
	at org.joda.time.DateTimeZone.forID(DateTimeZone.java:229)
	at org.joda.time.chrono.TestCopticChronology.testDurationFields(TestCopticChronology.java:201)

testDurationFields(org.joda.time.chrono.TestEthiopicChronology)  Time elapsed: 0.001 sec  <<< ERROR!
java.lang.IllegalArgumentException: The datetime zone id 'Etc/GMT' is not recognised
	at org.joda.time.DateTimeZone.forID(DateTimeZone.java:229)
	at org.joda.time.chrono.TestEthiopicChronology.testDurationFields(TestEthiopicChronology.java:201)

testDurationFields(org.joda.time.chrono.TestGJChronology)  Time elapsed: 0.001 sec  <<< ERROR!
java.lang.IllegalArgumentException: The datetime zone id 'Etc/GMT' is not recognised
	at org.joda.time.DateTimeZone.forID(DateTimeZone.java:229)
	at org.joda.time.chrono.TestGJChronology.testDurationFields(TestGJChronology.java:252)

testDurationFields(org.joda.time.chrono.TestGregorianChronology)  Time elapsed: 0 sec  <<< ERROR!
java.lang.IllegalArgumentException: The datetime zone id 'Etc/GMT' is not recognised
	at org.joda.time.DateTimeZone.forID(DateTimeZone.java:229)
	at org.joda.time.chrono.TestGregorianChronology.testDurationFields(TestGregorianChronology.java:208)

testDurationFields(org.joda.time.chrono.TestIslamicChronology)  Time elapsed: 0.001 sec  <<< ERROR!
java.lang.IllegalArgumentException: The datetime zone id 'Etc/GMT' is not recognised
	at org.joda.time.DateTimeZone.forID(DateTimeZone.java:229)
	at org.joda.time.chrono.TestIslamicChronology.testDurationFields(TestIslamicChronology.java:198)

testDurationFields(org.joda.time.chrono.TestJulianChronology)  Time elapsed: 0.001 sec  <<< ERROR!
java.lang.IllegalArgumentException: The datetime zone id 'Etc/GMT' is not recognised
	at org.joda.time.DateTimeZone.forID(DateTimeZone.java:229)
	at org.joda.time.chrono.TestJulianChronology.testDurationFields(TestJulianChronology.java:205)

testDurationFields(org.joda.time.chrono.TestISOChronology)  Time elapsed: 0.001 sec  <<< ERROR!
java.lang.IllegalArgumentException: The datetime zone id 'Etc/GMT' is not recognised
	at org.joda.time.DateTimeZone.forID(DateTimeZone.java:229)
	at org.joda.time.chrono.TestISOChronology.testDurationFields(TestISOChronology.java:198)


Results :

Tests in error: 
  org.joda.time.chrono.TestBuddhistChronology#testDurationFields IllegalArgumentException
  org.joda.time.chrono.TestCopticChronology#testDurationFields IllegalArgumentException
  org.joda.time.chrono.TestEthiopicChronology#testDurationFields IllegalArgumentException
  org.joda.time.chrono.TestGJChronology#testDurationFields IllegalArgumentException
  org.joda.time.chrono.TestGregorianChronology#testDurationFields IllegalArgumentException
  org.joda.time.chrono.TestISOChronology#testDurationFields IllegalArgumentException
  org.joda.time.chrono.TestIslamicChronology#testDurationFields IllegalArgumentException
  org.joda.time.chrono.TestJulianChronology#testDurationFields IllegalArgumentException

Tests run: 4157, Failures: 0, Errors: 8, Skipped: 0

[INFO] ------------------------------------------------------------------------
[INFO] BUILD FAILURE
[INFO] ------------------------------------------------------------------------
[INFO] Total time: 15.889s
[INFO] Finished at: Thu Aug 06 14:31:44 BST 2015
[INFO] Final Memory: 9M/213M
[INFO] ------------------------------------------------------------------------
[ERROR] Failed to execute goal org.apache.maven.plugins:maven-surefire-plugin:2.18.1:test (default-test) on project joda-time: There are test failures.
[ERROR] 
[ERROR] Please refer to /home/perham/Study/LittleDarwin/Cases/joda-time-2.8.1/target/surefire-reports for the individual test results.
[ERROR] -> [Help 1]
[ERROR] 
[ERROR] To see the full stack trace of the errors, re-run Maven with the -e switch.
[ERROR] Re-run Maven using the -X switch to enable full debug logging.
[ERROR] 
[ERROR] For more information about the errors and possible solutions, please read the following articles:
[ERROR] [Help 1] http://cwiki.apache.org/confluence/display/MAVEN/MojoFailureException
