[INFO] Scanning for projects...
[INFO]                                                                         
[INFO] ------------------------------------------------------------------------
[INFO] Building Joda-Time 2.8.1
[INFO] ------------------------------------------------------------------------
[INFO] 
[INFO] --- maven-resources-plugin:2.7:resources (default-resources) @ joda-time ---
[INFO] Using 'UTF-8' encoding to copy filtered resources.
[INFO] Copying 2 resources to META-INF
[INFO] Copying 10 resources
[INFO] 
[INFO] --- maven-compiler-plugin:3.3:compile (default-compile) @ joda-time ---
[INFO] Changes detected - recompiling the module!
[INFO] Compiling 166 source files to /home/perham/Study/LittleDarwin/Cases/joda-time-2.8.1/target/classes
[INFO] 
[INFO] --- exec-maven-plugin:1.4.0:java (compile-tzdb) @ joda-time ---
Writing zoneinfo files
Writing ZoneInfoMap
[INFO] 
[INFO] --- maven-resources-plugin:2.7:testResources (default-testResources) @ joda-time ---
[INFO] Using 'UTF-8' encoding to copy filtered resources.
[INFO] Copying 34 resources
[INFO] 
[INFO] --- maven-compiler-plugin:3.3:testCompile (default-testCompile) @ joda-time ---
[INFO] Nothing to compile - all classes are up to date
[INFO] 
[INFO] --- maven-surefire-plugin:2.18.1:test (default-test) @ joda-time ---
[INFO] Surefire report directory: /home/perham/Study/LittleDarwin/Cases/joda-time-2.8.1/target/surefire-reports

-------------------------------------------------------
 T E S T S
-------------------------------------------------------
Running org.joda.time.TestAllPackages

TestBuddhistChronology.testCalendar

TestCopticChronology.testCalendar

TestEthiopicChronology.testCalendar

TestIslamicChronology.testCalendar

Testing Gregorian chronology over 1000 iterations
100% complete (i=1000)

Testing Julian chronology over 1000 iterations
100% complete (i=1000)
Writing zoneinfo files
Writing ZoneInfoMap
Tests run: 4157, Failures: 0, Errors: 8, Skipped: 0, Time elapsed: 5.482 sec <<< FAILURE! - in org.joda.time.TestAllPackages
testDurationFields(org.joda.time.chrono.TestBuddhistChronology)  Time elapsed: 0.004 sec  <<< ERROR!
java.lang.ArithmeticException: / by zero
	at org.joda.time.tz.FixedDateTimeZone.hashCode(FixedDateTimeZone.java:32)
	at java.util.concurrent.ConcurrentHashMap.hash(ConcurrentHashMap.java:333)
	at java.util.concurrent.ConcurrentHashMap.get(ConcurrentHashMap.java:988)
	at org.joda.time.chrono.BuddhistChronology.getInstance(BuddhistChronology.java:108)
	at org.joda.time.chrono.TestBuddhistChronology.testDurationFields(TestBuddhistChronology.java:199)

testDurationFields(org.joda.time.chrono.TestCopticChronology)  Time elapsed: 0.001 sec  <<< ERROR!
java.lang.ArithmeticException: / by zero
	at org.joda.time.tz.FixedDateTimeZone.hashCode(FixedDateTimeZone.java:32)
	at java.util.concurrent.ConcurrentHashMap.hash(ConcurrentHashMap.java:333)
	at java.util.concurrent.ConcurrentHashMap.get(ConcurrentHashMap.java:988)
	at org.joda.time.chrono.CopticChronology.getInstance(CopticChronology.java:122)
	at org.joda.time.chrono.CopticChronology.getInstance(CopticChronology.java:107)
	at org.joda.time.chrono.TestCopticChronology.testDurationFields(TestCopticChronology.java:202)

testDurationFields(org.joda.time.chrono.TestEthiopicChronology)  Time elapsed: 0.001 sec  <<< ERROR!
java.lang.ArithmeticException: / by zero
	at org.joda.time.tz.FixedDateTimeZone.hashCode(FixedDateTimeZone.java:32)
	at java.util.concurrent.ConcurrentHashMap.hash(ConcurrentHashMap.java:333)
	at java.util.concurrent.ConcurrentHashMap.get(ConcurrentHashMap.java:988)
	at org.joda.time.chrono.EthiopicChronology.getInstance(EthiopicChronology.java:122)
	at org.joda.time.chrono.EthiopicChronology.getInstance(EthiopicChronology.java:107)
	at org.joda.time.chrono.TestEthiopicChronology.testDurationFields(TestEthiopicChronology.java:202)

testDurationFields(org.joda.time.chrono.TestGJChronology)  Time elapsed: 0.001 sec  <<< ERROR!
java.lang.ArithmeticException: / by zero
	at org.joda.time.tz.FixedDateTimeZone.hashCode(FixedDateTimeZone.java:32)
	at java.util.concurrent.ConcurrentHashMap.hash(ConcurrentHashMap.java:333)
	at java.util.concurrent.ConcurrentHashMap.get(ConcurrentHashMap.java:988)
	at org.joda.time.chrono.GregorianChronology.getInstance(GregorianChronology.java:114)
	at org.joda.time.chrono.GregorianChronology.getInstance(GregorianChronology.java:99)
	at org.joda.time.chrono.GJChronology.getInstance(GJChronology.java:194)
	at org.joda.time.chrono.GJChronology.getInstance(GJChronology.java:154)
	at org.joda.time.chrono.TestGJChronology.testDurationFields(TestGJChronology.java:253)

testDurationFields(org.joda.time.chrono.TestGregorianChronology)  Time elapsed: 0 sec  <<< ERROR!
java.lang.ArithmeticException: / by zero
	at org.joda.time.tz.FixedDateTimeZone.hashCode(FixedDateTimeZone.java:32)
	at java.util.concurrent.ConcurrentHashMap.hash(ConcurrentHashMap.java:333)
	at java.util.concurrent.ConcurrentHashMap.get(ConcurrentHashMap.java:988)
	at org.joda.time.chrono.GregorianChronology.getInstance(GregorianChronology.java:114)
	at org.joda.time.chrono.GregorianChronology.getInstance(GregorianChronology.java:99)
	at org.joda.time.chrono.TestGregorianChronology.testDurationFields(TestGregorianChronology.java:209)

testDurationFields(org.joda.time.chrono.TestIslamicChronology)  Time elapsed: 0.001 sec  <<< ERROR!
java.lang.ArithmeticException: / by zero
	at org.joda.time.tz.FixedDateTimeZone.hashCode(FixedDateTimeZone.java:32)
	at java.util.concurrent.ConcurrentHashMap.hash(ConcurrentHashMap.java:333)
	at java.util.concurrent.ConcurrentHashMap.get(ConcurrentHashMap.java:988)
	at org.joda.time.chrono.IslamicChronology.getInstance(IslamicChronology.java:195)
	at org.joda.time.chrono.IslamicChronology.getInstance(IslamicChronology.java:180)
	at org.joda.time.chrono.TestIslamicChronology.testDurationFields(TestIslamicChronology.java:199)

testDurationFields(org.joda.time.chrono.TestJulianChronology)  Time elapsed: 0 sec  <<< ERROR!
java.lang.ArithmeticException: / by zero
	at org.joda.time.tz.FixedDateTimeZone.hashCode(FixedDateTimeZone.java:32)
	at java.util.concurrent.ConcurrentHashMap.hash(ConcurrentHashMap.java:333)
	at java.util.concurrent.ConcurrentHashMap.get(ConcurrentHashMap.java:988)
	at org.joda.time.chrono.JulianChronology.getInstance(JulianChronology.java:128)
	at org.joda.time.chrono.JulianChronology.getInstance(JulianChronology.java:113)
	at org.joda.time.chrono.TestJulianChronology.testDurationFields(TestJulianChronology.java:206)

testDurationFields(org.joda.time.chrono.TestISOChronology)  Time elapsed: 0.001 sec  <<< ERROR!
java.lang.ArithmeticException: / by zero
	at org.joda.time.tz.FixedDateTimeZone.hashCode(FixedDateTimeZone.java:32)
	at java.util.concurrent.ConcurrentHashMap.hash(ConcurrentHashMap.java:333)
	at java.util.concurrent.ConcurrentHashMap.get(ConcurrentHashMap.java:988)
	at org.joda.time.chrono.ISOChronology.getInstance(ISOChronology.java:92)
	at org.joda.time.chrono.TestISOChronology.testDurationFields(TestISOChronology.java:199)


Results :

Tests in error: 
  org.joda.time.chrono.TestBuddhistChronology#testDurationFields ArithmeticException
  org.joda.time.chrono.TestCopticChronology#testDurationFields ArithmeticException
  org.joda.time.chrono.TestEthiopicChronology#testDurationFields ArithmeticException
  org.joda.time.chrono.TestGJChronology#testDurationFields ArithmeticException /...
  org.joda.time.chrono.TestGregorianChronology#testDurationFields ArithmeticException
  org.joda.time.chrono.TestISOChronology#testDurationFields ArithmeticException ...
  org.joda.time.chrono.TestIslamicChronology#testDurationFields ArithmeticException
  org.joda.time.chrono.TestJulianChronology#testDurationFields ArithmeticException

Tests run: 4157, Failures: 0, Errors: 8, Skipped: 0

[INFO] ------------------------------------------------------------------------
[INFO] BUILD FAILURE
[INFO] ------------------------------------------------------------------------
[INFO] Total time: 16.424s
[INFO] Finished at: Thu Aug 06 14:06:55 BST 2015
[INFO] Final Memory: 9M/213M
[INFO] ------------------------------------------------------------------------
[ERROR] Failed to execute goal org.apache.maven.plugins:maven-surefire-plugin:2.18.1:test (default-test) on project joda-time: There are test failures.
[ERROR] 
[ERROR] Please refer to /home/perham/Study/LittleDarwin/Cases/joda-time-2.8.1/target/surefire-reports for the individual test results.
[ERROR] -> [Help 1]
[ERROR] 
[ERROR] To see the full stack trace of the errors, re-run Maven with the -e switch.
[ERROR] Re-run Maven using the -X switch to enable full debug logging.
[ERROR] 
[ERROR] For more information about the errors and possible solutions, please read the following articles:
[ERROR] [Help 1] http://cwiki.apache.org/confluence/display/MAVEN/MojoFailureException
