[INFO] Scanning for projects...
[INFO]                                                                         
[INFO] ------------------------------------------------------------------------
[INFO] Building Joda-Time 2.8.1
[INFO] ------------------------------------------------------------------------
[INFO] 
[INFO] --- maven-resources-plugin:2.7:resources (default-resources) @ joda-time ---
[INFO] Using 'UTF-8' encoding to copy filtered resources.
[INFO] Copying 2 resources to META-INF
[INFO] Copying 10 resources
[INFO] 
[INFO] --- maven-compiler-plugin:3.3:compile (default-compile) @ joda-time ---
[INFO] Changes detected - recompiling the module!
[INFO] Compiling 166 source files to /home/perham/Study/LittleDarwin/Cases/joda-time-2.8.1/target/classes
[INFO] 
[INFO] --- exec-maven-plugin:1.4.0:java (compile-tzdb) @ joda-time ---
Writing zoneinfo files
*e* Error in Africa/Algiers: Didn't read properly from file
*e* Error in Africa/Abidjan: Didn't read properly from file
*e* Error in Africa/Accra: Didn't read properly from file
*e* Error in Africa/Lagos: Didn't read properly from file
*e* Error in Africa/Tunis: Didn't read properly from file
*e* Error in Europe/London: Didn't read properly from file
*e* Error in Europe/Dublin: Didn't read properly from file
*e* Error in Europe/Andorra: Didn't read properly from file
*e* Error in Europe/Brussels: Didn't read properly from file
*e* Error in Atlantic/Faroe: Didn't read properly from file
*e* Error in Europe/Paris: Didn't read properly from file
*e* Error in Europe/Gibraltar: Didn't read properly from file
*e* Error in Europe/Luxembourg: Didn't read properly from file
*e* Error in Europe/Monaco: Didn't read properly from file
*e* Error in Europe/Amsterdam: Didn't read properly from file
*e* Error in Europe/Madrid: Didn't read properly from file
*e* Error in Africa/Ceuta: Didn't read properly from file
*e* Error in Europe/Zurich: Didn't read properly from file
*e* Error in Africa/Bamako: Didn't read properly from file
*e* Error in Africa/Banjul: Didn't read properly from file
*e* Error in Africa/Conakry: Didn't read properly from file
*e* Error in Africa/Dakar: Didn't read properly from file
*e* Error in Africa/Freetown: Didn't read properly from file
*e* Error in Africa/Lome: Didn't read properly from file
*e* Error in Africa/Nouakchott: Didn't read properly from file
*e* Error in Africa/Ouagadougou: Didn't read properly from file
*e* Error in Africa/Sao_Tome: Didn't read properly from file
*e* Error in Atlantic/St_Helena: Didn't read properly from file
*e* Error in Africa/Bangui: Didn't read properly from file
*e* Error in Africa/Brazzaville: Didn't read properly from file
*e* Error in Africa/Douala: Didn't read properly from file
*e* Error in Africa/Kinshasa: Didn't read properly from file
*e* Error in Africa/Libreville: Didn't read properly from file
*e* Error in Africa/Luanda: Didn't read properly from file
*e* Error in Africa/Malabo: Didn't read properly from file
*e* Error in Africa/Niamey: Didn't read properly from file
*e* Error in Africa/Porto-Novo: Didn't read properly from file
*e* Error in Europe/Jersey: Didn't read properly from file
*e* Error in Europe/Guernsey: Didn't read properly from file
*e* Error in Europe/Isle_of_Man: Didn't read properly from file
*e* Error in Europe/Busingen: Didn't read properly from file
*e* Error in Europe/Vaduz: Didn't read properly from file
Writing ZoneInfoMap
[INFO] 
[INFO] --- maven-resources-plugin:2.7:testResources (default-testResources) @ joda-time ---
[INFO] Using 'UTF-8' encoding to copy filtered resources.
[INFO] Copying 34 resources
[INFO] 
[INFO] --- maven-compiler-plugin:3.3:testCompile (default-testCompile) @ joda-time ---
[INFO] Nothing to compile - all classes are up to date
[INFO] 
[INFO] --- maven-surefire-plugin:2.18.1:test (default-test) @ joda-time ---
[INFO] Surefire report directory: /home/perham/Study/LittleDarwin/Cases/joda-time-2.8.1/target/surefire-reports

-------------------------------------------------------
 T E S T S
-------------------------------------------------------
Running org.joda.time.TestAllPackages

TestBuddhistChronology.testCalendar

TestCopticChronology.testCalendar

TestEthiopicChronology.testCalendar

TestIslamicChronology.testCalendar

Testing Gregorian chronology over 1000 iterations
100% complete (i=1000)

Testing Julian chronology over 1000 iterations
100% complete (i=1000)
Writing zoneinfo files
Writing ZoneInfoMap
Tests run: 4157, Failures: 3, Errors: 0, Skipped: 0, Time elapsed: 5.729 sec <<< FAILURE! - in org.joda.time.TestAllPackages
testParseDateTime_chrono(org.joda.time.format.TestDateTimeFormatter)  Time elapsed: 0.007 sec  <<< FAILURE!
junit.framework.AssertionFailedError: expected:<2004-06-09T10:29:51.000Z> but was:<2004-06-09T10:20:30.000Z>
	at junit.framework.Assert.fail(Assert.java:47)
	at junit.framework.Assert.failNotEquals(Assert.java:280)
	at junit.framework.Assert.assertEquals(Assert.java:64)
	at junit.framework.Assert.assertEquals(Assert.java:71)
	at org.joda.time.format.TestDateTimeFormatter.testParseDateTime_chrono(TestDateTimeFormatter.java:632)

testParseMutableDateTime_chrono(org.joda.time.format.TestDateTimeFormatter)  Time elapsed: 0.013 sec  <<< FAILURE!
junit.framework.AssertionFailedError: expected:<2004-06-09T10:29:51.000Z> but was:<2004-06-09T10:20:30.000Z>
	at junit.framework.Assert.fail(Assert.java:47)
	at junit.framework.Assert.failNotEquals(Assert.java:280)
	at junit.framework.Assert.assertEquals(Assert.java:64)
	at junit.framework.Assert.assertEquals(Assert.java:71)
	at org.joda.time.format.TestDateTimeFormatter.testParseMutableDateTime_chrono(TestDateTimeFormatter.java:727)

testParseInto_chrono(org.joda.time.format.TestDateTimeFormatter)  Time elapsed: 0 sec  <<< FAILURE!
junit.framework.AssertionFailedError: expected:<2004-06-09T10:29:51.000Z> but was:<2004-06-09T10:20:30.000Z>
	at junit.framework.Assert.fail(Assert.java:47)
	at junit.framework.Assert.failNotEquals(Assert.java:280)
	at junit.framework.Assert.assertEquals(Assert.java:64)
	at junit.framework.Assert.assertEquals(Assert.java:71)
	at org.joda.time.format.TestDateTimeFormatter.testParseInto_chrono(TestDateTimeFormatter.java:863)


Results :

Failed tests: 
  org.joda.time.format.TestDateTimeFormatter#testParseDateTime_chrono AssertionFailedError
  org.joda.time.format.TestDateTimeFormatter#testParseInto_chrono AssertionFailedError
  org.joda.time.format.TestDateTimeFormatter#testParseMutableDateTime_chrono AssertionFailedError

Tests run: 4157, Failures: 3, Errors: 0, Skipped: 0

[INFO] ------------------------------------------------------------------------
[INFO] BUILD FAILURE
[INFO] ------------------------------------------------------------------------
[INFO] Total time: 16.600s
[INFO] Finished at: Thu Aug 06 12:36:20 BST 2015
[INFO] Final Memory: 11M/338M
[INFO] ------------------------------------------------------------------------
[ERROR] Failed to execute goal org.apache.maven.plugins:maven-surefire-plugin:2.18.1:test (default-test) on project joda-time: There are test failures.
[ERROR] 
[ERROR] Please refer to /home/perham/Study/LittleDarwin/Cases/joda-time-2.8.1/target/surefire-reports for the individual test results.
[ERROR] -> [Help 1]
[ERROR] 
[ERROR] To see the full stack trace of the errors, re-run Maven with the -e switch.
[ERROR] Re-run Maven using the -X switch to enable full debug logging.
[ERROR] 
[ERROR] For more information about the errors and possible solutions, please read the following articles:
[ERROR] [Help 1] http://cwiki.apache.org/confluence/display/MAVEN/MojoFailureException
