[INFO] Scanning for projects...
[INFO]                                                                         
[INFO] ------------------------------------------------------------------------
[INFO] Building Joda-Time 2.8.1
[INFO] ------------------------------------------------------------------------
[INFO] 
[INFO] --- maven-resources-plugin:2.7:resources (default-resources) @ joda-time ---
[INFO] Using 'UTF-8' encoding to copy filtered resources.
[INFO] Copying 2 resources to META-INF
[INFO] Copying 10 resources
[INFO] 
[INFO] --- maven-compiler-plugin:3.3:compile (default-compile) @ joda-time ---
[INFO] Changes detected - recompiling the module!
[INFO] Compiling 166 source files to /home/perham/Study/LittleDarwin/Cases/joda-time-2.8.1/target/classes
[INFO] 
[INFO] --- exec-maven-plugin:1.4.0:java (compile-tzdb) @ joda-time ---
Writing zoneinfo files
*r* Error in Africa/Windhoek 2049-09-05T00:59:59.999Z != 1995-04-01T23:59:59.999Z
*r* Error in Asia/Baku 2049-10-30T23:59:59.999Z != 1997-10-25T23:59:59.999Z
*r* Error in Asia/Jerusalem 2049-10-30T22:59:59.999Z != 2013-10-26T22:59:59.999Z
*r* Error in Asia/Amman 2049-10-28T21:59:59.999Z != 2014-10-30T21:59:59.999Z
*r* Error in Asia/Hovd 2049-09-24T15:59:59.999Z != 2015-09-25T15:59:59.999Z
*r* Error in Asia/Ulaanbaatar 2049-09-24T14:59:59.999Z != 2015-09-25T14:59:59.999Z
*r* Error in Asia/Choibalsan 2049-09-24T14:59:59.999Z != 2015-09-25T14:59:59.999Z
*r* Error in Asia/Gaza 2049-10-21T20:59:59.999Z != 2015-03-27T21:59:59.999Z
*r* Error in Asia/Hebron 2049-10-21T20:59:59.999Z != 2015-03-27T21:59:59.999Z
*r* Error in Australia/Adelaide 2049-10-02T16:29:59.999Z != 2008-10-04T16:29:59.999Z
*r* Error in Australia/Melbourne 2049-10-02T15:59:59.999Z != 2008-10-04T15:59:59.999Z
*r* Error in Australia/Sydney 2049-10-02T15:59:59.999Z != 2008-10-04T15:59:59.999Z
*r* Error in Australia/Broken_Hill 2049-10-02T16:29:59.999Z != 2008-10-04T16:29:59.999Z
*r* Error in Australia/Lord_Howe 2049-10-02T15:29:59.999Z != 2008-10-04T15:29:59.999Z
*r* Error in Pacific/Fiji 2049-11-06T13:59:59.999Z != 2015-01-17T13:59:59.999Z
*r* Error in Pacific/Auckland 2049-09-25T13:59:59.999Z != 2008-04-05T13:59:59.999Z
*r* Error in Pacific/Chatham 2049-09-25T13:59:59.999Z != 2008-04-05T13:59:59.999Z
*r* Error in Pacific/Apia 2049-09-25T13:59:59.999Z != 2012-09-29T13:59:59.999Z
*r* Error in CET 2049-10-31T00:59:59.999Z != 1996-10-27T00:59:59.999Z
*r* Error in MET 2049-10-31T00:59:59.999Z != 1996-10-27T00:59:59.999Z
Cannot find source zone 'Pacific/Auckland' to link alias 'Antarctica/McMurdo' to
Cannot find time zone 'Pacific/Auckland' to link alias 'Antarctica/South_Pole' to
Cannot find time zone 'Asia/Jerusalem' to link alias 'Asia/Tel_Aviv' to
Cannot find time zone 'Asia/Ulaanbaatar' to link alias 'Asia/Ulan_Bator' to
Cannot find time zone 'Australia/Sydney' to link alias 'Australia/ACT' to
Cannot find time zone 'Australia/Sydney' to link alias 'Australia/Canberra' to
Cannot find time zone 'Australia/Lord_Howe' to link alias 'Australia/LHI' to
Cannot find time zone 'Australia/Sydney' to link alias 'Australia/NSW' to
Cannot find time zone 'Australia/Adelaide' to link alias 'Australia/South' to
Cannot find time zone 'Australia/Melbourne' to link alias 'Australia/Victoria' to
Cannot find time zone 'Australia/Broken_Hill' to link alias 'Australia/Yancowinna' to
Cannot find time zone 'Asia/Jerusalem' to link alias 'Israel' to
Cannot find time zone 'Pacific/Auckland' to link alias 'NZ' to
Cannot find time zone 'Pacific/Chatham' to link alias 'NZ-CHAT' to
Writing ZoneInfoMap
[INFO] 
[INFO] --- maven-resources-plugin:2.7:testResources (default-testResources) @ joda-time ---
[INFO] Using 'UTF-8' encoding to copy filtered resources.
[INFO] Copying 34 resources
[INFO] 
[INFO] --- maven-compiler-plugin:3.3:testCompile (default-testCompile) @ joda-time ---
[INFO] Nothing to compile - all classes are up to date
[INFO] 
[INFO] --- maven-surefire-plugin:2.18.1:test (default-test) @ joda-time ---
[INFO] Surefire report directory: /home/perham/Study/LittleDarwin/Cases/joda-time-2.8.1/target/surefire-reports

-------------------------------------------------------
 T E S T S
-------------------------------------------------------
Running org.joda.time.TestAllPackages

TestBuddhistChronology.testCalendar

TestCopticChronology.testCalendar

TestEthiopicChronology.testCalendar

TestIslamicChronology.testCalendar

Testing Gregorian chronology over 1000 iterations
100% complete (i=1000)

Testing Julian chronology over 1000 iterations
100% complete (i=1000)
Writing zoneinfo files
Writing ZoneInfoMap
Tests run: 4157, Failures: 27, Errors: 10, Skipped: 0, Time elapsed: 5.273 sec <<< FAILURE! - in org.joda.time.TestAllPackages
testPropertyWithMinimumValueMillisOfDayDSTGap(org.joda.time.TestDateTime_Properties)  Time elapsed: 0.004 sec  <<< ERROR!
java.lang.IllegalArgumentException: The datetime zone id 'Asia/Gaza' is not recognised
	at org.joda.time.DateTimeZone.forID(DateTimeZone.java:229)
	at org.joda.time.TestDateTime_Properties.testPropertyWithMinimumValueMillisOfDayDSTGap(TestDateTime_Properties.java:662)

testToInterval_Zone_noMidnight(org.joda.time.TestLocalDate_Basics)  Time elapsed: 0.001 sec  <<< ERROR!
java.lang.IllegalArgumentException: The datetime zone id 'Asia/Gaza' is not recognised
	at org.joda.time.DateTimeZone.forID(DateTimeZone.java:229)
	at org.joda.time.TestLocalDate_Basics.testToInterval_Zone_noMidnight(TestLocalDate_Basics.java:982)

testPatchedNameKeysSydney(org.joda.time.TestDateTimeZone)  Time elapsed: 0.001 sec  <<< ERROR!
java.lang.IllegalArgumentException: The datetime zone id 'Australia/Sydney' is not recognised
	at org.joda.time.DateTimeZone.forID(DateTimeZone.java:229)
	at org.joda.time.TestDateTimeZone.testPatchedNameKeysSydney(TestDateTimeZone.java:1078)

testPatchedNameKeysSydneyHistoric(org.joda.time.TestDateTimeZone)  Time elapsed: 0 sec  <<< ERROR!
java.lang.IllegalArgumentException: The datetime zone id 'Australia/Sydney' is not recognised
	at org.joda.time.DateTimeZone.forID(DateTimeZone.java:229)
	at org.joda.time.TestDateTimeZone.testPatchedNameKeysSydneyHistoric(TestDateTimeZone.java:1088)

testForID_String_old(org.joda.time.TestDateTimeZone)  Time elapsed: 0.002 sec  <<< ERROR!
java.lang.IllegalArgumentException: The datetime zone id 'CET' is not recognised
	at org.joda.time.DateTimeZone.forTimeZone(DateTimeZone.java:374)
	at org.joda.time.TestDateTimeZone.testForID_String_old(TestDateTimeZone.java:282)

test_MoscowIsCorrect_Spring(org.joda.time.TestDateTimeZoneCutover)  Time elapsed: 0.001 sec  <<< FAILURE!
junit.framework.ComparisonFailure: expected:<2007-03-25T0[3:00:00.000+04]:00> but was:<2007-03-25T0[2:00:00.000+03]:00>
	at junit.framework.Assert.assertEquals(Assert.java:81)
	at junit.framework.Assert.assertEquals(Assert.java:87)
	at org.joda.time.TestDateTimeZoneCutover.test_MoscowIsCorrect_Spring(TestDateTimeZoneCutover.java:824)

test_getOffsetFromLocal_Moscow_Spring(org.joda.time.TestDateTimeZoneCutover)  Time elapsed: 0.001 sec  <<< FAILURE!
junit.framework.ComparisonFailure: 2007-03-25T02:00:00.000+03:00 expected:<2007-03-25T0[3:00:00.000+04]:00> but was:<2007-03-25T0[2:00:00.000+03]:00>
	at junit.framework.Assert.assertEquals(Assert.java:81)
	at org.joda.time.TestDateTimeZoneCutover.doTest_getOffsetFromLocal(TestDateTimeZoneCutover.java:1371)
	at org.joda.time.TestDateTimeZoneCutover.doTest_getOffsetFromLocal(TestDateTimeZoneCutover.java:1355)
	at org.joda.time.TestDateTimeZoneCutover.test_getOffsetFromLocal_Moscow_Spring(TestDateTimeZoneCutover.java:833)

test_DateTime_setHourAcross_Moscow_Spring(org.joda.time.TestDateTimeZoneCutover)  Time elapsed: 0 sec  <<< FAILURE!
junit.framework.ComparisonFailure: expected:<...03-25T04:00:00.000+0[4]:00> but was:<...03-25T04:00:00.000+0[3]:00>
	at junit.framework.Assert.assertEquals(Assert.java:81)
	at junit.framework.Assert.assertEquals(Assert.java:87)
	at org.joda.time.TestDateTimeZoneCutover.test_DateTime_setHourAcross_Moscow_Spring(TestDateTimeZoneCutover.java:849)

test_DateTime_setHourForward_Moscow_Spring(org.joda.time.TestDateTimeZoneCutover)  Time elapsed: 0.001 sec  <<< FAILURE!
junit.framework.AssertionFailedError
	at junit.framework.Assert.fail(Assert.java:47)
	at junit.framework.Assert.fail(Assert.java:53)
	at org.joda.time.TestDateTimeZoneCutover.test_DateTime_setHourForward_Moscow_Spring(TestDateTimeZoneCutover.java:858)

test_DateTime_setHourBack_Moscow_Spring(org.joda.time.TestDateTimeZoneCutover)  Time elapsed: 0 sec  <<< FAILURE!
junit.framework.ComparisonFailure: expected:<...03-25T08:00:00.000+0[4]:00> but was:<...03-25T08:00:00.000+0[3]:00>
	at junit.framework.Assert.assertEquals(Assert.java:81)
	at junit.framework.Assert.assertEquals(Assert.java:87)
	at org.joda.time.TestDateTimeZoneCutover.test_DateTime_setHourBack_Moscow_Spring(TestDateTimeZoneCutover.java:866)

test_MoscowIsCorrect_Autumn(org.joda.time.TestDateTimeZoneCutover)  Time elapsed: 0.001 sec  <<< FAILURE!
junit.framework.ComparisonFailure: expected:<2007-10-28T0[2:59:59.999+04]:00> but was:<2007-10-28T0[1:59:59.999+03]:00>
	at junit.framework.Assert.assertEquals(Assert.java:81)
	at junit.framework.Assert.assertEquals(Assert.java:87)
	at org.joda.time.TestDateTimeZoneCutover.test_MoscowIsCorrect_Autumn(TestDateTimeZoneCutover.java:883)

test_getOffsetFromLocal_Moscow_Autumn(org.joda.time.TestDateTimeZoneCutover)  Time elapsed: 0 sec  <<< FAILURE!
junit.framework.AssertionFailedError: expected:<14400000> but was:<10800000>
	at junit.framework.Assert.fail(Assert.java:47)
	at junit.framework.Assert.failNotEquals(Assert.java:280)
	at junit.framework.Assert.assertEquals(Assert.java:64)
	at junit.framework.Assert.assertEquals(Assert.java:133)
	at junit.framework.Assert.assertEquals(Assert.java:139)
	at org.joda.time.TestDateTimeZoneCutover.doTest_getOffsetFromLocal(TestDateTimeZoneCutover.java:1369)
	at org.joda.time.TestDateTimeZoneCutover.doTest_getOffsetFromLocal(TestDateTimeZoneCutover.java:1355)
	at org.joda.time.TestDateTimeZoneCutover.test_getOffsetFromLocal_Moscow_Autumn(TestDateTimeZoneCutover.java:891)

test_getOffsetFromLocal_Moscow_Autumn_overlap_mins(org.joda.time.TestDateTimeZoneCutover)  Time elapsed: 0.001 sec  <<< FAILURE!
junit.framework.AssertionFailedError: expected:<14400000> but was:<10800000>
	at junit.framework.Assert.fail(Assert.java:47)
	at junit.framework.Assert.failNotEquals(Assert.java:280)
	at junit.framework.Assert.assertEquals(Assert.java:64)
	at junit.framework.Assert.assertEquals(Assert.java:133)
	at junit.framework.Assert.assertEquals(Assert.java:139)
	at org.joda.time.TestDateTimeZoneCutover.doTest_getOffsetFromLocal(TestDateTimeZoneCutover.java:1369)
	at org.joda.time.TestDateTimeZoneCutover.doTest_getOffsetFromLocal(TestDateTimeZoneCutover.java:1355)
	at org.joda.time.TestDateTimeZoneCutover.test_getOffsetFromLocal_Moscow_Autumn_overlap_mins(TestDateTimeZoneCutover.java:914)

test_DateTime_constructor_Moscow_Autumn(org.joda.time.TestDateTimeZoneCutover)  Time elapsed: 0 sec  <<< FAILURE!
junit.framework.ComparisonFailure: expected:<...10-28T02:30:00.000+0[4]:00> but was:<...10-28T02:30:00.000+0[3]:00>
	at junit.framework.Assert.assertEquals(Assert.java:81)
	at junit.framework.Assert.assertEquals(Assert.java:87)
	at org.joda.time.TestDateTimeZoneCutover.test_DateTime_constructor_Moscow_Autumn(TestDateTimeZoneCutover.java:923)

test_DateTime_plusHour_Moscow_Autumn(org.joda.time.TestDateTimeZoneCutover)  Time elapsed: 0.001 sec  <<< FAILURE!
junit.framework.ComparisonFailure: expected:<...10-27T19:00:00.000+0[4]:00> but was:<...10-27T19:00:00.000+0[3]:00>
	at junit.framework.Assert.assertEquals(Assert.java:81)
	at junit.framework.Assert.assertEquals(Assert.java:87)
	at org.joda.time.TestDateTimeZoneCutover.test_DateTime_plusHour_Moscow_Autumn(TestDateTimeZoneCutover.java:928)

test_DateTime_minusHour_Moscow_Autumn(org.joda.time.TestDateTimeZoneCutover)  Time elapsed: 0.001 sec  <<< FAILURE!
junit.framework.ComparisonFailure: expected:<2007-10-28T0[2:00:00.000+04]:00> but was:<2007-10-28T0[1:00:00.000+03]:00>
	at junit.framework.Assert.assertEquals(Assert.java:81)
	at junit.framework.Assert.assertEquals(Assert.java:87)
	at org.joda.time.TestDateTimeZoneCutover.test_DateTime_minusHour_Moscow_Autumn(TestDateTimeZoneCutover.java:949)

testBug2182444_ausNSW(org.joda.time.TestDateTimeZoneCutover)  Time elapsed: 0 sec  <<< ERROR!
java.lang.IllegalArgumentException: The datetime zone id 'Australia/NSW' is not recognised
	at org.joda.time.DateTimeZone.forID(DateTimeZone.java:229)
	at org.joda.time.TestDateTimeZoneCutover.testBug2182444_ausNSW(TestDateTimeZoneCutover.java:1228)

testFormat_hourOfHalfday(org.joda.time.format.TestDateTimeFormat)  Time elapsed: 0.004 sec  <<< FAILURE!
junit.framework.ComparisonFailure: 2004-06-09T20:20:30.040+10:00 expected:<[7]> but was:<[8]>
	at junit.framework.Assert.assertEquals(Assert.java:81)
	at org.joda.time.format.TestDateTimeFormat.testFormat_hourOfHalfday(TestDateTimeFormat.java:647)

testFormat_clockhourOfHalfday(org.joda.time.format.TestDateTimeFormat)  Time elapsed: 0 sec  <<< FAILURE!
junit.framework.ComparisonFailure: 2004-06-09T20:20:30.040+10:00 expected:<[7]> but was:<[8]>
	at junit.framework.Assert.assertEquals(Assert.java:81)
	at org.joda.time.format.TestDateTimeFormat.testFormat_clockhourOfHalfday(TestDateTimeFormat.java:663)

testFormat_hourOfDay(org.joda.time.format.TestDateTimeFormat)  Time elapsed: 0 sec  <<< FAILURE!
junit.framework.ComparisonFailure: 2004-06-09T20:20:30.040+10:00 expected:<[19]> but was:<[20]>
	at junit.framework.Assert.assertEquals(Assert.java:81)
	at org.joda.time.format.TestDateTimeFormat.testFormat_hourOfDay(TestDateTimeFormat.java:679)

testFormat_clockhourOfDay(org.joda.time.format.TestDateTimeFormat)  Time elapsed: 0 sec  <<< FAILURE!
junit.framework.ComparisonFailure: 2004-06-09T20:20:30.040+10:00 expected:<[19]> but was:<[20]>
	at junit.framework.Assert.assertEquals(Assert.java:81)
	at org.joda.time.format.TestDateTimeFormat.testFormat_clockhourOfDay(TestDateTimeFormat.java:695)

testFormat_zoneText(org.joda.time.format.TestDateTimeFormat)  Time elapsed: 0 sec  <<< FAILURE!
junit.framework.ComparisonFailure: 2004-06-09T20:20:30.040+10:00 expected:<J[S]T> but was:<J[D]T>
	at junit.framework.Assert.assertEquals(Assert.java:81)
	at org.joda.time.format.TestDateTimeFormat.testFormat_zoneText(TestDateTimeFormat.java:763)

testFormat_zoneLongText(org.joda.time.format.TestDateTimeFormat)  Time elapsed: 0.001 sec  <<< FAILURE!
junit.framework.ComparisonFailure: 2004-06-09T20:20:30.040+10:00 expected:<Japan [Standard] Time> but was:<Japan [Daylight] Time>
	at junit.framework.Assert.assertEquals(Assert.java:81)
	at org.joda.time.format.TestDateTimeFormat.testFormat_zoneLongText(TestDateTimeFormat.java:775)

testFormat_zoneAmount(org.joda.time.format.TestDateTimeFormat)  Time elapsed: 0 sec  <<< FAILURE!
junit.framework.ComparisonFailure: 2004-06-09T20:20:30.040+10:00 expected:<+[09]00> but was:<+[10]00>
	at junit.framework.Assert.assertEquals(Assert.java:81)
	at org.joda.time.format.TestDateTimeFormat.testFormat_zoneAmount(TestDateTimeFormat.java:788)

testFormat_zoneAmountColon(org.joda.time.format.TestDateTimeFormat)  Time elapsed: 0.001 sec  <<< FAILURE!
junit.framework.ComparisonFailure: 2004-06-09T20:20:30.040+10:00 expected:<+[09]:00> but was:<+[10]:00>
	at junit.framework.Assert.assertEquals(Assert.java:81)
	at org.joda.time.format.TestDateTimeFormat.testFormat_zoneAmountColon(TestDateTimeFormat.java:800)

test_printParseOffset(org.joda.time.format.TestDateTimeFormatterBuilder)  Time elapsed: 0.001 sec  <<< FAILURE!
junit.framework.ComparisonFailure: expected:<2007-03-04 12:30 +[09]:00> but was:<2007-03-04 12:30 +[10]:00>
	at junit.framework.Assert.assertEquals(Assert.java:81)
	at junit.framework.Assert.assertEquals(Assert.java:87)
	at org.joda.time.format.TestDateTimeFormatterBuilder.test_printParseOffset(TestDateTimeFormatterBuilder.java:454)

test_printParseOffsetAndZone(org.joda.time.format.TestDateTimeFormatterBuilder)  Time elapsed: 0.001 sec  <<< FAILURE!
junit.framework.ComparisonFailure: expected:<2007-03-04 12:30 +[09]:00 Asia/Tokyo> but was:<2007-03-04 12:30 +[10]:00 Asia/Tokyo>
	at junit.framework.Assert.assertEquals(Assert.java:81)
	at junit.framework.Assert.assertEquals(Assert.java:87)
	at org.joda.time.format.TestDateTimeFormatterBuilder.test_printParseOffsetAndZone(TestDateTimeFormatterBuilder.java:466)

test_localPrintParseOffset(org.joda.time.format.TestDateTimeFormatterBuilder)  Time elapsed: 0.001 sec  <<< FAILURE!
junit.framework.ComparisonFailure: expected:<2007-03-04 12:30 +[09]:00> but was:<2007-03-04 12:30 +[10]:00>
	at junit.framework.Assert.assertEquals(Assert.java:81)
	at junit.framework.Assert.assertEquals(Assert.java:87)
	at org.joda.time.format.TestDateTimeFormatterBuilder.test_localPrintParseOffset(TestDateTimeFormatterBuilder.java:519)

test_localPrintParseOffsetAndZone(org.joda.time.format.TestDateTimeFormatterBuilder)  Time elapsed: 0.001 sec  <<< FAILURE!
junit.framework.ComparisonFailure: expected:<2007-03-04 12:30 +[09]:00 Asia/Tokyo> but was:<2007-03-04 12:30 +[10]:00 Asia/Tokyo>
	at junit.framework.Assert.assertEquals(Assert.java:81)
	at junit.framework.Assert.assertEquals(Assert.java:87)
	at org.joda.time.format.TestDateTimeFormatterBuilder.test_localPrintParseOffsetAndZone(TestDateTimeFormatterBuilder.java:533)

testSerialization(org.joda.time.tz.TestBuilder)  Time elapsed: 0.007 sec  <<< FAILURE!
junit.framework.AssertionFailedError: expected:<-662655600000> but was:<-608137200000>
	at junit.framework.Assert.fail(Assert.java:47)
	at junit.framework.Assert.failNotEquals(Assert.java:280)
	at junit.framework.Assert.assertEquals(Assert.java:64)
	at junit.framework.Assert.assertEquals(Assert.java:133)
	at junit.framework.Assert.assertEquals(Assert.java:139)
	at org.joda.time.tz.TestBuilder.testForwardTransitions(TestBuilder.java:234)
	at org.joda.time.tz.TestBuilder.testSerialization(TestBuilder.java:282)

testReverseTransitions(org.joda.time.tz.TestBuilder)  Time elapsed: 0.021 sec  <<< FAILURE!
junit.framework.AssertionFailedError: expected:<-620834400001> but was:<-687967200001>
	at junit.framework.Assert.fail(Assert.java:47)
	at junit.framework.Assert.failNotEquals(Assert.java:280)
	at junit.framework.Assert.assertEquals(Assert.java:64)
	at junit.framework.Assert.assertEquals(Assert.java:133)
	at junit.framework.Assert.assertEquals(Assert.java:139)
	at org.joda.time.tz.TestBuilder.testReverseTransitions(TestBuilder.java:270)
	at org.joda.time.tz.TestBuilder.testReverseTransitions(TestBuilder.java:255)

testForwardTransitions(org.joda.time.tz.TestBuilder)  Time elapsed: 0.005 sec  <<< FAILURE!
junit.framework.AssertionFailedError: expected:<-662655600000> but was:<-608137200000>
	at junit.framework.Assert.fail(Assert.java:47)
	at junit.framework.Assert.failNotEquals(Assert.java:280)
	at junit.framework.Assert.assertEquals(Assert.java:64)
	at junit.framework.Assert.assertEquals(Assert.java:133)
	at junit.framework.Assert.assertEquals(Assert.java:139)
	at org.joda.time.tz.TestBuilder.testForwardTransitions(TestBuilder.java:234)
	at org.joda.time.tz.TestBuilder.testForwardTransitions(TestBuilder.java:217)

testCompile(org.joda.time.tz.TestCompiler)  Time elapsed: 0.035 sec  <<< FAILURE!
junit.framework.AssertionFailedError: expected:<-662655600000> but was:<-608137200000>
	at junit.framework.Assert.fail(Assert.java:47)
	at junit.framework.Assert.failNotEquals(Assert.java:280)
	at junit.framework.Assert.assertEquals(Assert.java:64)
	at junit.framework.Assert.assertEquals(Assert.java:133)
	at junit.framework.Assert.assertEquals(Assert.java:139)
	at org.joda.time.tz.TestBuilder.testForwardTransitions(TestBuilder.java:234)
	at org.joda.time.tz.TestCompiler.testCompile(TestCompiler.java:117)

test_Amman_2003(org.joda.time.tz.TestCompiler)  Time elapsed: 0 sec  <<< ERROR!
java.lang.IllegalArgumentException: The datetime zone id 'Asia/Amman' is not recognised
	at org.joda.time.DateTimeZone.forID(DateTimeZone.java:229)
	at org.joda.time.tz.TestCompiler.test_Amman_2003(TestCompiler.java:207)

test_Amman_2004(org.joda.time.tz.TestCompiler)  Time elapsed: 0 sec  <<< ERROR!
java.lang.IllegalArgumentException: The datetime zone id 'Asia/Amman' is not recognised
	at org.joda.time.DateTimeZone.forID(DateTimeZone.java:229)
	at org.joda.time.tz.TestCompiler.test_Amman_2004(TestCompiler.java:214)

test_Amman_2005(org.joda.time.tz.TestCompiler)  Time elapsed: 0.001 sec  <<< ERROR!
java.lang.IllegalArgumentException: The datetime zone id 'Asia/Amman' is not recognised
	at org.joda.time.DateTimeZone.forID(DateTimeZone.java:229)
	at org.joda.time.tz.TestCompiler.test_Amman_2005(TestCompiler.java:221)

test_Amman_2006(org.joda.time.tz.TestCompiler)  Time elapsed: 0.002 sec  <<< ERROR!
java.lang.IllegalArgumentException: The datetime zone id 'Asia/Amman' is not recognised
	at org.joda.time.DateTimeZone.forID(DateTimeZone.java:229)
	at org.joda.time.tz.TestCompiler.test_Amman_2006(TestCompiler.java:228)


Results :

Failed tests: 
  org.joda.time.TestDateTimeZoneCutover#test_DateTime_constructor_Moscow_Autumn ComparisonFailure
  org.joda.time.TestDateTimeZoneCutover#test_DateTime_minusHour_Moscow_Autumn ComparisonFailure
  org.joda.time.TestDateTimeZoneCutover#test_DateTime_plusHour_Moscow_Autumn ComparisonFailure
  org.joda.time.TestDateTimeZoneCutover#test_DateTime_setHourAcross_Moscow_Spring ComparisonFailure
  org.joda.time.TestDateTimeZoneCutover#test_DateTime_setHourBack_Moscow_Spring ComparisonFailure
  org.joda.time.TestDateTimeZoneCutover#test_DateTime_setHourForward_Moscow_Spring AssertionFailedError
  org.joda.time.TestDateTimeZoneCutover#test_MoscowIsCorrect_Autumn ComparisonFailure
  org.joda.time.TestDateTimeZoneCutover#test_MoscowIsCorrect_Spring ComparisonFailure
  org.joda.time.TestDateTimeZoneCutover#test_getOffsetFromLocal_Moscow_Autumn AssertionFailedError
  org.joda.time.TestDateTimeZoneCutover#test_getOffsetFromLocal_Moscow_Autumn_overlap_mins AssertionFailedError
  org.joda.time.TestDateTimeZoneCutover#test_getOffsetFromLocal_Moscow_Spring ComparisonFailure
  org.joda.time.format.TestDateTimeFormat#testFormat_clockhourOfDay ComparisonFailure
  org.joda.time.format.TestDateTimeFormat#testFormat_clockhourOfHalfday ComparisonFailure
  org.joda.time.format.TestDateTimeFormat#testFormat_hourOfDay ComparisonFailure
  org.joda.time.format.TestDateTimeFormat#testFormat_hourOfHalfday ComparisonFailure
  org.joda.time.format.TestDateTimeFormat#testFormat_zoneAmount ComparisonFailure
  org.joda.time.format.TestDateTimeFormat#testFormat_zoneAmountColon ComparisonFailure
  org.joda.time.format.TestDateTimeFormat#testFormat_zoneLongText ComparisonFailure
  org.joda.time.format.TestDateTimeFormat#testFormat_zoneText ComparisonFailure ...
  org.joda.time.format.TestDateTimeFormatterBuilder#test_localPrintParseOffset ComparisonFailure
  org.joda.time.format.TestDateTimeFormatterBuilder#test_localPrintParseOffsetAndZone ComparisonFailure
  org.joda.time.format.TestDateTimeFormatterBuilder#test_printParseOffset ComparisonFailure
  org.joda.time.format.TestDateTimeFormatterBuilder#test_printParseOffsetAndZone ComparisonFailure
  org.joda.time.tz.TestBuilder#testForwardTransitions AssertionFailedError expec...
  org.joda.time.tz.TestBuilder#testReverseTransitions AssertionFailedError expec...
  org.joda.time.tz.TestBuilder#testSerialization AssertionFailedError expected:<...
  org.joda.time.tz.TestCompiler#testCompile AssertionFailedError expected:<-6626...
Tests in error: 
  org.joda.time.TestDateTimeZone#testForID_String_old IllegalArgumentException T...
  org.joda.time.TestDateTimeZone#testPatchedNameKeysSydney IllegalArgumentException
  org.joda.time.TestDateTimeZone#testPatchedNameKeysSydneyHistoric IllegalArgumentException
  org.joda.time.TestDateTimeZoneCutover#testBug2182444_ausNSW IllegalArgumentException
  org.joda.time.TestDateTime_Properties#testPropertyWithMinimumValueMillisOfDayDSTGap IllegalArgumentException
  org.joda.time.TestLocalDate_Basics#testToInterval_Zone_noMidnight IllegalArgumentException
  org.joda.time.tz.TestCompiler#test_Amman_2003 IllegalArgumentException The dat...
  org.joda.time.tz.TestCompiler#test_Amman_2004 IllegalArgumentException The dat...
  org.joda.time.tz.TestCompiler#test_Amman_2005 IllegalArgumentException The dat...
  org.joda.time.tz.TestCompiler#test_Amman_2006 IllegalArgumentException The dat...

Tests run: 4157, Failures: 27, Errors: 10, Skipped: 0

[INFO] ------------------------------------------------------------------------
[INFO] BUILD FAILURE
[INFO] ------------------------------------------------------------------------
[INFO] Total time: 15.889s
[INFO] Finished at: Thu Aug 06 13:52:39 BST 2015
[INFO] Final Memory: 9M/213M
[INFO] ------------------------------------------------------------------------
[ERROR] Failed to execute goal org.apache.maven.plugins:maven-surefire-plugin:2.18.1:test (default-test) on project joda-time: There are test failures.
[ERROR] 
[ERROR] Please refer to /home/perham/Study/LittleDarwin/Cases/joda-time-2.8.1/target/surefire-reports for the individual test results.
[ERROR] -> [Help 1]
[ERROR] 
[ERROR] To see the full stack trace of the errors, re-run Maven with the -e switch.
[ERROR] Re-run Maven using the -X switch to enable full debug logging.
[ERROR] 
[ERROR] For more information about the errors and possible solutions, please read the following articles:
[ERROR] [Help 1] http://cwiki.apache.org/confluence/display/MAVEN/MojoFailureException
