[INFO] Scanning for projects...
[INFO]                                                                         
[INFO] ------------------------------------------------------------------------
[INFO] Building Joda-Time 2.8.1
[INFO] ------------------------------------------------------------------------
[INFO] 
[INFO] --- maven-resources-plugin:2.7:resources (default-resources) @ joda-time ---
[INFO] Using 'UTF-8' encoding to copy filtered resources.
[INFO] Copying 2 resources to META-INF
[INFO] Copying 10 resources
[INFO] 
[INFO] --- maven-compiler-plugin:3.3:compile (default-compile) @ joda-time ---
[INFO] Changes detected - recompiling the module!
[INFO] Compiling 166 source files to /home/perham/Study/LittleDarwin/Cases/joda-time-2.8.1/target/classes
[INFO] 
[INFO] --- exec-maven-plugin:1.4.0:java (compile-tzdb) @ joda-time ---
Writing zoneinfo files
*d* Error in Asia/Baku 1997-03-30T01:00:00.000Z
*d* Error in Asia/Tbilisi 2005-10-29T19:00:00.000Z
*r* Error in Asia/Aqtau 2004-10-30T21:59:59.999Z != 2005-03-14T18:59:59.999Z
*r* Error in Asia/Oral 2004-10-30T21:59:59.999Z != 2005-03-14T18:59:59.999Z
*r* Error in Europe/Sofia 1997-03-29T21:59:59.999Z != 1997-03-30T00:59:59.999Z
*r* Error in Europe/Tallinn 2002-03-30T23:59:59.999Z != 2002-03-31T00:59:59.999Z
*r* Error in Europe/Vilnius 2003-03-29T23:59:59.999Z != 2003-03-30T00:59:59.999Z
*r* Error in Europe/Chisinau 1997-03-29T21:59:59.999Z != 1997-03-30T00:59:59.999Z
*r* Error in Europe/Bucharest 1997-03-29T21:59:59.999Z != 1997-03-30T00:59:59.999Z
*r* Error in Europe/Simferopol 2014-10-25T19:59:59.999Z != 2014-10-25T21:59:59.999Z
*r* Error in America/North_Dakota/Beulah 2010-11-07T07:59:59.999Z != 2011-03-13T07:59:59.999Z
*r* Error in America/Indiana/Vincennes 2007-11-04T06:59:59.999Z != 2008-03-09T06:59:59.999Z
*r* Error in America/Indiana/Petersburg 2007-11-04T06:59:59.999Z != 2008-03-09T06:59:59.999Z
*r* Error in America/Cancun 2014-10-26T06:59:59.999Z != 2015-02-01T06:59:59.999Z
*d* Error in America/Matamoros 2010-04-04T08:00:00.000Z
*d* Error in America/Ojinaga 2010-04-04T09:00:00.000Z
*r* Error in America/Bahia_Banderas 2010-04-04T08:59:59.999Z != 2010-10-31T06:59:59.999Z
*d* Error in America/Tijuana 2010-04-04T10:00:00.000Z
Cannot find time zone 'America/Tijuana' to link alias 'America/Ensenada' to
Cannot find time zone 'Europe/Chisinau' to link alias 'Europe/Tiraspol' to
Cannot find time zone 'America/Tijuana' to link alias 'Mexico/BajaNorte' to
Writing ZoneInfoMap
[INFO] 
[INFO] --- maven-resources-plugin:2.7:testResources (default-testResources) @ joda-time ---
[INFO] Using 'UTF-8' encoding to copy filtered resources.
[INFO] Copying 34 resources
[INFO] 
[INFO] --- maven-compiler-plugin:3.3:testCompile (default-testCompile) @ joda-time ---
[INFO] Nothing to compile - all classes are up to date
[INFO] 
[INFO] --- maven-surefire-plugin:2.18.1:test (default-test) @ joda-time ---
[INFO] Surefire report directory: /home/perham/Study/LittleDarwin/Cases/joda-time-2.8.1/target/surefire-reports

-------------------------------------------------------
 T E S T S
-------------------------------------------------------
Running org.joda.time.TestAllPackages

TestBuddhistChronology.testCalendar

TestCopticChronology.testCalendar

TestEthiopicChronology.testCalendar

TestIslamicChronology.testCalendar

Testing Gregorian chronology over 1000 iterations
100% complete (i=1000)

Testing Julian chronology over 1000 iterations
100% complete (i=1000)
Writing zoneinfo files
Writing ZoneInfoMap
Tests run: 4157, Failures: 0, Errors: 1, Skipped: 0, Time elapsed: 5.458 sec <<< FAILURE! - in org.joda.time.TestAllPackages
test_printParseZoneBahiaBanderas(org.joda.time.format.TestDateTimeFormatterBuilder)  Time elapsed: 0.005 sec  <<< ERROR!
java.lang.IllegalArgumentException: The datetime zone id 'America/Bahia_Banderas' is not recognised
	at org.joda.time.DateTimeZone.forID(DateTimeZone.java:229)
	at org.joda.time.format.TestDateTimeFormatterBuilder.test_printParseZoneBahiaBanderas(TestDateTimeFormatterBuilder.java:443)


Results :

Tests in error: 
  org.joda.time.format.TestDateTimeFormatterBuilder#test_printParseZoneBahiaBanderas IllegalArgumentException

Tests run: 4157, Failures: 0, Errors: 1, Skipped: 0

[INFO] ------------------------------------------------------------------------
[INFO] BUILD FAILURE
[INFO] ------------------------------------------------------------------------
[INFO] Total time: 16.542s
[INFO] Finished at: Thu Aug 06 13:31:03 BST 2015
[INFO] Final Memory: 9M/213M
[INFO] ------------------------------------------------------------------------
[ERROR] Failed to execute goal org.apache.maven.plugins:maven-surefire-plugin:2.18.1:test (default-test) on project joda-time: There are test failures.
[ERROR] 
[ERROR] Please refer to /home/perham/Study/LittleDarwin/Cases/joda-time-2.8.1/target/surefire-reports for the individual test results.
[ERROR] -> [Help 1]
[ERROR] 
[ERROR] To see the full stack trace of the errors, re-run Maven with the -e switch.
[ERROR] Re-run Maven using the -X switch to enable full debug logging.
[ERROR] 
[ERROR] For more information about the errors and possible solutions, please read the following articles:
[ERROR] [Help 1] http://cwiki.apache.org/confluence/display/MAVEN/MojoFailureException
