[INFO] Scanning for projects...
[INFO]                                                                         
[INFO] ------------------------------------------------------------------------
[INFO] Building Joda-Time 2.8.1
[INFO] ------------------------------------------------------------------------
[INFO] 
[INFO] --- maven-resources-plugin:2.7:resources (default-resources) @ joda-time ---
[INFO] Using 'UTF-8' encoding to copy filtered resources.
[INFO] Copying 2 resources to META-INF
[INFO] Copying 10 resources
[INFO] 
[INFO] --- maven-compiler-plugin:3.3:compile (default-compile) @ joda-time ---
[INFO] Changes detected - recompiling the module!
[INFO] Compiling 166 source files to /home/perham/Study/LittleDarwin/Cases/joda-time-2.8.1/target/classes
[INFO] 
[INFO] --- exec-maven-plugin:1.4.0:java (compile-tzdb) @ joda-time ---
Writing zoneinfo files
*r* Error in Asia/Nicosia 2049-10-31T00:59:59.999Z != 2049-10-30T22:59:59.999Z
*r* Error in Asia/Amman 2049-10-28T21:59:59.999Z != 2049-10-28T23:59:59.999Z
*r* Error in Australia/Adelaide 2049-10-02T16:29:59.999Z != 2049-10-03T01:59:59.999Z
*r* Error in Australia/Hobart 2049-10-02T15:59:59.999Z != 2049-10-03T01:59:59.999Z
*r* Error in Australia/Currie 2049-10-02T15:59:59.999Z != 2049-10-03T01:59:59.999Z
*r* Error in Australia/Melbourne 2049-10-02T15:59:59.999Z != 2049-10-03T01:59:59.999Z
*r* Error in Australia/Sydney 2049-10-02T15:59:59.999Z != 2049-10-03T01:59:59.999Z
*r* Error in Australia/Broken_Hill 2049-10-02T16:29:59.999Z != 2049-10-03T01:59:59.999Z
*r* Error in Pacific/Auckland 2049-09-25T13:59:59.999Z != 2049-09-26T01:59:59.999Z
*r* Error in Pacific/Chatham 2049-09-25T13:59:59.999Z != 2049-09-26T02:44:59.999Z
*r* Error in CET 2049-10-31T00:59:59.999Z != 2049-10-31T01:59:59.999Z
*r* Error in MET 2049-10-31T00:59:59.999Z != 2049-10-31T01:59:59.999Z
*r* Error in EET 2049-10-31T00:59:59.999Z != 2049-10-30T22:59:59.999Z
*r* Error in Europe/Tirane 2049-10-31T00:59:59.999Z != 2049-10-30T23:59:59.999Z
*r* Error in Europe/Andorra 2049-10-31T00:59:59.999Z != 2049-10-30T23:59:59.999Z
*r* Error in Europe/Vienna 2049-10-31T00:59:59.999Z != 2049-10-30T23:59:59.999Z
*r* Error in Europe/Brussels 2049-10-31T00:59:59.999Z != 2049-10-30T23:59:59.999Z
*r* Error in Europe/Sofia 2049-10-31T00:59:59.999Z != 2049-10-30T22:59:59.999Z
*r* Error in Europe/Prague 2049-10-31T00:59:59.999Z != 2049-10-30T23:59:59.999Z
*r* Error in Europe/Copenhagen 2049-10-31T00:59:59.999Z != 2049-10-30T23:59:59.999Z
*r* Error in America/Scoresbysund 2049-10-31T00:59:59.999Z != 2049-10-31T01:59:59.999Z
*r* Error in America/Godthab 2049-10-31T00:59:59.999Z != 2049-10-31T03:59:59.999Z
*r* Error in Europe/Tallinn 2049-10-31T00:59:59.999Z != 2049-10-30T22:59:59.999Z
*r* Error in Europe/Helsinki 2049-10-31T00:59:59.999Z != 2049-10-30T22:59:59.999Z
*r* Error in Europe/Paris 2049-10-31T00:59:59.999Z != 2049-10-30T23:59:59.999Z
*r* Error in Europe/Berlin 2049-10-31T00:59:59.999Z != 2049-10-30T23:59:59.999Z
*r* Error in Europe/Gibraltar 2049-10-31T00:59:59.999Z != 2049-10-30T23:59:59.999Z
*r* Error in Europe/Athens 2049-10-31T00:59:59.999Z != 2049-10-30T22:59:59.999Z
*r* Error in Europe/Budapest 2049-10-31T00:59:59.999Z != 2049-10-30T23:59:59.999Z
*r* Error in Europe/Rome 2049-10-31T00:59:59.999Z != 2049-10-30T23:59:59.999Z
*r* Error in Europe/Riga 2049-10-31T00:59:59.999Z != 2049-10-30T22:59:59.999Z
*r* Error in Europe/Vilnius 2049-10-31T00:59:59.999Z != 2049-10-30T22:59:59.999Z
*r* Error in Europe/Luxembourg 2049-10-31T00:59:59.999Z != 2049-10-30T23:59:59.999Z
*r* Error in Europe/Malta 2049-10-31T00:59:59.999Z != 2049-10-30T23:59:59.999Z
*r* Error in Europe/Chisinau 2049-10-31T00:59:59.999Z != 2049-10-30T22:59:59.999Z
*r* Error in Europe/Monaco 2049-10-31T00:59:59.999Z != 2049-10-30T23:59:59.999Z
*r* Error in Europe/Amsterdam 2049-10-31T00:59:59.999Z != 2049-10-30T23:59:59.999Z
*r* Error in Europe/Oslo 2049-10-31T00:59:59.999Z != 2049-10-30T23:59:59.999Z
*r* Error in Europe/Warsaw 2049-10-31T00:59:59.999Z != 2049-10-30T23:59:59.999Z
*r* Error in Atlantic/Azores 2049-10-31T00:59:59.999Z != 2049-10-31T01:59:59.999Z
*r* Error in Europe/Bucharest 2049-10-31T00:59:59.999Z != 2049-10-30T22:59:59.999Z
*r* Error in Europe/Belgrade 2049-10-31T00:59:59.999Z != 2049-10-30T23:59:59.999Z
*r* Error in Europe/Madrid 2049-10-31T00:59:59.999Z != 2049-10-30T23:59:59.999Z
*r* Error in Africa/Ceuta 2049-10-31T00:59:59.999Z != 2049-10-30T23:59:59.999Z
*r* Error in Europe/Stockholm 2049-10-31T00:59:59.999Z != 2049-10-30T23:59:59.999Z
*r* Error in Europe/Zurich 2049-10-31T00:59:59.999Z != 2049-10-30T23:59:59.999Z
*r* Error in Europe/Istanbul 2049-10-31T00:59:59.999Z != 2049-10-30T22:59:59.999Z
*r* Error in Europe/Kiev 2049-10-31T00:59:59.999Z != 2049-10-30T22:59:59.999Z
*r* Error in Europe/Uzhgorod 2049-10-31T00:59:59.999Z != 2049-10-30T22:59:59.999Z
*r* Error in Europe/Zaporozhye 2049-10-31T00:59:59.999Z != 2049-10-30T22:59:59.999Z
*r* Error in America/Havana 2049-11-07T04:59:59.999Z != 2049-11-06T23:59:59.999Z
Cannot find source zone 'Asia/Nicosia' to link alias 'Europe/Nicosia' to
Cannot find source zone 'Pacific/Auckland' to link alias 'Antarctica/McMurdo' to
Cannot find source zone 'Europe/Helsinki' to link alias 'Europe/Mariehamn' to
Cannot find source zone 'Europe/Zurich' to link alias 'Europe/Busingen' to
Cannot find source zone 'Europe/Rome' to link alias 'Europe/Vatican' to
Cannot find source zone 'Europe/Rome' to link alias 'Europe/San_Marino' to
Cannot find source zone 'Europe/Zurich' to link alias 'Europe/Vaduz' to
Cannot find source zone 'Europe/Oslo' to link alias 'Arctic/Longyearbyen' to
Cannot find source zone 'Europe/Belgrade' to link alias 'Europe/Ljubljana' to
Cannot find source zone 'Europe/Belgrade' to link alias 'Europe/Podgorica' to
Cannot find source zone 'Europe/Belgrade' to link alias 'Europe/Sarajevo' to
Cannot find source zone 'Europe/Belgrade' to link alias 'Europe/Skopje' to
Cannot find source zone 'Europe/Belgrade' to link alias 'Europe/Zagreb' to
Cannot find source zone 'Europe/Prague' to link alias 'Europe/Bratislava' to
Cannot find source zone 'Europe/Istanbul' to link alias 'Asia/Istanbul' to
Cannot find time zone 'Pacific/Auckland' to link alias 'Antarctica/South_Pole' to
Cannot find time zone 'Europe/Oslo' to link alias 'Atlantic/Jan_Mayen' to
Cannot find time zone 'Australia/Sydney' to link alias 'Australia/ACT' to
Cannot find time zone 'Australia/Sydney' to link alias 'Australia/Canberra' to
Cannot find time zone 'Australia/Sydney' to link alias 'Australia/NSW' to
Cannot find time zone 'Australia/Adelaide' to link alias 'Australia/South' to
Cannot find time zone 'Australia/Hobart' to link alias 'Australia/Tasmania' to
Cannot find time zone 'Australia/Melbourne' to link alias 'Australia/Victoria' to
Cannot find time zone 'Australia/Broken_Hill' to link alias 'Australia/Yancowinna' to
Cannot find time zone 'America/Havana' to link alias 'Cuba' to
Cannot find time zone 'Europe/Chisinau' to link alias 'Europe/Tiraspol' to
Cannot find time zone 'Pacific/Auckland' to link alias 'NZ' to
Cannot find time zone 'Pacific/Chatham' to link alias 'NZ-CHAT' to
Cannot find time zone 'Europe/Warsaw' to link alias 'Poland' to
Cannot find time zone 'Europe/Istanbul' to link alias 'Turkey' to
Writing ZoneInfoMap
[INFO] 
[INFO] --- maven-resources-plugin:2.7:testResources (default-testResources) @ joda-time ---
[INFO] Using 'UTF-8' encoding to copy filtered resources.
[INFO] Copying 34 resources
[INFO] 
[INFO] --- maven-compiler-plugin:3.3:testCompile (default-testCompile) @ joda-time ---
[INFO] Nothing to compile - all classes are up to date
[INFO] 
[INFO] --- maven-surefire-plugin:2.18.1:test (default-test) @ joda-time ---
[INFO] Surefire report directory: /home/perham/Study/LittleDarwin/Cases/joda-time-2.8.1/target/surefire-reports

-------------------------------------------------------
 T E S T S
-------------------------------------------------------
Running org.joda.time.TestAllPackages

Results :

Tests run: 0, Failures: 0, Errors: 0, Skipped: 0

[INFO] ------------------------------------------------------------------------
[INFO] BUILD FAILURE
[INFO] ------------------------------------------------------------------------
[INFO] Total time: 10.905s
[INFO] Finished at: Thu Aug 06 13:27:24 BST 2015
[INFO] Final Memory: 9M/213M
[INFO] ------------------------------------------------------------------------
[ERROR] Failed to execute goal org.apache.maven.plugins:maven-surefire-plugin:2.18.1:test (default-test) on project joda-time: Execution default-test of goal org.apache.maven.plugins:maven-surefire-plugin:2.18.1:test failed: There was an error in the forked process
[ERROR] org.apache.maven.surefire.testset.TestSetFailedException: org.joda.time.TestAllPackages
[ERROR] at org.apache.maven.surefire.junit.JUnitTestSet.execute(JUnitTestSet.java:115)
[ERROR] at org.apache.maven.surefire.junit.JUnit3Provider.executeTestSet(JUnit3Provider.java:130)
[ERROR] at org.apache.maven.surefire.junit.JUnit3Provider.invoke(JUnit3Provider.java:107)
[ERROR] at org.apache.maven.surefire.booter.ForkedBooter.invokeProviderInSameClassLoader(ForkedBooter.java:203)
[ERROR] at org.apache.maven.surefire.booter.ForkedBooter.runSuitesInProcess(ForkedBooter.java:155)
[ERROR] at org.apache.maven.surefire.booter.ForkedBooter.main(ForkedBooter.java:103)
[ERROR] Caused by: java.lang.ExceptionInInitializerError
[ERROR] at org.joda.time.TestAll.suite(TestAll.java:41)
[ERROR] at org.joda.time.TestAllPackages.suite(TestAllPackages.java:36)
[ERROR] at sun.reflect.NativeMethodAccessorImpl.invoke0(Native Method)
[ERROR] at sun.reflect.NativeMethodAccessorImpl.invoke(NativeMethodAccessorImpl.java:57)
[ERROR] at sun.reflect.DelegatingMethodAccessorImpl.invoke(DelegatingMethodAccessorImpl.java:43)
[ERROR] at java.lang.reflect.Method.invoke(Method.java:606)
[ERROR] at org.apache.maven.surefire.common.junit3.JUnit3Reflector.createInstanceFromSuiteMethod(JUnit3Reflector.java:159)
[ERROR] at org.apache.maven.surefire.common.junit3.JUnit3Reflector.constructTestObject(JUnit3Reflector.java:124)
[ERROR] at org.apache.maven.surefire.junit.JUnitTestSet.execute(JUnitTestSet.java:74)
[ERROR] ... 5 more
[ERROR] Caused by: java.lang.IllegalArgumentException: The datetime zone id 'Europe/Paris' is not recognised
[ERROR] at org.joda.time.DateTimeZone.forID(DateTimeZone.java:229)
[ERROR] at org.joda.time.TestInstant_Constructors.<clinit>(TestInstant_Constructors.java:37)
[ERROR] ... 14 more
[ERROR] -> [Help 1]
[ERROR] 
[ERROR] To see the full stack trace of the errors, re-run Maven with the -e switch.
[ERROR] Re-run Maven using the -X switch to enable full debug logging.
[ERROR] 
[ERROR] For more information about the errors and possible solutions, please read the following articles:
[ERROR] [Help 1] http://cwiki.apache.org/confluence/display/MAVEN/PluginExecutionException
