[INFO] Scanning for projects...
[INFO]                                                                         
[INFO] ------------------------------------------------------------------------
[INFO] Building Joda-Time 2.8.1
[INFO] ------------------------------------------------------------------------
[INFO] 
[INFO] --- maven-resources-plugin:2.7:resources (default-resources) @ joda-time ---
[INFO] Using 'UTF-8' encoding to copy filtered resources.
[INFO] Copying 2 resources to META-INF
[INFO] Copying 10 resources
[INFO] 
[INFO] --- maven-compiler-plugin:3.3:compile (default-compile) @ joda-time ---
[INFO] Changes detected - recompiling the module!
[INFO] Compiling 166 source files to /home/perham/Study/LittleDarwin/Cases/joda-time-2.8.1/target/classes
[INFO] 
[INFO] --- exec-maven-plugin:1.4.0:java (compile-tzdb) @ joda-time ---
Writing zoneinfo files
*e* Error in Africa/Casablanca: Didn't read properly from file
*e* Error in Africa/El_Aaiun: Didn't read properly from file
*e* Error in Africa/Windhoek: Didn't read properly from file
*e* Error in Antarctica/Troll: Didn't read properly from file
*e* Error in Asia/Baku: Didn't read properly from file
*e* Error in Asia/Nicosia: Didn't read properly from file
*e* Error in Asia/Jerusalem: Didn't read properly from file
*e* Error in Asia/Amman: Didn't read properly from file
*e* Error in Asia/Beirut: Didn't read properly from file
*e* Error in Asia/Hovd: Didn't read properly from file
*e* Error in Asia/Ulaanbaatar: Didn't read properly from file
*e* Error in Asia/Choibalsan: Didn't read properly from file
*e* Error in Asia/Gaza: Didn't read properly from file
*e* Error in Asia/Hebron: Didn't read properly from file
*e* Error in Asia/Damascus: Didn't read properly from file
*e* Error in Australia/Adelaide: Didn't read properly from file
*e* Error in Australia/Hobart: Didn't read properly from file
*e* Error in Australia/Currie: Didn't read properly from file
*e* Error in Australia/Melbourne: Didn't read properly from file
*e* Error in Australia/Sydney: Didn't read properly from file
*e* Error in Australia/Broken_Hill: Didn't read properly from file
*e* Error in Australia/Lord_Howe: Didn't read properly from file
*e* Error in Pacific/Fiji: Didn't read properly from file
*e* Error in Pacific/Auckland: Didn't read properly from file
*e* Error in Pacific/Chatham: Didn't read properly from file
*e* Error in Pacific/Apia: Didn't read properly from file
*e* Error in Europe/London: Didn't read properly from file
*e* Error in Europe/Dublin: Didn't read properly from file
*e* Error in WET: Didn't read properly from file
*e* Error in CET: Didn't read properly from file
*e* Error in MET: Didn't read properly from file
*e* Error in EET: Didn't read properly from file
*e* Error in Europe/Tirane: Didn't read properly from file
*e* Error in Europe/Andorra: Didn't read properly from file
*e* Error in Europe/Vienna: Didn't read properly from file
*e* Error in Europe/Brussels: Didn't read properly from file
*e* Error in Europe/Sofia: Didn't read properly from file
*e* Error in Europe/Prague: Didn't read properly from file
*e* Error in Europe/Copenhagen: Didn't read properly from file
*e* Error in Atlantic/Faroe: Didn't read properly from file
*e* Error in America/Scoresbysund: Didn't read properly from file
*e* Error in America/Godthab: Didn't read properly from file
*e* Error in America/Thule: Didn't read properly from file
*e* Error in Europe/Tallinn: Didn't read properly from file
*e* Error in Europe/Helsinki: Didn't read properly from file
*e* Error in Europe/Paris: Didn't read properly from file
*e* Error in Europe/Berlin: Didn't read properly from file
*e* Error in Europe/Gibraltar: Didn't read properly from file
*e* Error in Europe/Athens: Didn't read properly from file
*e* Error in Europe/Budapest: Didn't read properly from file
*e* Error in Europe/Rome: Didn't read properly from file
*e* Error in Europe/Riga: Didn't read properly from file
*e* Error in Europe/Vilnius: Didn't read properly from file
*e* Error in Europe/Luxembourg: Didn't read properly from file
*e* Error in Europe/Malta: Didn't read properly from file
*e* Error in Europe/Chisinau: Didn't read properly from file
*e* Error in Europe/Monaco: Didn't read properly from file
*e* Error in Europe/Amsterdam: Didn't read properly from file
*e* Error in Europe/Oslo: Didn't read properly from file
*e* Error in Europe/Warsaw: Didn't read properly from file
*e* Error in Europe/Lisbon: Didn't read properly from file
*e* Error in Atlantic/Azores: Didn't read properly from file
*e* Error in Atlantic/Madeira: Didn't read properly from file
*e* Error in Europe/Bucharest: Didn't read properly from file
*e* Error in Europe/Belgrade: Didn't read properly from file
*e* Error in Europe/Madrid: Didn't read properly from file
*e* Error in Africa/Ceuta: Didn't read properly from file
*e* Error in Atlantic/Canary: Didn't read properly from file
*e* Error in Europe/Stockholm: Didn't read properly from file
*e* Error in Europe/Zurich: Didn't read properly from file
*e* Error in Europe/Istanbul: Didn't read properly from file
*e* Error in Europe/Kiev: Didn't read properly from file
*e* Error in Europe/Uzhgorod: Didn't read properly from file
*e* Error in Europe/Zaporozhye: Didn't read properly from file
*e* Error in EST5EDT: Didn't read properly from file
*e* Error in CST6CDT: Didn't read properly from file
*e* Error in MST7MDT: Didn't read properly from file
*e* Error in PST8PDT: Didn't read properly from file
*e* Error in America/New_York: Didn't read properly from file
*e* Error in America/Chicago: Didn't read properly from file
*e* Error in America/North_Dakota/Center: Didn't read properly from file
*e* Error in America/North_Dakota/New_Salem: Didn't read properly from file
*e* Error in America/North_Dakota/Beulah: Didn't read properly from file
*e* Error in America/Denver: Didn't read properly from file
*e* Error in America/Los_Angeles: Didn't read properly from file
*e* Error in America/Juneau: Didn't read properly from file
*e* Error in America/Sitka: Didn't read properly from file
*e* Error in America/Yakutat: Didn't read properly from file
*e* Error in America/Anchorage: Didn't read properly from file
*e* Error in America/Nome: Didn't read properly from file
*e* Error in America/Adak: Didn't read properly from file
*e* Error in America/Boise: Didn't read properly from file
*e* Error in America/Indiana/Indianapolis: Didn't read properly from file
*e* Error in America/Indiana/Marengo: Didn't read properly from file
*e* Error in America/Indiana/Vincennes: Didn't read properly from file
*e* Error in America/Indiana/Tell_City: Didn't read properly from file
*e* Error in America/Indiana/Petersburg: Didn't read properly from file
*e* Error in America/Indiana/Knox: Didn't read properly from file
*e* Error in America/Indiana/Winamac: Didn't read properly from file
*e* Error in America/Indiana/Vevay: Didn't read properly from file
*e* Error in America/Kentucky/Louisville: Didn't read properly from file
*e* Error in America/Kentucky/Monticello: Didn't read properly from file
*e* Error in America/Detroit: Didn't read properly from file
*e* Error in America/Menominee: Didn't read properly from file
*e* Error in America/St_Johns: Didn't read properly from file
*e* Error in America/Goose_Bay: Didn't read properly from file
*e* Error in America/Halifax: Didn't read properly from file
*e* Error in America/Glace_Bay: Didn't read properly from file
*e* Error in America/Moncton: Didn't read properly from file
*e* Error in America/Toronto: Didn't read properly from file
*e* Error in America/Thunder_Bay: Didn't read properly from file
*e* Error in America/Nipigon: Didn't read properly from file
*e* Error in America/Rainy_River: Didn't read properly from file
*e* Error in America/Winnipeg: Didn't read properly from file
*e* Error in America/Edmonton: Didn't read properly from file
*e* Error in America/Vancouver: Didn't read properly from file
*e* Error in America/Pangnirtung: Didn't read properly from file
*e* Error in America/Iqaluit: Didn't read properly from file
*e* Error in America/Resolute: Didn't read properly from file
*e* Error in America/Rankin_Inlet: Didn't read properly from file
*e* Error in America/Cambridge_Bay: Didn't read properly from file
*e* Error in America/Yellowknife: Didn't read properly from file
*e* Error in America/Inuvik: Didn't read properly from file
*e* Error in America/Whitehorse: Didn't read properly from file
*e* Error in America/Dawson: Didn't read properly from file
*e* Error in America/Merida: Didn't read properly from file
*e* Error in America/Matamoros: Didn't read properly from file
*e* Error in America/Monterrey: Didn't read properly from file
*e* Error in America/Mexico_City: Didn't read properly from file
*e* Error in America/Ojinaga: Didn't read properly from file
*e* Error in America/Chihuahua: Didn't read properly from file
*e* Error in America/Mazatlan: Didn't read properly from file
*e* Error in America/Bahia_Banderas: Didn't read properly from file
*e* Error in America/Tijuana: Didn't read properly from file
*e* Error in America/Santa_Isabel: Didn't read properly from file
*e* Error in America/Nassau: Didn't read properly from file
*e* Error in Atlantic/Bermuda: Didn't read properly from file
*e* Error in America/Cayman: Didn't read properly from file
*e* Error in America/Havana: Didn't read properly from file
*e* Error in America/Port-au-Prince: Didn't read properly from file
*e* Error in America/Miquelon: Didn't read properly from file
*e* Error in America/Sao_Paulo: Didn't read properly from file
*e* Error in America/Campo_Grande: Didn't read properly from file
*e* Error in America/Cuiaba: Didn't read properly from file
*e* Error in America/Asuncion: Didn't read properly from file
*e* Error in America/Montevideo: Didn't read properly from file
*e* Error in Europe/Nicosia: Didn't read properly from file
*e* Error in Antarctica/McMurdo: Didn't read properly from file
*e* Error in Europe/Jersey: Didn't read properly from file
*e* Error in Europe/Guernsey: Didn't read properly from file
*e* Error in Europe/Isle_of_Man: Didn't read properly from file
*e* Error in Europe/Mariehamn: Didn't read properly from file
*e* Error in Europe/Busingen: Didn't read properly from file
*e* Error in Europe/Vatican: Didn't read properly from file
*e* Error in Europe/San_Marino: Didn't read properly from file
*e* Error in Europe/Vaduz: Didn't read properly from file
*e* Error in Arctic/Longyearbyen: Didn't read properly from file
*e* Error in Europe/Ljubljana: Didn't read properly from file
*e* Error in Europe/Podgorica: Didn't read properly from file
*e* Error in Europe/Sarajevo: Didn't read properly from file
*e* Error in Europe/Skopje: Didn't read properly from file
*e* Error in Europe/Zagreb: Didn't read properly from file
*e* Error in Europe/Bratislava: Didn't read properly from file
*e* Error in Asia/Istanbul: Didn't read properly from file
Writing ZoneInfoMap
[INFO] 
[INFO] --- maven-resources-plugin:2.7:testResources (default-testResources) @ joda-time ---
[INFO] Using 'UTF-8' encoding to copy filtered resources.
[INFO] Copying 34 resources
[INFO] 
[INFO] --- maven-compiler-plugin:3.3:testCompile (default-testCompile) @ joda-time ---
[INFO] Nothing to compile - all classes are up to date
[INFO] 
[INFO] --- maven-surefire-plugin:2.18.1:test (default-test) @ joda-time ---
[INFO] Surefire report directory: /home/perham/Study/LittleDarwin/Cases/joda-time-2.8.1/target/surefire-reports

-------------------------------------------------------
 T E S T S
-------------------------------------------------------
Running org.joda.time.TestAllPackages

TestBuddhistChronology.testCalendar

TestCopticChronology.testCalendar

TestEthiopicChronology.testCalendar

TestIslamicChronology.testCalendar

Testing Gregorian chronology over 1000 iterations
100% complete (i=1000)

Testing Julian chronology over 1000 iterations
100% complete (i=1000)
Writing zoneinfo files
*e* Error in America/Los_Angeles: Didn't read properly from file
Writing ZoneInfoMap
Tests run: 4157, Failures: 15, Errors: 0, Skipped: 0, Time elapsed: 5.474 sec <<< FAILURE! - in org.joda.time.TestAllPackages
testSerializedDateTime(org.joda.time.TestSerialization)  Time elapsed: 0.006 sec  <<< FAILURE!
junit.framework.AssertionFailedError: expected:<2002-06-09T01:00:00.000+01:00> but was:<2002-06-09T01:00:00.000+01:00>
	at junit.framework.Assert.fail(Assert.java:47)
	at junit.framework.Assert.failNotEquals(Assert.java:280)
	at junit.framework.Assert.assertEquals(Assert.java:64)
	at junit.framework.Assert.assertEquals(Assert.java:71)
	at org.joda.time.TestSerialization.loadAndCompare(TestSerialization.java:300)
	at org.joda.time.TestSerialization.testSerializedDateTime(TestSerialization.java:136)

testSerializedDateTimeProperty(org.joda.time.TestSerialization)  Time elapsed: 0.002 sec  <<< FAILURE!
junit.framework.AssertionFailedError: expected:<Property[hourOfDay]> but was:<Property[hourOfDay]>
	at junit.framework.Assert.fail(Assert.java:47)
	at junit.framework.Assert.failNotEquals(Assert.java:280)
	at junit.framework.Assert.assertEquals(Assert.java:64)
	at junit.framework.Assert.assertEquals(Assert.java:71)
	at org.joda.time.TestSerialization.loadAndCompare(TestSerialization.java:300)
	at org.joda.time.TestSerialization.testSerializedDateTimeProperty(TestSerialization.java:142)

testSerializedMutableDateTime(org.joda.time.TestSerialization)  Time elapsed: 0.002 sec  <<< FAILURE!
junit.framework.AssertionFailedError: expected:<2002-06-09T01:00:00.000+01:00> but was:<2002-06-09T01:00:00.000+01:00>
	at junit.framework.Assert.fail(Assert.java:47)
	at junit.framework.Assert.failNotEquals(Assert.java:280)
	at junit.framework.Assert.assertEquals(Assert.java:64)
	at junit.framework.Assert.assertEquals(Assert.java:71)
	at org.joda.time.TestSerialization.loadAndCompare(TestSerialization.java:300)
	at org.joda.time.TestSerialization.testSerializedMutableDateTime(TestSerialization.java:148)

testSerializedMutableDateTimeProperty(org.joda.time.TestSerialization)  Time elapsed: 0.003 sec  <<< FAILURE!
junit.framework.AssertionFailedError: expected:<Property[hourOfDay]> but was:<Property[hourOfDay]>
	at junit.framework.Assert.fail(Assert.java:47)
	at junit.framework.Assert.failNotEquals(Assert.java:280)
	at junit.framework.Assert.assertEquals(Assert.java:64)
	at junit.framework.Assert.assertEquals(Assert.java:71)
	at org.joda.time.TestSerialization.loadAndCompare(TestSerialization.java:300)
	at org.joda.time.TestSerialization.testSerializedMutableDateTimeProperty(TestSerialization.java:154)

testSerializedCopticChronology(org.joda.time.TestSerialization)  Time elapsed: 0.002 sec  <<< FAILURE!
junit.framework.AssertionFailedError: expected same:<CopticChronology[Europe/London]> was not:<CopticChronology[Europe/London]>
	at junit.framework.Assert.fail(Assert.java:47)
	at junit.framework.Assert.failNotSame(Assert.java:276)
	at junit.framework.Assert.assertSame(Assert.java:239)
	at junit.framework.Assert.assertSame(Assert.java:246)
	at org.joda.time.TestSerialization.loadAndCompare(TestSerialization.java:298)
	at org.joda.time.TestSerialization.testSerializedCopticChronology(TestSerialization.java:232)

testSerializedISOChronology(org.joda.time.TestSerialization)  Time elapsed: 0.001 sec  <<< FAILURE!
junit.framework.AssertionFailedError: expected same:<ISOChronology[Europe/Paris]> was not:<ISOChronology[Europe/Paris]>
	at junit.framework.Assert.fail(Assert.java:47)
	at junit.framework.Assert.failNotSame(Assert.java:276)
	at junit.framework.Assert.assertSame(Assert.java:239)
	at junit.framework.Assert.assertSame(Assert.java:246)
	at org.joda.time.TestSerialization.loadAndCompare(TestSerialization.java:298)
	at org.joda.time.TestSerialization.testSerializedISOChronology(TestSerialization.java:238)

testSerializedGJChronologyChangedInternals(org.joda.time.TestSerialization)  Time elapsed: 0.004 sec  <<< FAILURE!
junit.framework.AssertionFailedError: expected same:<GJChronology[Europe/Paris,cutover=1970-01-01T00:00:00.123Z,mdfw=2]> was not:<GJChronology[Europe/Paris,cutover=1970-01-01T00:00:00.123Z,mdfw=2]>
	at junit.framework.Assert.fail(Assert.java:47)
	at junit.framework.Assert.failNotSame(Assert.java:276)
	at junit.framework.Assert.assertSame(Assert.java:239)
	at junit.framework.Assert.assertSame(Assert.java:246)
	at org.joda.time.TestSerialization.loadAndCompare(TestSerialization.java:298)
	at org.joda.time.TestSerialization.testSerializedGJChronologyChangedInternals(TestSerialization.java:250)

testSerializedGregorianChronology(org.joda.time.TestSerialization)  Time elapsed: 0.002 sec  <<< FAILURE!
junit.framework.AssertionFailedError: expected same:<GregorianChronology[Europe/Paris]> was not:<GregorianChronology[Europe/Paris]>
	at junit.framework.Assert.fail(Assert.java:47)
	at junit.framework.Assert.failNotSame(Assert.java:276)
	at junit.framework.Assert.assertSame(Assert.java:239)
	at junit.framework.Assert.assertSame(Assert.java:246)
	at org.joda.time.TestSerialization.loadAndCompare(TestSerialization.java:298)
	at org.joda.time.TestSerialization.testSerializedGregorianChronology(TestSerialization.java:256)

testSerializedJulianChronology(org.joda.time.TestSerialization)  Time elapsed: 0.003 sec  <<< FAILURE!
junit.framework.AssertionFailedError: expected same:<JulianChronology[Europe/Paris]> was not:<JulianChronology[Europe/Paris]>
	at junit.framework.Assert.fail(Assert.java:47)
	at junit.framework.Assert.failNotSame(Assert.java:276)
	at junit.framework.Assert.assertSame(Assert.java:239)
	at junit.framework.Assert.assertSame(Assert.java:246)
	at org.joda.time.TestSerialization.loadAndCompare(TestSerialization.java:298)
	at org.joda.time.TestSerialization.testSerializedJulianChronology(TestSerialization.java:262)

testSerializedBuddhistChronology(org.joda.time.TestSerialization)  Time elapsed: 0.005 sec  <<< FAILURE!
junit.framework.AssertionFailedError: expected same:<BuddhistChronology[Europe/Paris]> was not:<BuddhistChronology[Europe/Paris]>
	at junit.framework.Assert.fail(Assert.java:47)
	at junit.framework.Assert.failNotSame(Assert.java:276)
	at junit.framework.Assert.assertSame(Assert.java:239)
	at junit.framework.Assert.assertSame(Assert.java:246)
	at org.joda.time.TestSerialization.loadAndCompare(TestSerialization.java:298)
	at org.joda.time.TestSerialization.testSerializedBuddhistChronology(TestSerialization.java:268)

testSerializedDateMidnight(org.joda.time.TestSerialization)  Time elapsed: 0.001 sec  <<< FAILURE!
junit.framework.AssertionFailedError: expected:<2002-06-09T00:00:00.000+01:00> but was:<2002-06-09T00:00:00.000+01:00>
	at junit.framework.Assert.fail(Assert.java:47)
	at junit.framework.Assert.failNotEquals(Assert.java:280)
	at junit.framework.Assert.assertEquals(Assert.java:64)
	at junit.framework.Assert.assertEquals(Assert.java:71)
	at org.joda.time.TestSerialization.loadAndCompare(TestSerialization.java:300)
	at org.joda.time.TestSerialization.testSerializedDateMidnight(TestSerialization.java:161)

testSerializedDateMidnightProperty(org.joda.time.TestSerialization)  Time elapsed: 0.002 sec  <<< FAILURE!
junit.framework.AssertionFailedError: expected:<Property[monthOfYear]> but was:<Property[monthOfYear]>
	at junit.framework.Assert.fail(Assert.java:47)
	at junit.framework.Assert.failNotEquals(Assert.java:280)
	at junit.framework.Assert.assertEquals(Assert.java:64)
	at junit.framework.Assert.assertEquals(Assert.java:71)
	at org.joda.time.TestSerialization.loadAndCompare(TestSerialization.java:300)
	at org.joda.time.TestSerialization.testSerializedDateMidnightProperty(TestSerialization.java:168)

testGetChronology_Object_nullChronology(org.joda.time.convert.TestCalendarConverter)  Time elapsed: 0.001 sec  <<< FAILURE!
junit.framework.AssertionFailedError: expected:<GJChronology[Europe/Paris]> but was:<GJChronology[Europe/Paris]>
	at junit.framework.Assert.fail(Assert.java:47)
	at junit.framework.Assert.failNotEquals(Assert.java:280)
	at junit.framework.Assert.assertEquals(Assert.java:64)
	at junit.framework.Assert.assertEquals(Assert.java:71)
	at org.joda.time.convert.TestCalendarConverter.testGetChronology_Object_nullChronology(TestCalendarConverter.java:132)

test_printParseShortNameWithAutoLookup(org.joda.time.format.TestDateTimeFormatterBuilder)  Time elapsed: 0.001 sec  <<< FAILURE!
junit.framework.AssertionFailedError: America/New_York America/New_York expected:<2011-01-04T12:30:00.000-05:00> but was:<2011-01-04T12:30:00.000-05:00>
	at junit.framework.Assert.fail(Assert.java:47)
	at junit.framework.Assert.failNotEquals(Assert.java:280)
	at junit.framework.Assert.assertEquals(Assert.java:64)
	at org.joda.time.format.TestDateTimeFormatterBuilder.test_printParseShortNameWithAutoLookup(TestDateTimeFormatterBuilder.java:615)

test_printParseZoneParis(org.joda.time.format.TestDateTimeFormatterBuilder)  Time elapsed: 0.002 sec  <<< FAILURE!
junit.framework.AssertionFailedError: expected:<2007-03-04T12:30:00.000+01:00> but was:<2007-03-04T12:30:00.000+01:00>
	at junit.framework.Assert.fail(Assert.java:47)
	at junit.framework.Assert.failNotEquals(Assert.java:280)
	at junit.framework.Assert.assertEquals(Assert.java:64)
	at junit.framework.Assert.assertEquals(Assert.java:71)
	at org.joda.time.format.TestDateTimeFormatterBuilder.test_printParseZoneParis(TestDateTimeFormatterBuilder.java:424)


Results :

Failed tests: 
  org.joda.time.TestSerialization#testSerializedBuddhistChronology AssertionFailedError
  org.joda.time.TestSerialization#testSerializedCopticChronology AssertionFailedError
  org.joda.time.TestSerialization#testSerializedDateMidnight AssertionFailedError
  org.joda.time.TestSerialization#testSerializedDateMidnightProperty AssertionFailedError
  org.joda.time.TestSerialization#testSerializedDateTime AssertionFailedError ex...
  org.joda.time.TestSerialization#testSerializedDateTimeProperty AssertionFailedError
  org.joda.time.TestSerialization#testSerializedGJChronologyChangedInternals AssertionFailedError
  org.joda.time.TestSerialization#testSerializedGregorianChronology AssertionFailedError
  org.joda.time.TestSerialization#testSerializedISOChronology AssertionFailedError
  org.joda.time.TestSerialization#testSerializedJulianChronology AssertionFailedError
  org.joda.time.TestSerialization#testSerializedMutableDateTime AssertionFailedError
  org.joda.time.TestSerialization#testSerializedMutableDateTimeProperty AssertionFailedError
  org.joda.time.convert.TestCalendarConverter#testGetChronology_Object_nullChronology AssertionFailedError
  org.joda.time.format.TestDateTimeFormatterBuilder#test_printParseShortNameWithAutoLookup AssertionFailedError
  org.joda.time.format.TestDateTimeFormatterBuilder#test_printParseZoneParis AssertionFailedError

Tests run: 4157, Failures: 15, Errors: 0, Skipped: 0

[INFO] ------------------------------------------------------------------------
[INFO] BUILD FAILURE
[INFO] ------------------------------------------------------------------------
[INFO] Total time: 16.081s
[INFO] Finished at: Thu Aug 06 13:20:21 BST 2015
[INFO] Final Memory: 9M/213M
[INFO] ------------------------------------------------------------------------
[ERROR] Failed to execute goal org.apache.maven.plugins:maven-surefire-plugin:2.18.1:test (default-test) on project joda-time: There are test failures.
[ERROR] 
[ERROR] Please refer to /home/perham/Study/LittleDarwin/Cases/joda-time-2.8.1/target/surefire-reports for the individual test results.
[ERROR] -> [Help 1]
[ERROR] 
[ERROR] To see the full stack trace of the errors, re-run Maven with the -e switch.
[ERROR] Re-run Maven using the -X switch to enable full debug logging.
[ERROR] 
[ERROR] For more information about the errors and possible solutions, please read the following articles:
[ERROR] [Help 1] http://cwiki.apache.org/confluence/display/MAVEN/MojoFailureException
