[INFO] Scanning for projects...
[INFO]                                                                         
[INFO] ------------------------------------------------------------------------
[INFO] Building Joda-Time 2.8.1
[INFO] ------------------------------------------------------------------------
[INFO] 
[INFO] --- maven-resources-plugin:2.7:resources (default-resources) @ joda-time ---
[INFO] Using 'UTF-8' encoding to copy filtered resources.
[INFO] Copying 2 resources to META-INF
[INFO] Copying 10 resources
[INFO] 
[INFO] --- maven-compiler-plugin:3.3:compile (default-compile) @ joda-time ---
[INFO] Changes detected - recompiling the module!
[INFO] Compiling 166 source files to /home/perham/Study/LittleDarwin/Cases/joda-time-2.8.1/target/classes
[INFO] 
[INFO] --- exec-maven-plugin:1.4.0:java (compile-tzdb) @ joda-time ---
Writing zoneinfo files
Writing ZoneInfoMap
[INFO] 
[INFO] --- maven-resources-plugin:2.7:testResources (default-testResources) @ joda-time ---
[INFO] Using 'UTF-8' encoding to copy filtered resources.
[INFO] Copying 34 resources
[INFO] 
[INFO] --- maven-compiler-plugin:3.3:testCompile (default-testCompile) @ joda-time ---
[INFO] Nothing to compile - all classes are up to date
[INFO] 
[INFO] --- maven-surefire-plugin:2.18.1:test (default-test) @ joda-time ---
[INFO] Surefire report directory: /home/perham/Study/LittleDarwin/Cases/joda-time-2.8.1/target/surefire-reports

-------------------------------------------------------
 T E S T S
-------------------------------------------------------
Running org.joda.time.TestAllPackages

TestBuddhistChronology.testCalendar

TestCopticChronology.testCalendar

TestEthiopicChronology.testCalendar

TestIslamicChronology.testCalendar

Testing Gregorian chronology over 1000 iterations
100% complete (i=1000)

Testing Julian chronology over 1000 iterations
100% complete (i=1000)
Writing zoneinfo files
Writing ZoneInfoMap
Tests run: 4157, Failures: 43, Errors: 0, Skipped: 0, Time elapsed: 5.599 sec <<< FAILURE! - in org.joda.time.TestAllPackages
testPropertyWithMinimumValueMillisOfDayDSTGap(org.joda.time.TestDateTime_Properties)  Time elapsed: 0.006 sec  <<< FAILURE!
junit.framework.ComparisonFailure: expected:<2001-04-20T0[1]:00:00.000+03:00> but was:<2001-04-20T0[0]:00:00.000+03:00>
	at junit.framework.Assert.assertEquals(Assert.java:81)
	at junit.framework.Assert.assertEquals(Assert.java:87)
	at org.joda.time.TestDateTime_Properties.testPropertyWithMinimumValueMillisOfDayDSTGap(TestDateTime_Properties.java:665)

testIsLocalDateTimeGap_NewYork(org.joda.time.TestDateTimeZone)  Time elapsed: 0.003 sec  <<< FAILURE!
junit.framework.AssertionFailedError: expected:<true> but was:<false>
	at junit.framework.Assert.fail(Assert.java:47)
	at junit.framework.Assert.failNotEquals(Assert.java:280)
	at junit.framework.Assert.assertEquals(Assert.java:64)
	at junit.framework.Assert.assertEquals(Assert.java:146)
	at junit.framework.Assert.assertEquals(Assert.java:152)
	at org.joda.time.TestDateTimeZone.testIsLocalDateTimeGap_NewYork(TestDateTimeZone.java:951)

test_DateTime_roundCeiling_day_NewYork_Spring_preCutover(org.joda.time.TestDateTimeZoneCutover)  Time elapsed: 0.001 sec  <<< FAILURE!
junit.framework.ComparisonFailure: expected:<...03-12T00:00:00.000-0[4]:00> but was:<...03-12T00:00:00.000-0[5]:00>
	at junit.framework.Assert.assertEquals(Assert.java:81)
	at junit.framework.Assert.assertEquals(Assert.java:87)
	at org.joda.time.TestDateTimeZoneCutover.test_DateTime_roundCeiling_day_NewYork_Spring_preCutover(TestDateTimeZoneCutover.java:593)

test_DateTime_roundCeiling_day_NewYork_Spring_postCutover(org.joda.time.TestDateTimeZoneCutover)  Time elapsed: 0.001 sec  <<< FAILURE!
junit.framework.ComparisonFailure: expected:<...03-11T03:30:00.000-0[4]:00> but was:<...03-11T03:30:00.000-0[5]:00>
	at junit.framework.Assert.assertEquals(Assert.java:81)
	at junit.framework.Assert.assertEquals(Assert.java:87)
	at org.joda.time.TestDateTimeZoneCutover.test_DateTime_roundCeiling_day_NewYork_Spring_postCutover(TestDateTimeZoneCutover.java:598)

test_DateTime_roundCeiling_hour_NewYork_Spring_preCutover(org.joda.time.TestDateTimeZoneCutover)  Time elapsed: 0.001 sec  <<< FAILURE!
junit.framework.ComparisonFailure: expected:<2007-03-11T0[3:00:00.000-04]:00> but was:<2007-03-11T0[2:00:00.000-05]:00>
	at junit.framework.Assert.assertEquals(Assert.java:81)
	at junit.framework.Assert.assertEquals(Assert.java:87)
	at org.joda.time.TestDateTimeZoneCutover.test_DateTime_roundCeiling_hour_NewYork_Spring_preCutover(TestDateTimeZoneCutover.java:607)

test_DateTime_roundCeiling_hour_NewYork_Spring_postCutover(org.joda.time.TestDateTimeZoneCutover)  Time elapsed: 0 sec  <<< FAILURE!
junit.framework.ComparisonFailure: expected:<...03-11T03:30:00.000-0[4]:00> but was:<...03-11T03:30:00.000-0[5]:00>
	at junit.framework.Assert.assertEquals(Assert.java:81)
	at junit.framework.Assert.assertEquals(Assert.java:87)
	at org.joda.time.TestDateTimeZoneCutover.test_DateTime_roundCeiling_hour_NewYork_Spring_postCutover(TestDateTimeZoneCutover.java:612)

test_DateTime_roundCeiling_minute_NewYork_Spring_postCutover(org.joda.time.TestDateTimeZoneCutover)  Time elapsed: 0.001 sec  <<< FAILURE!
junit.framework.ComparisonFailure: expected:<...03-11T03:30:40.000-0[4]:00> but was:<...03-11T03:30:40.000-0[5]:00>
	at junit.framework.Assert.assertEquals(Assert.java:81)
	at junit.framework.Assert.assertEquals(Assert.java:87)
	at org.joda.time.TestDateTimeZoneCutover.test_DateTime_roundCeiling_minute_NewYork_Spring_postCutover(TestDateTimeZoneCutover.java:626)

test_NewYorkIsCorrect_Autumn(org.joda.time.TestDateTimeZoneCutover)  Time elapsed: 0 sec  <<< FAILURE!
junit.framework.ComparisonFailure: expected:<2007-11-04T0[1:00:00.000-05]:00> but was:<2007-11-04T0[2:00:00.000-04]:00>
	at junit.framework.Assert.assertEquals(Assert.java:81)
	at junit.framework.Assert.assertEquals(Assert.java:87)
	at org.joda.time.TestDateTimeZoneCutover.test_NewYorkIsCorrect_Autumn(TestDateTimeZoneCutover.java:640)

test_getOffsetFromLocal_NewYork_Autumn(org.joda.time.TestDateTimeZoneCutover)  Time elapsed: 0.001 sec  <<< FAILURE!
junit.framework.AssertionFailedError: expected:<-18000000> but was:<-14400000>
	at junit.framework.Assert.fail(Assert.java:47)
	at junit.framework.Assert.failNotEquals(Assert.java:280)
	at junit.framework.Assert.assertEquals(Assert.java:64)
	at junit.framework.Assert.assertEquals(Assert.java:133)
	at junit.framework.Assert.assertEquals(Assert.java:139)
	at org.joda.time.TestDateTimeZoneCutover.doTest_getOffsetFromLocal(TestDateTimeZoneCutover.java:1369)
	at org.joda.time.TestDateTimeZoneCutover.doTest_getOffsetFromLocal(TestDateTimeZoneCutover.java:1355)
	at org.joda.time.TestDateTimeZoneCutover.test_getOffsetFromLocal_NewYork_Autumn(TestDateTimeZoneCutover.java:652)

test_DateTime_plusHour_NewYork_Autumn(org.joda.time.TestDateTimeZoneCutover)  Time elapsed: 0.001 sec  <<< FAILURE!
junit.framework.ComparisonFailure: expected:<2007-11-04T0[1:00:00.000-05]:00> but was:<2007-11-04T0[2:00:00.000-04]:00>
	at junit.framework.Assert.assertEquals(Assert.java:81)
	at junit.framework.Assert.assertEquals(Assert.java:87)
	at org.joda.time.TestDateTimeZoneCutover.test_DateTime_plusHour_NewYork_Autumn(TestDateTimeZoneCutover.java:677)

test_DateTime_minusHour_NewYork_Autumn(org.joda.time.TestDateTimeZoneCutover)  Time elapsed: 0.001 sec  <<< FAILURE!
junit.framework.ComparisonFailure: expected:<...11-04T08:00:00.000-0[5]:00> but was:<...11-04T08:00:00.000-0[4]:00>
	at junit.framework.Assert.assertEquals(Assert.java:81)
	at junit.framework.Assert.assertEquals(Assert.java:87)
	at org.joda.time.TestDateTimeZoneCutover.test_DateTime_minusHour_NewYork_Autumn(TestDateTimeZoneCutover.java:684)

test_DateTime_roundFloor_day_NewYork_Autumn_postCutover(org.joda.time.TestDateTimeZoneCutover)  Time elapsed: 0.001 sec  <<< FAILURE!
junit.framework.ComparisonFailure: expected:<2007-11-04T0[1:30:00.000-05]:00> but was:<2007-11-04T0[2:30:00.000-04]:00>
	at junit.framework.Assert.assertEquals(Assert.java:81)
	at junit.framework.Assert.assertEquals(Assert.java:87)
	at org.joda.time.TestDateTimeZoneCutover.test_DateTime_roundFloor_day_NewYork_Autumn_postCutover(TestDateTimeZoneCutover.java:706)

test_DateTime_roundFloor_hourOfDay_NewYork_Autumn_postCutover(org.joda.time.TestDateTimeZoneCutover)  Time elapsed: 0.001 sec  <<< FAILURE!
junit.framework.ComparisonFailure: expected:<2007-11-04T0[1:30:00.000-05]:00> but was:<2007-11-04T0[2:30:00.000-04]:00>
	at junit.framework.Assert.assertEquals(Assert.java:81)
	at junit.framework.Assert.assertEquals(Assert.java:87)
	at org.joda.time.TestDateTimeZoneCutover.test_DateTime_roundFloor_hourOfDay_NewYork_Autumn_postCutover(TestDateTimeZoneCutover.java:720)

test_DateTime_roundFloor_minuteOfHour_NewYork_Autumn_postCutover(org.joda.time.TestDateTimeZoneCutover)  Time elapsed: 0.001 sec  <<< FAILURE!
junit.framework.ComparisonFailure: expected:<2007-11-04T0[1:30:40.000-05]:00> but was:<2007-11-04T0[2:30:40.000-04]:00>
	at junit.framework.Assert.assertEquals(Assert.java:81)
	at junit.framework.Assert.assertEquals(Assert.java:87)
	at org.joda.time.TestDateTimeZoneCutover.test_DateTime_roundFloor_minuteOfHour_NewYork_Autumn_postCutover(TestDateTimeZoneCutover.java:734)

test_DateTime_roundFloor_secondOfMinute_NewYork_Autumn_postCutover(org.joda.time.TestDateTimeZoneCutover)  Time elapsed: 0.001 sec  <<< FAILURE!
junit.framework.ComparisonFailure: expected:<2007-11-04T0[1:30:40.500-05]:00> but was:<2007-11-04T0[2:30:40.500-04]:00>
	at junit.framework.Assert.assertEquals(Assert.java:81)
	at junit.framework.Assert.assertEquals(Assert.java:87)
	at org.joda.time.TestDateTimeZoneCutover.test_DateTime_roundFloor_secondOfMinute_NewYork_Autumn_postCutover(TestDateTimeZoneCutover.java:748)

test_DateTime_roundCeiling_day_NewYork_Autumn_preCutover(org.joda.time.TestDateTimeZoneCutover)  Time elapsed: 0.001 sec  <<< FAILURE!
junit.framework.ComparisonFailure: expected:<...11-05T00:00:00.000-0[5]:00> but was:<...11-05T00:00:00.000-0[4]:00>
	at junit.framework.Assert.assertEquals(Assert.java:81)
	at junit.framework.Assert.assertEquals(Assert.java:87)
	at org.joda.time.TestDateTimeZoneCutover.test_DateTime_roundCeiling_day_NewYork_Autumn_preCutover(TestDateTimeZoneCutover.java:758)

test_DateTime_roundCeiling_day_NewYork_Autumn_postCutover(org.joda.time.TestDateTimeZoneCutover)  Time elapsed: 0.001 sec  <<< FAILURE!
junit.framework.ComparisonFailure: expected:<2007-11-04T0[1:30:00.000-05]:00> but was:<2007-11-04T0[2:30:00.000-04]:00>
	at junit.framework.Assert.assertEquals(Assert.java:81)
	at junit.framework.Assert.assertEquals(Assert.java:87)
	at org.joda.time.TestDateTimeZoneCutover.test_DateTime_roundCeiling_day_NewYork_Autumn_postCutover(TestDateTimeZoneCutover.java:763)

test_DateTime_roundCeiling_hourOfDay_NewYork_Autumn_preCutover(org.joda.time.TestDateTimeZoneCutover)  Time elapsed: 0.001 sec  <<< FAILURE!
junit.framework.ComparisonFailure: expected:<2007-11-04T0[1:00:00.000-05]:00> but was:<2007-11-04T0[2:00:00.000-04]:00>
	at junit.framework.Assert.assertEquals(Assert.java:81)
	at junit.framework.Assert.assertEquals(Assert.java:87)
	at org.joda.time.TestDateTimeZoneCutover.test_DateTime_roundCeiling_hourOfDay_NewYork_Autumn_preCutover(TestDateTimeZoneCutover.java:772)

test_DateTime_roundCeiling_hourOfDay_NewYork_Autumn_postCutover(org.joda.time.TestDateTimeZoneCutover)  Time elapsed: 0.001 sec  <<< FAILURE!
junit.framework.ComparisonFailure: expected:<2007-11-04T0[1:30:00.000-05]:00> but was:<2007-11-04T0[2:30:00.000-04]:00>
	at junit.framework.Assert.assertEquals(Assert.java:81)
	at junit.framework.Assert.assertEquals(Assert.java:87)
	at org.joda.time.TestDateTimeZoneCutover.test_DateTime_roundCeiling_hourOfDay_NewYork_Autumn_postCutover(TestDateTimeZoneCutover.java:777)

test_DateTime_roundCeiling_minuteOfHour_NewYork_Autumn_postCutover(org.joda.time.TestDateTimeZoneCutover)  Time elapsed: 0.001 sec  <<< FAILURE!
junit.framework.ComparisonFailure: expected:<2007-11-04T0[1:30:40.000-05]:00> but was:<2007-11-04T0[2:30:40.000-04]:00>
	at junit.framework.Assert.assertEquals(Assert.java:81)
	at junit.framework.Assert.assertEquals(Assert.java:87)
	at org.joda.time.TestDateTimeZoneCutover.test_DateTime_roundCeiling_minuteOfHour_NewYork_Autumn_postCutover(TestDateTimeZoneCutover.java:791)

test_DateTime_roundCeiling_secondOfMinute_NewYork_Autumn_postCutover(org.joda.time.TestDateTimeZoneCutover)  Time elapsed: 0.001 sec  <<< FAILURE!
junit.framework.ComparisonFailure: expected:<2007-11-04T0[1:30:40.500-05]:00> but was:<2007-11-04T0[2:30:40.500-04]:00>
	at junit.framework.Assert.assertEquals(Assert.java:81)
	at junit.framework.Assert.assertEquals(Assert.java:87)
	at org.joda.time.TestDateTimeZoneCutover.test_DateTime_roundCeiling_secondOfMinute_NewYork_Autumn_postCutover(TestDateTimeZoneCutover.java:805)

test_NewYorkIsCorrect_Spring(org.joda.time.TestDateTimeZoneCutover)  Time elapsed: 0.001 sec  <<< FAILURE!
junit.framework.ComparisonFailure: expected:<2007-03-11T0[3:00:00.000-04]:00> but was:<2007-03-11T0[2:00:00.000-05]:00>
	at junit.framework.Assert.assertEquals(Assert.java:81)
	at junit.framework.Assert.assertEquals(Assert.java:87)
	at org.joda.time.TestDateTimeZoneCutover.test_NewYorkIsCorrect_Spring(TestDateTimeZoneCutover.java:493)

test_getOffsetFromLocal_NewYork_Spring(org.joda.time.TestDateTimeZoneCutover)  Time elapsed: 0.001 sec  <<< FAILURE!
junit.framework.ComparisonFailure: 2007-03-11T02:00:00.000-05:00 expected:<2007-03-11T0[3:00:00.000-04]:00> but was:<2007-03-11T0[2:00:00.000-05]:00>
	at junit.framework.Assert.assertEquals(Assert.java:81)
	at org.joda.time.TestDateTimeZoneCutover.doTest_getOffsetFromLocal(TestDateTimeZoneCutover.java:1371)
	at org.joda.time.TestDateTimeZoneCutover.doTest_getOffsetFromLocal(TestDateTimeZoneCutover.java:1355)
	at org.joda.time.TestDateTimeZoneCutover.test_getOffsetFromLocal_NewYork_Spring(TestDateTimeZoneCutover.java:502)

test_DateTime_setHourAcross_NewYork_Spring(org.joda.time.TestDateTimeZoneCutover)  Time elapsed: 0.001 sec  <<< FAILURE!
junit.framework.ComparisonFailure: expected:<...03-11T04:00:00.000-0[4]:00> but was:<...03-11T04:00:00.000-0[5]:00>
	at junit.framework.Assert.assertEquals(Assert.java:81)
	at junit.framework.Assert.assertEquals(Assert.java:87)
	at org.joda.time.TestDateTimeZoneCutover.test_DateTime_setHourAcross_NewYork_Spring(TestDateTimeZoneCutover.java:518)

test_DateTime_setHourForward_NewYork_Spring(org.joda.time.TestDateTimeZoneCutover)  Time elapsed: 0.001 sec  <<< FAILURE!
junit.framework.AssertionFailedError
	at junit.framework.Assert.fail(Assert.java:47)
	at junit.framework.Assert.fail(Assert.java:53)
	at org.joda.time.TestDateTimeZoneCutover.test_DateTime_setHourForward_NewYork_Spring(TestDateTimeZoneCutover.java:527)

test_DateTime_setHourBack_NewYork_Spring(org.joda.time.TestDateTimeZoneCutover)  Time elapsed: 0 sec  <<< FAILURE!
junit.framework.ComparisonFailure: expected:<...03-11T08:00:00.000-0[4]:00> but was:<...03-11T08:00:00.000-0[5]:00>
	at junit.framework.Assert.assertEquals(Assert.java:81)
	at junit.framework.Assert.assertEquals(Assert.java:87)
	at org.joda.time.TestDateTimeZoneCutover.test_DateTime_setHourBack_NewYork_Spring(TestDateTimeZoneCutover.java:535)

test_DateTime_roundFloor_day_NewYork_Spring_postCutover(org.joda.time.TestDateTimeZoneCutover)  Time elapsed: 0.001 sec  <<< FAILURE!
junit.framework.ComparisonFailure: expected:<...03-11T03:30:00.000-0[4]:00> but was:<...03-11T03:30:00.000-0[5]:00>
	at junit.framework.Assert.assertEquals(Assert.java:81)
	at junit.framework.Assert.assertEquals(Assert.java:87)
	at org.joda.time.TestDateTimeZoneCutover.test_DateTime_roundFloor_day_NewYork_Spring_postCutover(TestDateTimeZoneCutover.java:555)

test_DateTime_roundFloor_hour_NewYork_Spring_postCutover(org.joda.time.TestDateTimeZoneCutover)  Time elapsed: 0.001 sec  <<< FAILURE!
junit.framework.ComparisonFailure: expected:<...03-11T03:30:00.000-0[4]:00> but was:<...03-11T03:30:00.000-0[5]:00>
	at junit.framework.Assert.assertEquals(Assert.java:81)
	at junit.framework.Assert.assertEquals(Assert.java:87)
	at org.joda.time.TestDateTimeZoneCutover.test_DateTime_roundFloor_hour_NewYork_Spring_postCutover(TestDateTimeZoneCutover.java:569)

test_DateTime_roundFloor_minute_NewYork_Spring_postCutover(org.joda.time.TestDateTimeZoneCutover)  Time elapsed: 0.001 sec  <<< FAILURE!
junit.framework.ComparisonFailure: expected:<...03-11T03:30:40.000-0[4]:00> but was:<...03-11T03:30:40.000-0[5]:00>
	at junit.framework.Assert.assertEquals(Assert.java:81)
	at junit.framework.Assert.assertEquals(Assert.java:87)
	at org.joda.time.TestDateTimeZoneCutover.test_DateTime_roundFloor_minute_NewYork_Spring_postCutover(TestDateTimeZoneCutover.java:583)

testWithMillisOfSecondInDstChange_NewYork_winter(org.joda.time.TestDateTimeZoneCutover)  Time elapsed: 0.001 sec  <<< FAILURE!
junit.framework.ComparisonFailure: expected:<2007-11-04T0[1:30:00.123-05]:00> but was:<2007-11-04T0[2:30:00.123-04]:00>
	at junit.framework.Assert.assertEquals(Assert.java:81)
	at junit.framework.Assert.assertEquals(Assert.java:87)
	at org.joda.time.TestDateTimeZoneCutover.testWithMillisOfSecondInDstChange_NewYork_winter(TestDateTimeZoneCutover.java:1182)

testBug2182444_usCentral(org.joda.time.TestDateTimeZoneCutover)  Time elapsed: 0.002 sec  <<< FAILURE!
junit.framework.AssertionFailedError: Should be standard time
	at junit.framework.Assert.fail(Assert.java:47)
	at junit.framework.Assert.assertTrue(Assert.java:20)
	at org.joda.time.TestDateTimeZoneCutover.testBug2182444_usCentral(TestDateTimeZoneCutover.java:1213)

testBug2182444_ausNSW(org.joda.time.TestDateTimeZoneCutover)  Time elapsed: 0.002 sec  <<< FAILURE!
junit.framework.AssertionFailedError: Should be standard time
	at junit.framework.Assert.fail(Assert.java:47)
	at junit.framework.Assert.assertTrue(Assert.java:20)
	at org.joda.time.TestDateTimeZoneCutover.testBug2182444_ausNSW(TestDateTimeZoneCutover.java:1232)

testBug3476684_adjustOffset(org.joda.time.TestDateTimeZoneCutover)  Time elapsed: 0.002 sec  <<< FAILURE!
junit.framework.AssertionFailedError: expected:<2012-02-26T00:15:00.000-02:00> but was:<2012-02-25T23:15:00.000-02:00>
	at junit.framework.Assert.fail(Assert.java:47)
	at junit.framework.Assert.failNotEquals(Assert.java:280)
	at junit.framework.Assert.assertEquals(Assert.java:64)
	at junit.framework.Assert.assertEquals(Assert.java:71)
	at org.joda.time.TestDateTimeZoneCutover.testBug3476684_adjustOffset(TestDateTimeZoneCutover.java:1292)

testDateTimeCreation_newYork(org.joda.time.TestDateTimeZoneCutover)  Time elapsed: 0.002 sec  <<< FAILURE!
junit.framework.ComparisonFailure: expected:<2010-11-07T0[1:15:00.000-05]:00> but was:<2010-11-07T0[2:15:00.000-04]:00>
	at junit.framework.Assert.assertEquals(Assert.java:81)
	at junit.framework.Assert.assertEquals(Assert.java:87)
	at org.joda.time.TestDateTimeZoneCutover.testDateTimeCreation_newYork(TestDateTimeZoneCutover.java:1341)

testDateTimeCreation_losAngeles(org.joda.time.TestDateTimeZoneCutover)  Time elapsed: 0.002 sec  <<< FAILURE!
junit.framework.ComparisonFailure: expected:<2010-11-07T0[1:15:00.000-08]:00> but was:<2010-11-07T0[2:15:00.000-07]:00>
	at junit.framework.Assert.assertEquals(Assert.java:81)
	at junit.framework.Assert.assertEquals(Assert.java:87)
	at org.joda.time.TestDateTimeZoneCutover.testDateTimeCreation_losAngeles(TestDateTimeZoneCutover.java:1348)

testZoneTransition(org.joda.time.TestIllegalFieldValueException)  Time elapsed: 0 sec  <<< FAILURE!
junit.framework.AssertionFailedError
	at junit.framework.Assert.fail(Assert.java:47)
	at junit.framework.Assert.fail(Assert.java:53)
	at org.joda.time.TestIllegalFieldValueException.testZoneTransition(TestIllegalFieldValueException.java:198)

test_lenientChrononolgy_Chicago(org.joda.time.chrono.TestLenientChronology)  Time elapsed: 0.002 sec  <<< FAILURE!
junit.framework.ComparisonFailure: expected:<2007-03-11T0[3:30:00.000-05]:00> but was:<2007-03-11T0[2:30:00.000-06]:00>
	at junit.framework.Assert.assertEquals(Assert.java:81)
	at junit.framework.Assert.assertEquals(Assert.java:87)
	at org.joda.time.chrono.TestLenientChronology.test_lenientChrononolgy_Chicago(TestLenientChronology.java:139)

test_strictChrononolgy_Chicago(org.joda.time.chrono.TestLenientChronology)  Time elapsed: 0.001 sec  <<< FAILURE!
junit.framework.AssertionFailedError
	at junit.framework.Assert.fail(Assert.java:47)
	at junit.framework.Assert.fail(Assert.java:53)
	at org.joda.time.chrono.TestLenientChronology.test_strictChrononolgy_Chicago(TestLenientChronology.java:153)

test_isoChrononolgy_Chicago(org.joda.time.chrono.TestLenientChronology)  Time elapsed: 0 sec  <<< FAILURE!
junit.framework.AssertionFailedError
	at junit.framework.Assert.fail(Assert.java:47)
	at junit.framework.Assert.fail(Assert.java:53)
	at org.joda.time.chrono.TestLenientChronology.test_isoChrononolgy_Chicago(TestLenientChronology.java:164)

testSerialization(org.joda.time.tz.TestBuilder)  Time elapsed: 0.026 sec  <<< FAILURE!
junit.framework.AssertionFailedError: expected:<544615200000> but was:<545220000000>
	at junit.framework.Assert.fail(Assert.java:47)
	at junit.framework.Assert.failNotEquals(Assert.java:280)
	at junit.framework.Assert.assertEquals(Assert.java:64)
	at junit.framework.Assert.assertEquals(Assert.java:133)
	at junit.framework.Assert.assertEquals(Assert.java:139)
	at org.joda.time.tz.TestBuilder.testForwardTransitions(TestBuilder.java:234)
	at org.joda.time.tz.TestBuilder.testSerialization(TestBuilder.java:282)

testForwardTransitions(org.joda.time.tz.TestBuilder)  Time elapsed: 0.023 sec  <<< FAILURE!
junit.framework.AssertionFailedError: expected:<544615200000> but was:<545220000000>
	at junit.framework.Assert.fail(Assert.java:47)
	at junit.framework.Assert.failNotEquals(Assert.java:280)
	at junit.framework.Assert.assertEquals(Assert.java:64)
	at junit.framework.Assert.assertEquals(Assert.java:133)
	at junit.framework.Assert.assertEquals(Assert.java:139)
	at org.joda.time.tz.TestBuilder.testForwardTransitions(TestBuilder.java:234)
	at org.joda.time.tz.TestBuilder.testForwardTransitions(TestBuilder.java:217)

testReverseTransitions(org.joda.time.tz.TestBuilder)  Time elapsed: 0.006 sec  <<< FAILURE!
junit.framework.AssertionFailedError: expected:<954669599999> but was:<955274399999>
	at junit.framework.Assert.fail(Assert.java:47)
	at junit.framework.Assert.failNotEquals(Assert.java:280)
	at junit.framework.Assert.assertEquals(Assert.java:64)
	at junit.framework.Assert.assertEquals(Assert.java:133)
	at junit.framework.Assert.assertEquals(Assert.java:139)
	at org.joda.time.tz.TestBuilder.testReverseTransitions(TestBuilder.java:270)
	at org.joda.time.tz.TestBuilder.testReverseTransitions(TestBuilder.java:255)

testCompile(org.joda.time.tz.TestCompiler)  Time elapsed: 0.041 sec  <<< FAILURE!
junit.framework.AssertionFailedError: expected:<544615200000> but was:<545220000000>
	at junit.framework.Assert.fail(Assert.java:47)
	at junit.framework.Assert.failNotEquals(Assert.java:280)
	at junit.framework.Assert.assertEquals(Assert.java:64)
	at junit.framework.Assert.assertEquals(Assert.java:133)
	at junit.framework.Assert.assertEquals(Assert.java:139)
	at org.joda.time.tz.TestBuilder.testForwardTransitions(TestBuilder.java:234)
	at org.joda.time.tz.TestCompiler.testCompile(TestCompiler.java:117)


Results :

Failed tests: 
  org.joda.time.TestDateTimeZone#testIsLocalDateTimeGap_NewYork AssertionFailedError
  org.joda.time.TestDateTimeZoneCutover#testBug2182444_ausNSW AssertionFailedError
  org.joda.time.TestDateTimeZoneCutover#testBug2182444_usCentral AssertionFailedError
  org.joda.time.TestDateTimeZoneCutover#testBug3476684_adjustOffset AssertionFailedError
  org.joda.time.TestDateTimeZoneCutover#testDateTimeCreation_losAngeles ComparisonFailure
  org.joda.time.TestDateTimeZoneCutover#testDateTimeCreation_newYork ComparisonFailure
  org.joda.time.TestDateTimeZoneCutover#testWithMillisOfSecondInDstChange_NewYork_winter ComparisonFailure
  org.joda.time.TestDateTimeZoneCutover#test_DateTime_minusHour_NewYork_Autumn ComparisonFailure
  org.joda.time.TestDateTimeZoneCutover#test_DateTime_plusHour_NewYork_Autumn ComparisonFailure
  org.joda.time.TestDateTimeZoneCutover#test_DateTime_roundCeiling_day_NewYork_Autumn_postCutover ComparisonFailure
  org.joda.time.TestDateTimeZoneCutover#test_DateTime_roundCeiling_day_NewYork_Autumn_preCutover ComparisonFailure
  org.joda.time.TestDateTimeZoneCutover#test_DateTime_roundCeiling_day_NewYork_Spring_postCutover ComparisonFailure
  org.joda.time.TestDateTimeZoneCutover#test_DateTime_roundCeiling_day_NewYork_Spring_preCutover ComparisonFailure
  org.joda.time.TestDateTimeZoneCutover#test_DateTime_roundCeiling_hourOfDay_NewYork_Autumn_postCutover ComparisonFailure
  org.joda.time.TestDateTimeZoneCutover#test_DateTime_roundCeiling_hourOfDay_NewYork_Autumn_preCutover ComparisonFailure
  org.joda.time.TestDateTimeZoneCutover#test_DateTime_roundCeiling_hour_NewYork_Spring_postCutover ComparisonFailure
  org.joda.time.TestDateTimeZoneCutover#test_DateTime_roundCeiling_hour_NewYork_Spring_preCutover ComparisonFailure
  org.joda.time.TestDateTimeZoneCutover#test_DateTime_roundCeiling_minuteOfHour_NewYork_Autumn_postCutover ComparisonFailure
  org.joda.time.TestDateTimeZoneCutover#test_DateTime_roundCeiling_minute_NewYork_Spring_postCutover ComparisonFailure
  org.joda.time.TestDateTimeZoneCutover#test_DateTime_roundCeiling_secondOfMinute_NewYork_Autumn_postCutover ComparisonFailure
  org.joda.time.TestDateTimeZoneCutover#test_DateTime_roundFloor_day_NewYork_Autumn_postCutover ComparisonFailure
  org.joda.time.TestDateTimeZoneCutover#test_DateTime_roundFloor_day_NewYork_Spring_postCutover ComparisonFailure
  org.joda.time.TestDateTimeZoneCutover#test_DateTime_roundFloor_hourOfDay_NewYork_Autumn_postCutover ComparisonFailure
  org.joda.time.TestDateTimeZoneCutover#test_DateTime_roundFloor_hour_NewYork_Spring_postCutover ComparisonFailure
  org.joda.time.TestDateTimeZoneCutover#test_DateTime_roundFloor_minuteOfHour_NewYork_Autumn_postCutover ComparisonFailure
  org.joda.time.TestDateTimeZoneCutover#test_DateTime_roundFloor_minute_NewYork_Spring_postCutover ComparisonFailure
  org.joda.time.TestDateTimeZoneCutover#test_DateTime_roundFloor_secondOfMinute_NewYork_Autumn_postCutover ComparisonFailure
  org.joda.time.TestDateTimeZoneCutover#test_DateTime_setHourAcross_NewYork_Spring ComparisonFailure
  org.joda.time.TestDateTimeZoneCutover#test_DateTime_setHourBack_NewYork_Spring ComparisonFailure
  org.joda.time.TestDateTimeZoneCutover#test_DateTime_setHourForward_NewYork_Spring AssertionFailedError
  org.joda.time.TestDateTimeZoneCutover#test_NewYorkIsCorrect_Autumn ComparisonFailure
  org.joda.time.TestDateTimeZoneCutover#test_NewYorkIsCorrect_Spring ComparisonFailure
  org.joda.time.TestDateTimeZoneCutover#test_getOffsetFromLocal_NewYork_Autumn AssertionFailedError
  org.joda.time.TestDateTimeZoneCutover#test_getOffsetFromLocal_NewYork_Spring ComparisonFailure
  org.joda.time.TestDateTime_Properties#testPropertyWithMinimumValueMillisOfDayDSTGap ComparisonFailure
  org.joda.time.TestIllegalFieldValueException#testZoneTransition AssertionFailedError
  org.joda.time.chrono.TestLenientChronology#test_isoChrononolgy_Chicago AssertionFailedError
  org.joda.time.chrono.TestLenientChronology#test_lenientChrononolgy_Chicago ComparisonFailure
  org.joda.time.chrono.TestLenientChronology#test_strictChrononolgy_Chicago AssertionFailedError
  org.joda.time.tz.TestBuilder#testForwardTransitions AssertionFailedError expec...
  org.joda.time.tz.TestBuilder#testReverseTransitions AssertionFailedError expec...
  org.joda.time.tz.TestBuilder#testSerialization AssertionFailedError expected:<...
  org.joda.time.tz.TestCompiler#testCompile AssertionFailedError expected:<54461...

Tests run: 4157, Failures: 43, Errors: 0, Skipped: 0

[INFO] ------------------------------------------------------------------------
[INFO] BUILD FAILURE
[INFO] ------------------------------------------------------------------------
[INFO] Total time: 16.441s
[INFO] Finished at: Thu Aug 06 13:17:11 BST 2015
[INFO] Final Memory: 8M/215M
[INFO] ------------------------------------------------------------------------
[ERROR] Failed to execute goal org.apache.maven.plugins:maven-surefire-plugin:2.18.1:test (default-test) on project joda-time: There are test failures.
[ERROR] 
[ERROR] Please refer to /home/perham/Study/LittleDarwin/Cases/joda-time-2.8.1/target/surefire-reports for the individual test results.
[ERROR] -> [Help 1]
[ERROR] 
[ERROR] To see the full stack trace of the errors, re-run Maven with the -e switch.
[ERROR] Re-run Maven using the -X switch to enable full debug logging.
[ERROR] 
[ERROR] For more information about the errors and possible solutions, please read the following articles:
[ERROR] [Help 1] http://cwiki.apache.org/confluence/display/MAVEN/MojoFailureException
