[INFO] Scanning for projects...
[INFO]                                                                         
[INFO] ------------------------------------------------------------------------
[INFO] Building Joda-Time 2.8.1
[INFO] ------------------------------------------------------------------------
[INFO] 
[INFO] --- maven-resources-plugin:2.7:resources (default-resources) @ joda-time ---
[INFO] Using 'UTF-8' encoding to copy filtered resources.
[INFO] Copying 2 resources to META-INF
[INFO] Copying 10 resources
[INFO] 
[INFO] --- maven-compiler-plugin:3.3:compile (default-compile) @ joda-time ---
[INFO] Changes detected - recompiling the module!
[INFO] Compiling 166 source files to /home/perham/Study/LittleDarwin/Cases/joda-time-2.8.1/target/classes
[INFO] 
[INFO] --- exec-maven-plugin:1.4.0:java (compile-tzdb) @ joda-time ---
Writing zoneinfo files
*e* Error in Africa/Algiers: Didn't read properly from file
*e* Error in Atlantic/Cape_Verde: Didn't read properly from file
*e* Error in Africa/Cairo: Didn't read properly from file
*e* Error in Africa/Accra: Didn't read properly from file
*e* Error in Africa/Nairobi: Didn't read properly from file
*e* Error in Africa/Tripoli: Didn't read properly from file
*e* Error in Indian/Mauritius: Didn't read properly from file
*e* Error in Africa/Casablanca: Didn't read properly from file
*e* Error in Africa/El_Aaiun: Didn't read properly from file
*e* Error in Africa/Windhoek: Didn't read properly from file
*e* Error in Africa/Johannesburg: Didn't read properly from file
*e* Error in Africa/Tunis: Didn't read properly from file
*e* Error in Antarctica/Casey: Didn't read properly from file
*e* Error in Antarctica/Davis: Didn't read properly from file
*e* Error in Antarctica/Mawson: Didn't read properly from file
*e* Error in Indian/Kerguelen: Didn't read properly from file
*e* Error in Antarctica/DumontDUrville: Didn't read properly from file
*e* Error in Antarctica/Syowa: Didn't read properly from file
*e* Error in Antarctica/Troll: Didn't read properly from file
*e* Error in Antarctica/Vostok: Didn't read properly from file
*e* Error in Asia/Kabul: Didn't read properly from file
*e* Error in Asia/Yerevan: Didn't read properly from file
*e* Error in Asia/Baku: Didn't read properly from file
*e* Error in Asia/Dhaka: Didn't read properly from file
*e* Error in Asia/Brunei: Didn't read properly from file
*e* Error in Asia/Rangoon: Didn't read properly from file
*e* Error in Asia/Shanghai: Didn't read properly from file
*e* Error in Asia/Hong_Kong: Didn't read properly from file
*e* Error in Asia/Taipei: Didn't read properly from file
*e* Error in Asia/Macau: Didn't read properly from file
*e* Error in Asia/Tbilisi: Didn't read properly from file
*e* Error in Asia/Dili: Didn't read properly from file
*e* Error in Asia/Kolkata: Didn't read properly from file
*e* Error in Asia/Jakarta: Didn't read properly from file
*e* Error in Asia/Pontianak: Didn't read properly from file
*e* Error in Asia/Makassar: Didn't read properly from file
*e* Error in Asia/Jayapura: Didn't read properly from file
*e* Error in Asia/Tehran: Didn't read properly from file
*e* Error in Asia/Baghdad: Didn't read properly from file
*e* Error in Asia/Jerusalem: Didn't read properly from file
*e* Error in Asia/Tokyo: Didn't read properly from file
*e* Error in Asia/Amman: Didn't read properly from file
*e* Error in Asia/Almaty: Didn't read properly from file
*e* Error in Asia/Qyzylorda: Didn't read properly from file
*e* Error in Asia/Aqtobe: Didn't read properly from file
*e* Error in Asia/Aqtau: Didn't read properly from file
*e* Error in Asia/Oral: Didn't read properly from file
*e* Error in Asia/Bishkek: Didn't read properly from file
*e* Error in Asia/Seoul: Didn't read properly from file
*e* Error in Asia/Pyongyang: Didn't read properly from file
*e* Error in Asia/Beirut: Didn't read properly from file
*e* Error in Asia/Kuala_Lumpur: Didn't read properly from file
*e* Error in Asia/Kuching: Didn't read properly from file
*e* Error in Indian/Maldives: Didn't read properly from file
*e* Error in Asia/Hovd: Didn't read properly from file
*e* Error in Asia/Ulaanbaatar: Didn't read properly from file
*e* Error in Asia/Choibalsan: Didn't read properly from file
*e* Error in Asia/Karachi: Didn't read properly from file
*e* Error in Asia/Gaza: Didn't read properly from file
*e* Error in Asia/Hebron: Didn't read properly from file
*e* Error in Asia/Manila: Didn't read properly from file
*e* Error in Asia/Singapore: Didn't read properly from file
*e* Error in Asia/Colombo: Didn't read properly from file
*e* Error in Asia/Damascus: Didn't read properly from file
*e* Error in Asia/Dushanbe: Didn't read properly from file
*e* Error in Asia/Ashgabat: Didn't read properly from file
*e* Error in Asia/Samarkand: Didn't read properly from file
*e* Error in Asia/Tashkent: Didn't read properly from file
*e* Error in Asia/Ho_Chi_Minh: Didn't read properly from file
*e* Error in Australia/Darwin: Didn't read properly from file
*e* Error in Australia/Perth: Didn't read properly from file
*e* Error in Australia/Eucla: Didn't read properly from file
*e* Error in Australia/Brisbane: Didn't read properly from file
*e* Error in Australia/Lindeman: Didn't read properly from file
*e* Error in Australia/Adelaide: Didn't read properly from file
*e* Error in Australia/Hobart: Didn't read properly from file
*e* Error in Australia/Currie: Didn't read properly from file
*e* Error in Australia/Melbourne: Didn't read properly from file
*e* Error in Australia/Sydney: Didn't read properly from file
*e* Error in Australia/Broken_Hill: Didn't read properly from file
*e* Error in Australia/Lord_Howe: Didn't read properly from file
*e* Error in Antarctica/Macquarie: Didn't read properly from file
*e* Error in Pacific/Fiji: Didn't read properly from file
*e* Error in Pacific/Marquesas: Didn't read properly from file
*e* Error in Pacific/Guam: Didn't read properly from file
*e* Error in Pacific/Kiritimati: Didn't read properly from file
*e* Error in Pacific/Majuro: Didn't read properly from file
*e* Error in Pacific/Kwajalein: Didn't read properly from file
*e* Error in Pacific/Kosrae: Didn't read properly from file
*e* Error in Pacific/Nauru: Didn't read properly from file
*e* Error in Pacific/Auckland: Didn't read properly from file
*e* Error in Pacific/Chatham: Didn't read properly from file
*e* Error in Pacific/Niue: Didn't read properly from file
*e* Error in Pacific/Norfolk: Didn't read properly from file
*e* Error in Pacific/Bougainville: Didn't read properly from file
*e* Error in Pacific/Pago_Pago: Didn't read properly from file
*e* Error in Pacific/Apia: Didn't read properly from file
*e* Error in Pacific/Fakaofo: Didn't read properly from file
*e* Error in Pacific/Tongatapu: Didn't read properly from file
*e* Error in Europe/London: Didn't read properly from file
*e* Error in Europe/Dublin: Didn't read properly from file
*e* Error in CET: Didn't read properly from file
*e* Error in MET: Didn't read properly from file
*e* Error in Europe/Tirane: Didn't read properly from file
*e* Error in Europe/Andorra: Didn't read properly from file
*e* Error in Europe/Vienna: Didn't read properly from file
*e* Error in Europe/Minsk: Didn't read properly from file
*e* Error in Europe/Brussels: Didn't read properly from file
*e* Error in Europe/Sofia: Didn't read properly from file
*e* Error in Europe/Prague: Didn't read properly from file
*e* Error in Europe/Copenhagen: Didn't read properly from file
*e* Error in America/Thule: Didn't read properly from file
*e* Error in Europe/Tallinn: Didn't read properly from file
*e* Error in Europe/Helsinki: Didn't read properly from file
*e* Error in Europe/Paris: Didn't read properly from file
*e* Error in Europe/Berlin: Didn't read properly from file
*e* Error in Europe/Gibraltar: Didn't read properly from file
*e* Error in Europe/Athens: Didn't read properly from file
*e* Error in Europe/Budapest: Didn't read properly from file
*e* Error in Atlantic/Reykjavik: Didn't read properly from file
*e* Error in Europe/Rome: Didn't read properly from file
*e* Error in Europe/Riga: Didn't read properly from file
*e* Error in Europe/Vilnius: Didn't read properly from file
*e* Error in Europe/Luxembourg: Didn't read properly from file
*e* Error in Europe/Malta: Didn't read properly from file
*e* Error in Europe/Chisinau: Didn't read properly from file
*e* Error in Europe/Monaco: Didn't read properly from file
*e* Error in Europe/Amsterdam: Didn't read properly from file
*e* Error in Europe/Oslo: Didn't read properly from file
*e* Error in Europe/Warsaw: Didn't read properly from file
*e* Error in Europe/Lisbon: Didn't read properly from file
*e* Error in Atlantic/Azores: Didn't read properly from file
*e* Error in Atlantic/Madeira: Didn't read properly from file
*e* Error in Europe/Bucharest: Didn't read properly from file
*e* Error in Europe/Kaliningrad: Didn't read properly from file
*e* Error in Europe/Moscow: Didn't read properly from file
*e* Error in Europe/Simferopol: Didn't read properly from file
*e* Error in Europe/Volgograd: Didn't read properly from file
*e* Error in Europe/Samara: Didn't read properly from file
*e* Error in Asia/Yekaterinburg: Didn't read properly from file
*e* Error in Asia/Omsk: Didn't read properly from file
*e* Error in Asia/Novosibirsk: Didn't read properly from file
*e* Error in Asia/Novokuznetsk: Didn't read properly from file
*e* Error in Asia/Krasnoyarsk: Didn't read properly from file
*e* Error in Asia/Irkutsk: Didn't read properly from file
*e* Error in Asia/Chita: Didn't read properly from file
*e* Error in Asia/Yakutsk: Didn't read properly from file
*e* Error in Asia/Vladivostok: Didn't read properly from file
*e* Error in Asia/Khandyga: Didn't read properly from file
*e* Error in Asia/Sakhalin: Didn't read properly from file
*e* Error in Asia/Magadan: Didn't read properly from file
*e* Error in Asia/Srednekolymsk: Didn't read properly from file
*e* Error in Asia/Ust-Nera: Didn't read properly from file
*e* Error in Asia/Kamchatka: Didn't read properly from file
*e* Error in Asia/Anadyr: Didn't read properly from file
*e* Error in Europe/Belgrade: Didn't read properly from file
*e* Error in Europe/Madrid: Didn't read properly from file
*e* Error in Africa/Ceuta: Didn't read properly from file
*e* Error in Atlantic/Canary: Didn't read properly from file
*e* Error in Europe/Stockholm: Didn't read properly from file
*e* Error in Europe/Zurich: Didn't read properly from file
*e* Error in Europe/Istanbul: Didn't read properly from file
*e* Error in Europe/Kiev: Didn't read properly from file
*e* Error in Europe/Uzhgorod: Didn't read properly from file
*e* Error in Europe/Zaporozhye: Didn't read properly from file
*e* Error in EST5EDT: Didn't read properly from file
*e* Error in CST6CDT: Didn't read properly from file
*e* Error in MST7MDT: Didn't read properly from file
*e* Error in PST8PDT: Didn't read properly from file
*e* Error in America/New_York: Didn't read properly from file
*e* Error in America/Chicago: Didn't read properly from file
*e* Error in America/North_Dakota/Center: Didn't read properly from file
*e* Error in America/North_Dakota/New_Salem: Didn't read properly from file
*e* Error in America/North_Dakota/Beulah: Didn't read properly from file
*e* Error in America/Denver: Didn't read properly from file
*e* Error in America/Los_Angeles: Didn't read properly from file
*e* Error in America/Juneau: Didn't read properly from file
*e* Error in America/Sitka: Didn't read properly from file
*e* Error in America/Metlakatla: Didn't read properly from file
*e* Error in America/Yakutat: Didn't read properly from file
*e* Error in America/Anchorage: Didn't read properly from file
*e* Error in America/Nome: Didn't read properly from file
*e* Error in America/Adak: Didn't read properly from file
*e* Error in Pacific/Honolulu: Didn't read properly from file
*e* Error in America/Phoenix: Didn't read properly from file
*e* Error in America/Boise: Didn't read properly from file
*e* Error in America/Indiana/Indianapolis: Didn't read properly from file
*e* Error in America/Indiana/Marengo: Didn't read properly from file
*e* Error in America/Indiana/Vincennes: Didn't read properly from file
*e* Error in America/Indiana/Tell_City: Didn't read properly from file
*e* Error in America/Indiana/Petersburg: Didn't read properly from file
*e* Error in America/Indiana/Knox: Didn't read properly from file
*e* Error in America/Indiana/Winamac: Didn't read properly from file
*e* Error in America/Indiana/Vevay: Didn't read properly from file
*e* Error in America/Kentucky/Louisville: Didn't read properly from file
*e* Error in America/Kentucky/Monticello: Didn't read properly from file
*e* Error in America/Detroit: Didn't read properly from file
*e* Error in America/Menominee: Didn't read properly from file
*e* Error in America/St_Johns: Didn't read properly from file
*e* Error in America/Goose_Bay: Didn't read properly from file
*e* Error in America/Halifax: Didn't read properly from file
*e* Error in America/Glace_Bay: Didn't read properly from file
*e* Error in America/Moncton: Didn't read properly from file
*e* Error in America/Blanc-Sablon: Didn't read properly from file
*e* Error in America/Toronto: Didn't read properly from file
*e* Error in America/Thunder_Bay: Didn't read properly from file
*e* Error in America/Nipigon: Didn't read properly from file
*e* Error in America/Rainy_River: Didn't read properly from file
*e* Error in America/Atikokan: Didn't read properly from file
*e* Error in America/Winnipeg: Didn't read properly from file
*e* Error in America/Regina: Didn't read properly from file
*e* Error in America/Swift_Current: Didn't read properly from file
*e* Error in America/Edmonton: Didn't read properly from file
*e* Error in America/Vancouver: Didn't read properly from file
*e* Error in America/Dawson_Creek: Didn't read properly from file
*e* Error in America/Creston: Didn't read properly from file
*e* Error in America/Pangnirtung: Didn't read properly from file
*e* Error in America/Iqaluit: Didn't read properly from file
*e* Error in America/Resolute: Didn't read properly from file
*e* Error in America/Rankin_Inlet: Didn't read properly from file
*e* Error in America/Cambridge_Bay: Didn't read properly from file
*e* Error in America/Yellowknife: Didn't read properly from file
*e* Error in America/Inuvik: Didn't read properly from file
*e* Error in America/Whitehorse: Didn't read properly from file
*e* Error in America/Dawson: Didn't read properly from file
*e* Error in America/Cancun: Didn't read properly from file
*e* Error in America/Merida: Didn't read properly from file
*e* Error in America/Matamoros: Didn't read properly from file
*e* Error in America/Monterrey: Didn't read properly from file
*e* Error in America/Mexico_City: Didn't read properly from file
*e* Error in America/Ojinaga: Didn't read properly from file
*e* Error in America/Chihuahua: Didn't read properly from file
*e* Error in America/Hermosillo: Didn't read properly from file
*e* Error in America/Mazatlan: Didn't read properly from file
*e* Error in America/Bahia_Banderas: Didn't read properly from file
*e* Error in America/Tijuana: Didn't read properly from file
*e* Error in America/Santa_Isabel: Didn't read properly from file
*e* Error in America/Nassau: Didn't read properly from file
*e* Error in America/Belize: Didn't read properly from file
*e* Error in Atlantic/Bermuda: Didn't read properly from file
*e* Error in America/Cayman: Didn't read properly from file
*e* Error in America/Havana: Didn't read properly from file
*e* Error in America/Santo_Domingo: Didn't read properly from file
*e* Error in America/Guatemala: Didn't read properly from file
*e* Error in America/Port-au-Prince: Didn't read properly from file
*e* Error in America/Tegucigalpa: Didn't read properly from file
*e* Error in America/Managua: Didn't read properly from file
*e* Error in America/Puerto_Rico: Didn't read properly from file
*e* Error in America/Miquelon: Didn't read properly from file
*e* Error in America/Grand_Turk: Didn't read properly from file
*e* Error in America/Argentina/Buenos_Aires: Didn't read properly from file
*e* Error in America/Argentina/Cordoba: Didn't read properly from file
*e* Error in America/Argentina/Salta: Didn't read properly from file
*e* Error in America/Argentina/Tucuman: Didn't read properly from file
*e* Error in America/Argentina/La_Rioja: Didn't read properly from file
*e* Error in America/Argentina/San_Juan: Didn't read properly from file
*e* Error in America/Argentina/Jujuy: Didn't read properly from file
*e* Error in America/Argentina/Catamarca: Didn't read properly from file
*e* Error in America/Argentina/Mendoza: Didn't read properly from file
*e* Error in America/Argentina/San_Luis: Didn't read properly from file
*e* Error in America/Argentina/Rio_Gallegos: Didn't read properly from file
*e* Error in America/Argentina/Ushuaia: Didn't read properly from file
*e* Error in America/Noronha: Didn't read properly from file
*e* Error in America/Belem: Didn't read properly from file
*e* Error in America/Santarem: Didn't read properly from file
*e* Error in America/Fortaleza: Didn't read properly from file
*e* Error in America/Recife: Didn't read properly from file
*e* Error in America/Araguaina: Didn't read properly from file
*e* Error in America/Maceio: Didn't read properly from file
*e* Error in America/Bahia: Didn't read properly from file
*e* Error in America/Sao_Paulo: Didn't read properly from file
*e* Error in America/Campo_Grande: Didn't read properly from file
*e* Error in America/Cuiaba: Didn't read properly from file
*e* Error in America/Porto_Velho: Didn't read properly from file
*e* Error in America/Boa_Vista: Didn't read properly from file
*e* Error in America/Manaus: Didn't read properly from file
*e* Error in America/Eirunepe: Didn't read properly from file
*e* Error in America/Rio_Branco: Didn't read properly from file
*e* Error in America/Santiago: Didn't read properly from file
*e* Error in Pacific/Easter: Didn't read properly from file
*e* Error in Antarctica/Palmer: Didn't read properly from file
*e* Error in America/Curacao: Didn't read properly from file
*e* Error in America/Guayaquil: Didn't read properly from file
*e* Error in Atlantic/Stanley: Didn't read properly from file
*e* Error in America/Cayenne: Didn't read properly from file
*e* Error in America/Guyana: Didn't read properly from file
*e* Error in America/Asuncion: Didn't read properly from file
*e* Error in America/Lima: Didn't read properly from file
*e* Error in America/Montevideo: Didn't read properly from file
*e* Error in America/Caracas: Didn't read properly from file
*e* Error in Africa/Addis_Ababa: Didn't read properly from file
*e* Error in Africa/Asmara: Didn't read properly from file
*e* Error in Africa/Dar_es_Salaam: Didn't read properly from file
*e* Error in Africa/Djibouti: Didn't read properly from file
*e* Error in Africa/Kampala: Didn't read properly from file
*e* Error in Africa/Mogadishu: Didn't read properly from file
*e* Error in Indian/Antananarivo: Didn't read properly from file
*e* Error in Indian/Comoro: Didn't read properly from file
*e* Error in Indian/Mayotte: Didn't read properly from file
*e* Error in Africa/Maseru: Didn't read properly from file
*e* Error in Africa/Mbabane: Didn't read properly from file
*e* Error in Pacific/Saipan: Didn't read properly from file
*e* Error in Antarctica/McMurdo: Didn't read properly from file
*e* Error in Pacific/Midway: Didn't read properly from file
*e* Error in Europe/Jersey: Didn't read properly from file
*e* Error in Europe/Guernsey: Didn't read properly from file
*e* Error in Europe/Isle_of_Man: Didn't read properly from file
*e* Error in Europe/Mariehamn: Didn't read properly from file
*e* Error in Europe/Busingen: Didn't read properly from file
*e* Error in Europe/Vatican: Didn't read properly from file
*e* Error in Europe/San_Marino: Didn't read properly from file
*e* Error in Europe/Vaduz: Didn't read properly from file
*e* Error in Arctic/Longyearbyen: Didn't read properly from file
*e* Error in Europe/Ljubljana: Didn't read properly from file
*e* Error in Europe/Podgorica: Didn't read properly from file
*e* Error in Europe/Sarajevo: Didn't read properly from file
*e* Error in Europe/Skopje: Didn't read properly from file
*e* Error in Europe/Zagreb: Didn't read properly from file
*e* Error in Europe/Bratislava: Didn't read properly from file
*e* Error in Asia/Istanbul: Didn't read properly from file
*e* Error in Pacific/Johnston: Didn't read properly from file
*e* Error in America/Aruba: Didn't read properly from file
*e* Error in America/Lower_Princes: Didn't read properly from file
*e* Error in America/Kralendijk: Didn't read properly from file
Writing ZoneInfoMap
[INFO] 
[INFO] --- maven-resources-plugin:2.7:testResources (default-testResources) @ joda-time ---
[INFO] Using 'UTF-8' encoding to copy filtered resources.
[INFO] Copying 34 resources
[INFO] 
[INFO] --- maven-compiler-plugin:3.3:testCompile (default-testCompile) @ joda-time ---
[INFO] Nothing to compile - all classes are up to date
[INFO] 
[INFO] --- maven-surefire-plugin:2.18.1:test (default-test) @ joda-time ---
[INFO] Surefire report directory: /home/perham/Study/LittleDarwin/Cases/joda-time-2.8.1/target/surefire-reports

-------------------------------------------------------
 T E S T S
-------------------------------------------------------
Running org.joda.time.TestAllPackages

TestBuddhistChronology.testCalendar

TestCopticChronology.testCalendar

TestEthiopicChronology.testCalendar

TestIslamicChronology.testCalendar

Testing Gregorian chronology over 1000 iterations
100% complete (i=1000)

Testing Julian chronology over 1000 iterations
100% complete (i=1000)
Writing zoneinfo files
*e* Error in America/Los_Angeles: Didn't read properly from file
Writing ZoneInfoMap
Tests run: 4157, Failures: 60, Errors: 0, Skipped: 0, Time elapsed: 9.44 sec <<< FAILURE! - in org.joda.time.TestAllPackages
testConstructor_ObjectString6(org.joda.time.TestDateTime_Constructors)  Time elapsed: 0.006 sec  <<< FAILURE!
junit.framework.AssertionFailedError: expected:<21> but was:<20>
	at junit.framework.Assert.fail(Assert.java:47)
	at junit.framework.Assert.failNotEquals(Assert.java:280)
	at junit.framework.Assert.assertEquals(Assert.java:64)
	at junit.framework.Assert.assertEquals(Assert.java:198)
	at junit.framework.Assert.assertEquals(Assert.java:204)
	at org.joda.time.TestDateTime_Constructors.testConstructor_ObjectString6(TestDateTime_Constructors.java:440)

testPropertyWithMaximumValueMillisOfDayDSTGap(org.joda.time.TestDateTime_Properties)  Time elapsed: 0.003 sec  <<< FAILURE!
junit.framework.ComparisonFailure: expected:<1926-04-17T2[2]:59:59.999Z> but was:<1926-04-17T2[3]:59:59.999Z>
	at junit.framework.Assert.assertEquals(Assert.java:81)
	at junit.framework.Assert.assertEquals(Assert.java:87)
	at org.joda.time.TestDateTime_Properties.testPropertyWithMaximumValueMillisOfDayDSTGap(TestDateTime_Properties.java:651)

testPropertyWithMinimumValueMillisOfDayDSTGap(org.joda.time.TestDateTime_Properties)  Time elapsed: 0.003 sec  <<< FAILURE!
junit.framework.ComparisonFailure: expected:<2001-04-20T0[1]:00:00.000+03:00> but was:<2001-04-20T0[0]:00:00.000+03:00>
	at junit.framework.Assert.assertEquals(Assert.java:81)
	at junit.framework.Assert.assertEquals(Assert.java:87)
	at org.joda.time.TestDateTime_Properties.testPropertyWithMinimumValueMillisOfDayDSTGap(TestDateTime_Properties.java:665)

testPropertySetYear(org.joda.time.TestDateTime_Properties)  Time elapsed: 0.001 sec  <<< FAILURE!
junit.framework.ComparisonFailure: expected:<...0-06-09T00:00:00.000[+01:00]> but was:<...0-06-09T00:00:00.000[Z]>
	at junit.framework.Assert.assertEquals(Assert.java:81)
	at junit.framework.Assert.assertEquals(Assert.java:87)
	at org.joda.time.TestDateTime_Properties.testPropertySetYear(TestDateTime_Properties.java:289)

testPropertySetTextYear(org.joda.time.TestDateTime_Properties)  Time elapsed: 0.001 sec  <<< FAILURE!
junit.framework.ComparisonFailure: expected:<...0-06-09T00:00:00.000[+01:00]> but was:<...0-06-09T00:00:00.000[Z]>
	at junit.framework.Assert.assertEquals(Assert.java:81)
	at junit.framework.Assert.assertEquals(Assert.java:87)
	at org.joda.time.TestDateTime_Properties.testPropertySetTextYear(TestDateTime_Properties.java:296)

testPropertySetYear(org.joda.time.TestMutableDateTime_Properties)  Time elapsed: 0.001 sec  <<< FAILURE!
junit.framework.ComparisonFailure: expected:<...0-06-09T00:00:00.000[+01:00]> but was:<...0-06-09T00:00:00.000[Z]>
	at junit.framework.Assert.assertEquals(Assert.java:81)
	at junit.framework.Assert.assertEquals(Assert.java:87)
	at org.joda.time.TestMutableDateTime_Properties.testPropertySetYear(TestMutableDateTime_Properties.java:222)

testPropertySetTextYear(org.joda.time.TestMutableDateTime_Properties)  Time elapsed: 0.001 sec  <<< FAILURE!
junit.framework.ComparisonFailure: expected:<...0-06-09T00:00:00.000[+01:00]> but was:<...0-06-09T00:00:00.000[Z]>
	at junit.framework.Assert.assertEquals(Assert.java:81)
	at junit.framework.Assert.assertEquals(Assert.java:87)
	at org.joda.time.TestMutableDateTime_Properties.testPropertySetTextYear(TestMutableDateTime_Properties.java:228)

testConstructor_badconverterObject(org.joda.time.TestDateMidnight_Constructors)  Time elapsed: 0.001 sec  <<< FAILURE!
junit.framework.AssertionFailedError: expected:<-3600000> but was:<0>
	at junit.framework.Assert.fail(Assert.java:47)
	at junit.framework.Assert.failNotEquals(Assert.java:280)
	at junit.framework.Assert.assertEquals(Assert.java:64)
	at junit.framework.Assert.assertEquals(Assert.java:133)
	at junit.framework.Assert.assertEquals(Assert.java:139)
	at org.joda.time.TestDateMidnight_Constructors.testConstructor_badconverterObject(TestDateMidnight_Constructors.java:342)

testConstructor_badconverterObject_DateTimeZone(org.joda.time.TestDateMidnight_Constructors)  Time elapsed: 0.001 sec  <<< FAILURE!
junit.framework.AssertionFailedError: expected:<-3600000> but was:<0>
	at junit.framework.Assert.fail(Assert.java:47)
	at junit.framework.Assert.failNotEquals(Assert.java:280)
	at junit.framework.Assert.assertEquals(Assert.java:64)
	at junit.framework.Assert.assertEquals(Assert.java:133)
	at junit.framework.Assert.assertEquals(Assert.java:139)
	at org.joda.time.TestDateMidnight_Constructors.testConstructor_badconverterObject_DateTimeZone(TestDateMidnight_Constructors.java:404)

testConstructor_badconverterObject_Chronology(org.joda.time.TestDateMidnight_Constructors)  Time elapsed: 0.001 sec  <<< FAILURE!
junit.framework.AssertionFailedError: expected:<-3600000> but was:<0>
	at junit.framework.Assert.fail(Assert.java:47)
	at junit.framework.Assert.failNotEquals(Assert.java:280)
	at junit.framework.Assert.assertEquals(Assert.java:64)
	at junit.framework.Assert.assertEquals(Assert.java:133)
	at junit.framework.Assert.assertEquals(Assert.java:139)
	at org.joda.time.TestDateMidnight_Constructors.testConstructor_badconverterObject_Chronology(TestDateMidnight_Constructors.java:466)

testToDateTime_nullRI(org.joda.time.TestLocalTime_Basics)  Time elapsed: 0.001 sec  <<< FAILURE!
junit.framework.ComparisonFailure: expected:<...0-01-02T01:02:03.004[+01:00]> but was:<...0-01-02T01:02:03.004[Z]>
	at junit.framework.Assert.assertEquals(Assert.java:81)
	at junit.framework.Assert.assertEquals(Assert.java:87)
	at org.joda.time.TestLocalTime_Basics.testToDateTime_nullRI(TestLocalTime_Basics.java:732)

testToDateTime_RI(org.joda.time.TestLocalTime_Basics)  Time elapsed: 0.001 sec  <<< FAILURE!
junit.framework.ComparisonFailure: expected:<1970-01-01T0[1:00:00.000+01:00]> but was:<1970-01-01T0[0:00:00.000Z]>
	at junit.framework.Assert.assertEquals(Assert.java:81)
	at junit.framework.Assert.assertEquals(Assert.java:87)
	at org.joda.time.TestLocalTime_Basics.testToDateTime_RI(TestLocalTime_Basics.java:718)

testGet(org.joda.time.TestTimeOfDay_Basics)  Time elapsed: 0.001 sec  <<< FAILURE!
junit.framework.AssertionFailedError: expected:<11> but was:<10>
	at junit.framework.Assert.fail(Assert.java:47)
	at junit.framework.Assert.failNotEquals(Assert.java:280)
	at junit.framework.Assert.assertEquals(Assert.java:64)
	at junit.framework.Assert.assertEquals(Assert.java:198)
	at junit.framework.Assert.assertEquals(Assert.java:204)
	at org.joda.time.TestTimeOfDay_Basics.testGet(TestTimeOfDay_Basics.java:97)

testToDateTime_nullRI(org.joda.time.TestTimeOfDay_Basics)  Time elapsed: 0 sec  <<< FAILURE!
junit.framework.ComparisonFailure: expected:<...0-01-02T01:02:03.004[+01:00]> but was:<...0-01-02T01:02:03.004[Z]>
	at junit.framework.Assert.assertEquals(Assert.java:81)
	at junit.framework.Assert.assertEquals(Assert.java:87)
	at org.joda.time.TestTimeOfDay_Basics.testToDateTime_nullRI(TestTimeOfDay_Basics.java:812)

testToDateTime_RI(org.joda.time.TestTimeOfDay_Basics)  Time elapsed: 0.002 sec  <<< FAILURE!
junit.framework.ComparisonFailure: expected:<1970-01-01T0[1:00:00.000+01:00]> but was:<1970-01-01T0[0:00:00.000Z]>
	at junit.framework.Assert.assertEquals(Assert.java:81)
	at junit.framework.Assert.assertEquals(Assert.java:87)
	at org.joda.time.TestTimeOfDay_Basics.testToDateTime_RI(TestTimeOfDay_Basics.java:798)

testConstructor(org.joda.time.TestTimeOfDay_Constructors)  Time elapsed: 0.004 sec  <<< FAILURE!
junit.framework.AssertionFailedError: expected:<11> but was:<10>
	at junit.framework.Assert.fail(Assert.java:47)
	at junit.framework.Assert.failNotEquals(Assert.java:280)
	at junit.framework.Assert.assertEquals(Assert.java:64)
	at junit.framework.Assert.assertEquals(Assert.java:198)
	at junit.framework.Assert.assertEquals(Assert.java:204)
	at org.joda.time.TestTimeOfDay_Constructors.testConstructor(TestTimeOfDay_Constructors.java:181)

testConstructor_long1(org.joda.time.TestTimeOfDay_Constructors)  Time elapsed: 0.001 sec  <<< FAILURE!
junit.framework.AssertionFailedError: expected:<2> but was:<1>
	at junit.framework.Assert.fail(Assert.java:47)
	at junit.framework.Assert.failNotEquals(Assert.java:280)
	at junit.framework.Assert.assertEquals(Assert.java:64)
	at junit.framework.Assert.assertEquals(Assert.java:198)
	at junit.framework.Assert.assertEquals(Assert.java:204)
	at org.joda.time.TestTimeOfDay_Constructors.testConstructor_long1(TestTimeOfDay_Constructors.java:257)

testConstructor_long2(org.joda.time.TestTimeOfDay_Constructors)  Time elapsed: 0.001 sec  <<< FAILURE!
junit.framework.AssertionFailedError: expected:<6> but was:<5>
	at junit.framework.Assert.fail(Assert.java:47)
	at junit.framework.Assert.failNotEquals(Assert.java:280)
	at junit.framework.Assert.assertEquals(Assert.java:64)
	at junit.framework.Assert.assertEquals(Assert.java:198)
	at junit.framework.Assert.assertEquals(Assert.java:204)
	at org.joda.time.TestTimeOfDay_Constructors.testConstructor_long2(TestTimeOfDay_Constructors.java:269)

testConstructor_nullObject(org.joda.time.TestTimeOfDay_Constructors)  Time elapsed: 0.023 sec  <<< FAILURE!
junit.framework.AssertionFailedError: expected:<11> but was:<10>
	at junit.framework.Assert.fail(Assert.java:47)
	at junit.framework.Assert.failNotEquals(Assert.java:280)
	at junit.framework.Assert.assertEquals(Assert.java:64)
	at junit.framework.Assert.assertEquals(Assert.java:198)
	at junit.framework.Assert.assertEquals(Assert.java:204)
	at org.joda.time.TestTimeOfDay_Constructors.testConstructor_nullObject(TestTimeOfDay_Constructors.java:345)

testConstructor_long1_Chronology(org.joda.time.TestTimeOfDay_Constructors)  Time elapsed: 0 sec  <<< FAILURE!
junit.framework.AssertionFailedError: expected:<2> but was:<1>
	at junit.framework.Assert.fail(Assert.java:47)
	at junit.framework.Assert.failNotEquals(Assert.java:280)
	at junit.framework.Assert.assertEquals(Assert.java:64)
	at junit.framework.Assert.assertEquals(Assert.java:198)
	at junit.framework.Assert.assertEquals(Assert.java:204)
	at org.joda.time.TestTimeOfDay_Constructors.testConstructor_long1_Chronology(TestTimeOfDay_Constructors.java:281)

testConstructor_long2_Chronology(org.joda.time.TestTimeOfDay_Constructors)  Time elapsed: 0 sec  <<< FAILURE!
junit.framework.AssertionFailedError: expected:<6> but was:<5>
	at junit.framework.Assert.fail(Assert.java:47)
	at junit.framework.Assert.failNotEquals(Assert.java:280)
	at junit.framework.Assert.assertEquals(Assert.java:64)
	at junit.framework.Assert.assertEquals(Assert.java:198)
	at junit.framework.Assert.assertEquals(Assert.java:204)
	at org.joda.time.TestTimeOfDay_Constructors.testConstructor_long2_Chronology(TestTimeOfDay_Constructors.java:293)

testConstructor_long_nullChronology(org.joda.time.TestTimeOfDay_Constructors)  Time elapsed: 0 sec  <<< FAILURE!
junit.framework.AssertionFailedError: expected:<2> but was:<1>
	at junit.framework.Assert.fail(Assert.java:47)
	at junit.framework.Assert.failNotEquals(Assert.java:280)
	at junit.framework.Assert.assertEquals(Assert.java:64)
	at junit.framework.Assert.assertEquals(Assert.java:198)
	at junit.framework.Assert.assertEquals(Assert.java:204)
	at org.joda.time.TestTimeOfDay_Constructors.testConstructor_long_nullChronology(TestTimeOfDay_Constructors.java:305)

testConstructor_ObjectString2(org.joda.time.TestTimeOfDay_Constructors)  Time elapsed: 0.001 sec  <<< FAILURE!
junit.framework.AssertionFailedError: expected:<7> but was:<6>
	at junit.framework.Assert.fail(Assert.java:47)
	at junit.framework.Assert.failNotEquals(Assert.java:280)
	at junit.framework.Assert.assertEquals(Assert.java:64)
	at junit.framework.Assert.assertEquals(Assert.java:198)
	at junit.framework.Assert.assertEquals(Assert.java:204)
	at org.joda.time.TestTimeOfDay_Constructors.testConstructor_ObjectString2(TestTimeOfDay_Constructors.java:376)

testConstructor_ObjectString4(org.joda.time.TestTimeOfDay_Constructors)  Time elapsed: 0.001 sec  <<< FAILURE!
junit.framework.AssertionFailedError: expected:<7> but was:<6>
	at junit.framework.Assert.fail(Assert.java:47)
	at junit.framework.Assert.failNotEquals(Assert.java:280)
	at junit.framework.Assert.assertEquals(Assert.java:64)
	at junit.framework.Assert.assertEquals(Assert.java:198)
	at junit.framework.Assert.assertEquals(Assert.java:204)
	at org.joda.time.TestTimeOfDay_Constructors.testConstructor_ObjectString4(TestTimeOfDay_Constructors.java:394)

testConstructor_Object_Chronology(org.joda.time.TestTimeOfDay_Constructors)  Time elapsed: 0.004 sec  <<< FAILURE!
junit.framework.AssertionFailedError: expected:<2> but was:<1>
	at junit.framework.Assert.fail(Assert.java:47)
	at junit.framework.Assert.failNotEquals(Assert.java:280)
	at junit.framework.Assert.assertEquals(Assert.java:64)
	at junit.framework.Assert.assertEquals(Assert.java:198)
	at junit.framework.Assert.assertEquals(Assert.java:204)
	at org.joda.time.TestTimeOfDay_Constructors.testConstructor_Object_Chronology(TestTimeOfDay_Constructors.java:454)

testConstructor_nullObject_Chronology(org.joda.time.TestTimeOfDay_Constructors)  Time elapsed: 0.001 sec  <<< FAILURE!
junit.framework.AssertionFailedError: expected:<11> but was:<10>
	at junit.framework.Assert.fail(Assert.java:47)
	at junit.framework.Assert.failNotEquals(Assert.java:280)
	at junit.framework.Assert.assertEquals(Assert.java:64)
	at junit.framework.Assert.assertEquals(Assert.java:198)
	at junit.framework.Assert.assertEquals(Assert.java:204)
	at org.joda.time.TestTimeOfDay_Constructors.testConstructor_nullObject_Chronology(TestTimeOfDay_Constructors.java:482)

testConstructor_Object_nullChronology(org.joda.time.TestTimeOfDay_Constructors)  Time elapsed: 0 sec  <<< FAILURE!
junit.framework.AssertionFailedError: expected:<2> but was:<1>
	at junit.framework.Assert.fail(Assert.java:47)
	at junit.framework.Assert.failNotEquals(Assert.java:280)
	at junit.framework.Assert.assertEquals(Assert.java:64)
	at junit.framework.Assert.assertEquals(Assert.java:198)
	at junit.framework.Assert.assertEquals(Assert.java:204)
	at org.joda.time.TestTimeOfDay_Constructors.testConstructor_Object_nullChronology(TestTimeOfDay_Constructors.java:495)

testConstructor_Object1(org.joda.time.TestTimeOfDay_Constructors)  Time elapsed: 0.001 sec  <<< FAILURE!
junit.framework.AssertionFailedError: expected:<2> but was:<1>
	at junit.framework.Assert.fail(Assert.java:47)
	at junit.framework.Assert.failNotEquals(Assert.java:280)
	at junit.framework.Assert.assertEquals(Assert.java:64)
	at junit.framework.Assert.assertEquals(Assert.java:198)
	at junit.framework.Assert.assertEquals(Assert.java:204)
	at org.joda.time.TestTimeOfDay_Constructors.testConstructor_Object1(TestTimeOfDay_Constructors.java:319)

testConstructor_Object2(org.joda.time.TestTimeOfDay_Constructors)  Time elapsed: 0.001 sec  <<< FAILURE!
junit.framework.AssertionFailedError: expected:<2> but was:<1>
	at junit.framework.Assert.fail(Assert.java:47)
	at junit.framework.Assert.failNotEquals(Assert.java:280)
	at junit.framework.Assert.assertEquals(Assert.java:64)
	at junit.framework.Assert.assertEquals(Assert.java:198)
	at junit.framework.Assert.assertEquals(Assert.java:204)
	at org.joda.time.TestTimeOfDay_Constructors.testConstructor_Object2(TestTimeOfDay_Constructors.java:333)

testConstructor_nullObject_nullChronology(org.joda.time.TestTimeOfDay_Constructors)  Time elapsed: 0.001 sec  <<< FAILURE!
junit.framework.AssertionFailedError: expected:<11> but was:<10>
	at junit.framework.Assert.fail(Assert.java:47)
	at junit.framework.Assert.failNotEquals(Assert.java:280)
	at junit.framework.Assert.assertEquals(Assert.java:64)
	at junit.framework.Assert.assertEquals(Assert.java:198)
	at junit.framework.Assert.assertEquals(Assert.java:204)
	at org.joda.time.TestTimeOfDay_Constructors.testConstructor_nullObject_nullChronology(TestTimeOfDay_Constructors.java:507)

testConstructor_Chronology(org.joda.time.TestTimeOfDay_Constructors)  Time elapsed: 0.001 sec  <<< FAILURE!
junit.framework.AssertionFailedError: expected:<11> but was:<10>
	at junit.framework.Assert.fail(Assert.java:47)
	at junit.framework.Assert.failNotEquals(Assert.java:280)
	at junit.framework.Assert.assertEquals(Assert.java:64)
	at junit.framework.Assert.assertEquals(Assert.java:198)
	at junit.framework.Assert.assertEquals(Assert.java:204)
	at org.joda.time.TestTimeOfDay_Constructors.testConstructor_Chronology(TestTimeOfDay_Constructors.java:232)

testConstructor_nullChronology(org.joda.time.TestTimeOfDay_Constructors)  Time elapsed: 0 sec  <<< FAILURE!
junit.framework.AssertionFailedError: expected:<11> but was:<10>
	at junit.framework.Assert.fail(Assert.java:47)
	at junit.framework.Assert.failNotEquals(Assert.java:280)
	at junit.framework.Assert.assertEquals(Assert.java:64)
	at junit.framework.Assert.assertEquals(Assert.java:198)
	at junit.framework.Assert.assertEquals(Assert.java:204)
	at org.joda.time.TestTimeOfDay_Constructors.testConstructor_nullChronology(TestTimeOfDay_Constructors.java:244)

testToDateTime_nullRI(org.joda.time.TestPartial_Basics)  Time elapsed: 0.001 sec  <<< FAILURE!
junit.framework.ComparisonFailure: expected:<...0-01-02T01:02:07.008[+01:00]> but was:<...0-01-02T01:02:07.008[Z]>
	at junit.framework.Assert.assertEquals(Assert.java:81)
	at junit.framework.Assert.assertEquals(Assert.java:87)
	at org.joda.time.TestPartial_Basics.testToDateTime_nullRI(TestPartial_Basics.java:759)

testToDateTime_RI(org.joda.time.TestPartial_Basics)  Time elapsed: 0.001 sec  <<< FAILURE!
junit.framework.ComparisonFailure: expected:<1970-01-01T0[1:00:00.000+01:00]> but was:<1970-01-01T0[0:00:00.000Z]>
	at junit.framework.Assert.assertEquals(Assert.java:81)
	at junit.framework.Assert.assertEquals(Assert.java:87)
	at org.joda.time.TestPartial_Basics.testToDateTime_RI(TestPartial_Basics.java:745)

testPatchedNameKeysGazaHistoric(org.joda.time.TestDateTimeZone)  Time elapsed: 0.001 sec  <<< FAILURE!
junit.framework.AssertionFailedError: expected:<false> but was:<true>
	at junit.framework.Assert.fail(Assert.java:47)
	at junit.framework.Assert.failNotEquals(Assert.java:280)
	at junit.framework.Assert.assertEquals(Assert.java:64)
	at junit.framework.Assert.assertEquals(Assert.java:146)
	at junit.framework.Assert.assertEquals(Assert.java:152)
	at org.joda.time.TestDateTimeZone.testPatchedNameKeysGazaHistoric(TestDateTimeZone.java:1103)

test_MoscowIsCorrect_Spring(org.joda.time.TestDateTimeZoneCutover)  Time elapsed: 0.01 sec  <<< FAILURE!
junit.framework.ComparisonFailure: expected:<2007-03-25T0[3:00:00.000+04]:00> but was:<2007-03-25T0[2:00:00.000+03]:00>
	at junit.framework.Assert.assertEquals(Assert.java:81)
	at junit.framework.Assert.assertEquals(Assert.java:87)
	at org.joda.time.TestDateTimeZoneCutover.test_MoscowIsCorrect_Spring(TestDateTimeZoneCutover.java:824)

test_getOffsetFromLocal_Moscow_Spring(org.joda.time.TestDateTimeZoneCutover)  Time elapsed: 0.001 sec  <<< FAILURE!
junit.framework.ComparisonFailure: 2007-03-25T02:00:00.000+03:00 expected:<2007-03-25T0[3:00:00.000+04]:00> but was:<2007-03-25T0[2:00:00.000+03]:00>
	at junit.framework.Assert.assertEquals(Assert.java:81)
	at org.joda.time.TestDateTimeZoneCutover.doTest_getOffsetFromLocal(TestDateTimeZoneCutover.java:1371)
	at org.joda.time.TestDateTimeZoneCutover.doTest_getOffsetFromLocal(TestDateTimeZoneCutover.java:1355)
	at org.joda.time.TestDateTimeZoneCutover.test_getOffsetFromLocal_Moscow_Spring(TestDateTimeZoneCutover.java:833)

test_DateTime_setHourAcross_Moscow_Spring(org.joda.time.TestDateTimeZoneCutover)  Time elapsed: 0 sec  <<< FAILURE!
junit.framework.ComparisonFailure: expected:<...03-25T04:00:00.000+0[4]:00> but was:<...03-25T04:00:00.000+0[3]:00>
	at junit.framework.Assert.assertEquals(Assert.java:81)
	at junit.framework.Assert.assertEquals(Assert.java:87)
	at org.joda.time.TestDateTimeZoneCutover.test_DateTime_setHourAcross_Moscow_Spring(TestDateTimeZoneCutover.java:849)

test_DateTime_setHourForward_Moscow_Spring(org.joda.time.TestDateTimeZoneCutover)  Time elapsed: 0 sec  <<< FAILURE!
junit.framework.AssertionFailedError
	at junit.framework.Assert.fail(Assert.java:47)
	at junit.framework.Assert.fail(Assert.java:53)
	at org.joda.time.TestDateTimeZoneCutover.test_DateTime_setHourForward_Moscow_Spring(TestDateTimeZoneCutover.java:858)

test_DateTime_setHourBack_Moscow_Spring(org.joda.time.TestDateTimeZoneCutover)  Time elapsed: 0.001 sec  <<< FAILURE!
junit.framework.ComparisonFailure: expected:<...03-25T08:00:00.000+0[4]:00> but was:<...03-25T08:00:00.000+0[3]:00>
	at junit.framework.Assert.assertEquals(Assert.java:81)
	at junit.framework.Assert.assertEquals(Assert.java:87)
	at org.joda.time.TestDateTimeZoneCutover.test_DateTime_setHourBack_Moscow_Spring(TestDateTimeZoneCutover.java:866)

test_MoscowIsCorrect_Autumn(org.joda.time.TestDateTimeZoneCutover)  Time elapsed: 0 sec  <<< FAILURE!
junit.framework.ComparisonFailure: expected:<2007-10-28T0[2:59:59.999+04]:00> but was:<2007-10-28T0[1:59:59.999+03]:00>
	at junit.framework.Assert.assertEquals(Assert.java:81)
	at junit.framework.Assert.assertEquals(Assert.java:87)
	at org.joda.time.TestDateTimeZoneCutover.test_MoscowIsCorrect_Autumn(TestDateTimeZoneCutover.java:883)

test_getOffsetFromLocal_Moscow_Autumn(org.joda.time.TestDateTimeZoneCutover)  Time elapsed: 0 sec  <<< FAILURE!
junit.framework.AssertionFailedError: expected:<14400000> but was:<10800000>
	at junit.framework.Assert.fail(Assert.java:47)
	at junit.framework.Assert.failNotEquals(Assert.java:280)
	at junit.framework.Assert.assertEquals(Assert.java:64)
	at junit.framework.Assert.assertEquals(Assert.java:133)
	at junit.framework.Assert.assertEquals(Assert.java:139)
	at org.joda.time.TestDateTimeZoneCutover.doTest_getOffsetFromLocal(TestDateTimeZoneCutover.java:1369)
	at org.joda.time.TestDateTimeZoneCutover.doTest_getOffsetFromLocal(TestDateTimeZoneCutover.java:1355)
	at org.joda.time.TestDateTimeZoneCutover.test_getOffsetFromLocal_Moscow_Autumn(TestDateTimeZoneCutover.java:891)

test_getOffsetFromLocal_Moscow_Autumn_overlap_mins(org.joda.time.TestDateTimeZoneCutover)  Time elapsed: 0 sec  <<< FAILURE!
junit.framework.AssertionFailedError: expected:<14400000> but was:<10800000>
	at junit.framework.Assert.fail(Assert.java:47)
	at junit.framework.Assert.failNotEquals(Assert.java:280)
	at junit.framework.Assert.assertEquals(Assert.java:64)
	at junit.framework.Assert.assertEquals(Assert.java:133)
	at junit.framework.Assert.assertEquals(Assert.java:139)
	at org.joda.time.TestDateTimeZoneCutover.doTest_getOffsetFromLocal(TestDateTimeZoneCutover.java:1369)
	at org.joda.time.TestDateTimeZoneCutover.doTest_getOffsetFromLocal(TestDateTimeZoneCutover.java:1355)
	at org.joda.time.TestDateTimeZoneCutover.test_getOffsetFromLocal_Moscow_Autumn_overlap_mins(TestDateTimeZoneCutover.java:914)

test_DateTime_constructor_Moscow_Autumn(org.joda.time.TestDateTimeZoneCutover)  Time elapsed: 0 sec  <<< FAILURE!
junit.framework.ComparisonFailure: expected:<...10-28T02:30:00.000+0[4]:00> but was:<...10-28T02:30:00.000+0[3]:00>
	at junit.framework.Assert.assertEquals(Assert.java:81)
	at junit.framework.Assert.assertEquals(Assert.java:87)
	at org.joda.time.TestDateTimeZoneCutover.test_DateTime_constructor_Moscow_Autumn(TestDateTimeZoneCutover.java:923)

test_DateTime_plusHour_Moscow_Autumn(org.joda.time.TestDateTimeZoneCutover)  Time elapsed: 0 sec  <<< FAILURE!
junit.framework.ComparisonFailure: expected:<...10-27T19:00:00.000+0[4]:00> but was:<...10-27T19:00:00.000+0[3]:00>
	at junit.framework.Assert.assertEquals(Assert.java:81)
	at junit.framework.Assert.assertEquals(Assert.java:87)
	at org.joda.time.TestDateTimeZoneCutover.test_DateTime_plusHour_Moscow_Autumn(TestDateTimeZoneCutover.java:928)

test_DateTime_minusHour_Moscow_Autumn(org.joda.time.TestDateTimeZoneCutover)  Time elapsed: 0.001 sec  <<< FAILURE!
junit.framework.ComparisonFailure: expected:<2007-10-28T0[2:00:00.000+04]:00> but was:<2007-10-28T0[1:00:00.000+03]:00>
	at junit.framework.Assert.assertEquals(Assert.java:81)
	at junit.framework.Assert.assertEquals(Assert.java:87)
	at org.joda.time.TestDateTimeZoneCutover.test_DateTime_minusHour_Moscow_Autumn(TestDateTimeZoneCutover.java:949)

test_GuatemataIsCorrect_Autumn(org.joda.time.TestDateTimeZoneCutover)  Time elapsed: 0 sec  <<< FAILURE!
junit.framework.ComparisonFailure: expected:<2006-09-30T2[3:59:59.999-05]:00> but was:<2006-09-30T2[2:59:59.999-06]:00>
	at junit.framework.Assert.assertEquals(Assert.java:81)
	at junit.framework.Assert.assertEquals(Assert.java:87)
	at org.joda.time.TestDateTimeZoneCutover.test_GuatemataIsCorrect_Autumn(TestDateTimeZoneCutover.java:964)

test_getOffsetFromLocal_Guatemata_Autumn(org.joda.time.TestDateTimeZoneCutover)  Time elapsed: 0 sec  <<< FAILURE!
junit.framework.AssertionFailedError: expected:<-18000000> but was:<-21600000>
	at junit.framework.Assert.fail(Assert.java:47)
	at junit.framework.Assert.failNotEquals(Assert.java:280)
	at junit.framework.Assert.assertEquals(Assert.java:64)
	at junit.framework.Assert.assertEquals(Assert.java:133)
	at junit.framework.Assert.assertEquals(Assert.java:139)
	at org.joda.time.TestDateTimeZoneCutover.doTest_getOffsetFromLocal(TestDateTimeZoneCutover.java:1369)
	at org.joda.time.TestDateTimeZoneCutover.doTest_getOffsetFromLocal(TestDateTimeZoneCutover.java:1363)
	at org.joda.time.TestDateTimeZoneCutover.test_getOffsetFromLocal_Guatemata_Autumn(TestDateTimeZoneCutover.java:972)

test_DateTime_plusHour_Guatemata_Autumn(org.joda.time.TestDateTimeZoneCutover)  Time elapsed: 0 sec  <<< FAILURE!
junit.framework.ComparisonFailure: expected:<...09-30T20:00:00.000-0[5]:00> but was:<...09-30T20:00:00.000-0[6]:00>
	at junit.framework.Assert.assertEquals(Assert.java:81)
	at junit.framework.Assert.assertEquals(Assert.java:87)
	at org.joda.time.TestDateTimeZoneCutover.test_DateTime_plusHour_Guatemata_Autumn(TestDateTimeZoneCutover.java:1014)

test_DateTime_minusHour_Guatemata_Autumn(org.joda.time.TestDateTimeZoneCutover)  Time elapsed: 0.001 sec  <<< FAILURE!
junit.framework.ComparisonFailure: expected:<2006-09-30T2[3:00:00.000-05]:00> but was:<2006-09-30T2[2:00:00.000-06]:00>
	at junit.framework.Assert.assertEquals(Assert.java:81)
	at junit.framework.Assert.assertEquals(Assert.java:87)
	at org.joda.time.TestDateTimeZoneCutover.test_DateTime_minusHour_Guatemata_Autumn(TestDateTimeZoneCutover.java:1043)

test_RioBrancoIsCorrect_Spring(org.joda.time.TestDateTimeZoneCutover)  Time elapsed: 0.001 sec  <<< FAILURE!
junit.framework.ComparisonFailure: expected:<2008-06-24T0[1:00:00.000-04]:00> but was:<2008-06-24T0[0:00:00.000-05]:00>
	at junit.framework.Assert.assertEquals(Assert.java:81)
	at junit.framework.Assert.assertEquals(Assert.java:87)
	at org.joda.time.TestDateTimeZoneCutover.test_RioBrancoIsCorrect_Spring(TestDateTimeZoneCutover.java:1064)

test_getOffsetFromLocal_RioBranco_Spring(org.joda.time.TestDateTimeZoneCutover)  Time elapsed: 0.001 sec  <<< FAILURE!
junit.framework.ComparisonFailure: 2008-06-24T00:00:00.000-05:00 expected:<2008-06-24T0[1:00:00.000-04]:00> but was:<2008-06-24T0[0:00:00.000-05]:00>
	at junit.framework.Assert.assertEquals(Assert.java:81)
	at org.joda.time.TestDateTimeZoneCutover.doTest_getOffsetFromLocal(TestDateTimeZoneCutover.java:1371)
	at org.joda.time.TestDateTimeZoneCutover.doTest_getOffsetFromLocal(TestDateTimeZoneCutover.java:1363)
	at org.joda.time.TestDateTimeZoneCutover.test_getOffsetFromLocal_RioBranco_Spring(TestDateTimeZoneCutover.java:1073)

testBug3476684_adjustOffset(org.joda.time.TestDateTimeZoneCutover)  Time elapsed: 0.007 sec  <<< FAILURE!
junit.framework.AssertionFailedError: expected:<2012-02-26T00:15:00.000-03:00> but was:<2012-02-25T23:15:00.000-03:00>
	at junit.framework.Assert.fail(Assert.java:47)
	at junit.framework.Assert.failNotEquals(Assert.java:280)
	at junit.framework.Assert.assertEquals(Assert.java:64)
	at junit.framework.Assert.assertEquals(Assert.java:71)
	at org.joda.time.TestDateTimeZoneCutover.testBug3476684_adjustOffset(TestDateTimeZoneCutover.java:1292)

testZoneTransition(org.joda.time.TestIllegalFieldValueException)  Time elapsed: 0.002 sec  <<< FAILURE!
junit.framework.AssertionFailedError
	at junit.framework.Assert.fail(Assert.java:47)
	at junit.framework.Assert.fail(Assert.java:53)
	at org.joda.time.TestIllegalFieldValueException.testZoneTransition(TestIllegalFieldValueException.java:198)

testGetPartialValues(org.joda.time.convert.TestNullConverter)  Time elapsed: 0.001 sec  <<< FAILURE!
junit.framework.AssertionFailedError: expected:<true> but was:<false>
	at junit.framework.Assert.fail(Assert.java:47)
	at junit.framework.Assert.failNotEquals(Assert.java:280)
	at junit.framework.Assert.assertEquals(Assert.java:64)
	at junit.framework.Assert.assertEquals(Assert.java:146)
	at junit.framework.Assert.assertEquals(Assert.java:152)
	at org.joda.time.convert.TestNullConverter.testGetPartialValues(TestNullConverter.java:145)

testZoneNameNearTransition(org.joda.time.format.TestDateTimeFormatter)  Time elapsed: 0.002 sec  <<< FAILURE!
junit.framework.ComparisonFailure: expected:<... 02:00:00.0 Eastern [Standard] Time> but was:<... 02:00:00.0 Eastern [Daylight] Time>
	at junit.framework.Assert.assertEquals(Assert.java:81)
	at junit.framework.Assert.assertEquals(Assert.java:87)
	at org.joda.time.format.TestDateTimeFormatter.testZoneNameNearTransition(TestDateTimeFormatter.java:1005)

testZoneShortNameNearTransition(org.joda.time.format.TestDateTimeFormatter)  Time elapsed: 0.001 sec  <<< FAILURE!
junit.framework.ComparisonFailure: expected:<...5-10-30 02:00:00.0 E[S]T> but was:<...5-10-30 02:00:00.0 E[D]T>
	at junit.framework.Assert.assertEquals(Assert.java:81)
	at junit.framework.Assert.assertEquals(Assert.java:87)
	at org.joda.time.format.TestDateTimeFormatter.testZoneShortNameNearTransition(TestDateTimeFormatter.java:1021)

testForStyle_shortTime(org.joda.time.format.TestDateTimeFormatStyle)  Time elapsed: 0.002 sec  <<< FAILURE!
junit.framework.AssertionFailedError: expected:<1970-01-01T09:20:00.000Z> but was:<1970-01-01T10:20:00.000Z>
	at junit.framework.Assert.fail(Assert.java:47)
	at junit.framework.Assert.failNotEquals(Assert.java:280)
	at junit.framework.Assert.assertEquals(Assert.java:64)
	at junit.framework.Assert.assertEquals(Assert.java:71)
	at org.joda.time.format.TestDateTimeFormatStyle.testForStyle_shortTime(TestDateTimeFormatStyle.java:161)

testSerialization(org.joda.time.tz.TestBuilder)  Time elapsed: 0.009 sec  <<< FAILURE!
junit.framework.AssertionFailedError: expected:<-1633269600000> but was:<379996320000>
	at junit.framework.Assert.fail(Assert.java:47)
	at junit.framework.Assert.failNotEquals(Assert.java:280)
	at junit.framework.Assert.assertEquals(Assert.java:64)
	at junit.framework.Assert.assertEquals(Assert.java:133)
	at junit.framework.Assert.assertEquals(Assert.java:139)
	at org.joda.time.tz.TestBuilder.testForwardTransitions(TestBuilder.java:234)
	at org.joda.time.tz.TestBuilder.testSerialization(TestBuilder.java:282)

testCompile(org.joda.time.tz.TestCompiler)  Time elapsed: 0.034 sec  <<< FAILURE!
junit.framework.AssertionFailedError: expected:<-1633269600000> but was:<379996320000>
	at junit.framework.Assert.fail(Assert.java:47)
	at junit.framework.Assert.failNotEquals(Assert.java:280)
	at junit.framework.Assert.assertEquals(Assert.java:64)
	at junit.framework.Assert.assertEquals(Assert.java:133)
	at junit.framework.Assert.assertEquals(Assert.java:139)
	at org.joda.time.tz.TestBuilder.testForwardTransitions(TestBuilder.java:234)
	at org.joda.time.tz.TestCompiler.testCompile(TestCompiler.java:117)


Results :

Failed tests: 
  org.joda.time.TestDateMidnight_Constructors#testConstructor_badconverterObject AssertionFailedError
  org.joda.time.TestDateMidnight_Constructors#testConstructor_badconverterObject_Chronology AssertionFailedError
  org.joda.time.TestDateMidnight_Constructors#testConstructor_badconverterObject_DateTimeZone AssertionFailedError
  org.joda.time.TestDateTimeZone#testPatchedNameKeysGazaHistoric AssertionFailedError
  org.joda.time.TestDateTimeZoneCutover#testBug3476684_adjustOffset AssertionFailedError
  org.joda.time.TestDateTimeZoneCutover#test_DateTime_constructor_Moscow_Autumn ComparisonFailure
  org.joda.time.TestDateTimeZoneCutover#test_DateTime_minusHour_Guatemata_Autumn ComparisonFailure
  org.joda.time.TestDateTimeZoneCutover#test_DateTime_minusHour_Moscow_Autumn ComparisonFailure
  org.joda.time.TestDateTimeZoneCutover#test_DateTime_plusHour_Guatemata_Autumn ComparisonFailure
  org.joda.time.TestDateTimeZoneCutover#test_DateTime_plusHour_Moscow_Autumn ComparisonFailure
  org.joda.time.TestDateTimeZoneCutover#test_DateTime_setHourAcross_Moscow_Spring ComparisonFailure
  org.joda.time.TestDateTimeZoneCutover#test_DateTime_setHourBack_Moscow_Spring ComparisonFailure
  org.joda.time.TestDateTimeZoneCutover#test_DateTime_setHourForward_Moscow_Spring AssertionFailedError
  org.joda.time.TestDateTimeZoneCutover#test_GuatemataIsCorrect_Autumn ComparisonFailure
  org.joda.time.TestDateTimeZoneCutover#test_MoscowIsCorrect_Autumn ComparisonFailure
  org.joda.time.TestDateTimeZoneCutover#test_MoscowIsCorrect_Spring ComparisonFailure
  org.joda.time.TestDateTimeZoneCutover#test_RioBrancoIsCorrect_Spring ComparisonFailure
  org.joda.time.TestDateTimeZoneCutover#test_getOffsetFromLocal_Guatemata_Autumn AssertionFailedError
  org.joda.time.TestDateTimeZoneCutover#test_getOffsetFromLocal_Moscow_Autumn AssertionFailedError
  org.joda.time.TestDateTimeZoneCutover#test_getOffsetFromLocal_Moscow_Autumn_overlap_mins AssertionFailedError
  org.joda.time.TestDateTimeZoneCutover#test_getOffsetFromLocal_Moscow_Spring ComparisonFailure
  org.joda.time.TestDateTimeZoneCutover#test_getOffsetFromLocal_RioBranco_Spring ComparisonFailure
  org.joda.time.TestDateTime_Constructors#testConstructor_ObjectString6 AssertionFailedError
  org.joda.time.TestDateTime_Properties#testPropertySetTextYear ComparisonFailure
  org.joda.time.TestDateTime_Properties#testPropertySetYear ComparisonFailure ex...
  org.joda.time.TestDateTime_Properties#testPropertyWithMaximumValueMillisOfDayDSTGap ComparisonFailure
  org.joda.time.TestDateTime_Properties#testPropertyWithMinimumValueMillisOfDayDSTGap ComparisonFailure
  org.joda.time.TestIllegalFieldValueException#testZoneTransition AssertionFailedError
  org.joda.time.TestLocalTime_Basics#testToDateTime_RI ComparisonFailure expecte...
  org.joda.time.TestLocalTime_Basics#testToDateTime_nullRI ComparisonFailure exp...
  org.joda.time.TestMutableDateTime_Properties#testPropertySetTextYear ComparisonFailure
  org.joda.time.TestMutableDateTime_Properties#testPropertySetYear ComparisonFailure
  org.joda.time.TestPartial_Basics#testToDateTime_RI ComparisonFailure expected:...
  org.joda.time.TestPartial_Basics#testToDateTime_nullRI ComparisonFailure expec...
  org.joda.time.TestTimeOfDay_Basics#testGet AssertionFailedError expected:<11> ...
  org.joda.time.TestTimeOfDay_Basics#testToDateTime_RI ComparisonFailure expecte...
  org.joda.time.TestTimeOfDay_Basics#testToDateTime_nullRI ComparisonFailure exp...
  org.joda.time.TestTimeOfDay_Constructors#testConstructor AssertionFailedError ...
  org.joda.time.TestTimeOfDay_Constructors#testConstructor_Chronology AssertionFailedError
  org.joda.time.TestTimeOfDay_Constructors#testConstructor_Object1 AssertionFailedError
  org.joda.time.TestTimeOfDay_Constructors#testConstructor_Object2 AssertionFailedError
  org.joda.time.TestTimeOfDay_Constructors#testConstructor_ObjectString2 AssertionFailedError
  org.joda.time.TestTimeOfDay_Constructors#testConstructor_ObjectString4 AssertionFailedError
  org.joda.time.TestTimeOfDay_Constructors#testConstructor_Object_Chronology AssertionFailedError
  org.joda.time.TestTimeOfDay_Constructors#testConstructor_Object_nullChronology AssertionFailedError
  org.joda.time.TestTimeOfDay_Constructors#testConstructor_long1 AssertionFailedError
  org.joda.time.TestTimeOfDay_Constructors#testConstructor_long1_Chronology AssertionFailedError
  org.joda.time.TestTimeOfDay_Constructors#testConstructor_long2 AssertionFailedError
  org.joda.time.TestTimeOfDay_Constructors#testConstructor_long2_Chronology AssertionFailedError
  org.joda.time.TestTimeOfDay_Constructors#testConstructor_long_nullChronology AssertionFailedError
  org.joda.time.TestTimeOfDay_Constructors#testConstructor_nullChronology AssertionFailedError
  org.joda.time.TestTimeOfDay_Constructors#testConstructor_nullObject AssertionFailedError
  org.joda.time.TestTimeOfDay_Constructors#testConstructor_nullObject_Chronology AssertionFailedError
  org.joda.time.TestTimeOfDay_Constructors#testConstructor_nullObject_nullChronology AssertionFailedError
  org.joda.time.convert.TestNullConverter#testGetPartialValues AssertionFailedError
  org.joda.time.format.TestDateTimeFormatStyle#testForStyle_shortTime AssertionFailedError
  org.joda.time.format.TestDateTimeFormatter#testZoneNameNearTransition ComparisonFailure
  org.joda.time.format.TestDateTimeFormatter#testZoneShortNameNearTransition ComparisonFailure
  org.joda.time.tz.TestBuilder#testSerialization AssertionFailedError expected:<...
  org.joda.time.tz.TestCompiler#testCompile AssertionFailedError expected:<-1633...

Tests run: 4157, Failures: 60, Errors: 0, Skipped: 0

[INFO] ------------------------------------------------------------------------
[INFO] BUILD FAILURE
[INFO] ------------------------------------------------------------------------
[INFO] Total time: 27.572s
[INFO] Finished at: Thu Aug 06 12:44:53 BST 2015
[INFO] Final Memory: 11M/338M
[INFO] ------------------------------------------------------------------------
[ERROR] Failed to execute goal org.apache.maven.plugins:maven-surefire-plugin:2.18.1:test (default-test) on project joda-time: There are test failures.
[ERROR] 
[ERROR] Please refer to /home/perham/Study/LittleDarwin/Cases/joda-time-2.8.1/target/surefire-reports for the individual test results.
[ERROR] -> [Help 1]
[ERROR] 
[ERROR] To see the full stack trace of the errors, re-run Maven with the -e switch.
[ERROR] Re-run Maven using the -X switch to enable full debug logging.
[ERROR] 
[ERROR] For more information about the errors and possible solutions, please read the following articles:
[ERROR] [Help 1] http://cwiki.apache.org/confluence/display/MAVEN/MojoFailureException
