[INFO] Scanning for projects...
[INFO]                                                                         
[INFO] ------------------------------------------------------------------------
[INFO] Building Joda-Time 2.8.1
[INFO] ------------------------------------------------------------------------
[INFO] 
[INFO] --- maven-resources-plugin:2.7:resources (default-resources) @ joda-time ---
[INFO] Using 'UTF-8' encoding to copy filtered resources.
[INFO] Copying 2 resources to META-INF
[INFO] Copying 10 resources
[INFO] 
[INFO] --- maven-compiler-plugin:3.3:compile (default-compile) @ joda-time ---
[INFO] Changes detected - recompiling the module!
[INFO] Compiling 166 source files to /home/perham/Study/LittleDarwin/Cases/joda-time-2.8.1/target/classes
[INFO] 
[INFO] --- exec-maven-plugin:1.4.0:java (compile-tzdb) @ joda-time ---
Writing zoneinfo files
*d* Error in Africa/Windhoek 1990-03-20T22:00:00.000Z
*d* Error in Antarctica/Troll 2005-02-12T00:00:00.000Z
*d* Error in Asia/Tbilisi 1879-12-31T21:00:49.000Z
*d* Error in Asia/Jakarta 1867-08-09T16:52:48.000Z
*d* Error in Asia/Pontianak 1908-04-30T16:42:40.000Z
*d* Error in Asia/Tehran 1915-12-31T20:34:16.000Z
*d* Error in Asia/Aqtau 1962-12-31T19:00:00.000Z
*d* Error in Asia/Singapore 1900-12-31T17:04:35.000Z
*d* Error in Europe/Brussels 1879-12-31T23:42:30.000Z
*d* Error in Europe/Copenhagen 1889-12-31T23:09:40.000Z
*d* Error in Europe/Tallinn 1879-12-31T22:21:00.000Z
*d* Error in Europe/Helsinki 1878-05-30T22:20:11.000Z
*d* Error in Europe/Paris 1891-03-14T23:51:39.000Z
*d* Error in Europe/Athens 1895-09-13T22:25:08.000Z
*d* Error in Europe/Rome 1866-09-21T23:10:04.000Z
*d* Error in Europe/Riga 1879-12-31T22:23:26.000Z
*d* Error in Europe/Warsaw 1879-12-31T22:36:00.000Z
*d* Error in Atlantic/Madeira 1884-01-01T01:07:36.000Z
*d* Error in Europe/Bucharest 1891-09-30T22:15:36.000Z
*d* Error in Europe/Moscow 1879-12-31T21:29:43.000Z
*d* Error in Europe/Volgograd 1961-11-10T20:00:00.000Z
*d* Error in Europe/Samara 1935-01-26T20:00:00.000Z
*d* Error in Asia/Novokuznetsk 2014-10-25T19:00:00.000Z
*d* Error in Asia/Irkutsk 1879-12-31T17:02:55.000Z
*d* Error in Europe/Kiev 1879-12-31T21:57:56.000Z
*d* Error in America/St_Johns 1884-01-01T03:30:52.000Z
*d* Error in America/Barbados 1924-01-01T03:58:29.000Z
*d* Error in America/Costa_Rica 1890-01-01T05:36:13.000Z
*d* Error in America/Jamaica 1890-01-01T05:07:11.000Z
*d* Error in America/Martinique 1890-01-01T04:04:20.000Z
*d* Error in America/Argentina/Cordoba 1894-10-31T04:16:48.000Z
*d* Error in America/La_Paz 1890-01-01T04:32:36.000Z
*d* Error in America/Santiago 1890-01-01T04:42:46.000Z
*d* Error in Pacific/Easter 1890-01-01T07:17:28.000Z
*d* Error in America/Bogota 1884-03-13T04:56:16.000Z
*d* Error in Atlantic/Stanley 1890-01-01T03:51:24.000Z
*d* Error in America/Asuncion 1890-01-01T03:50:40.000Z
*d* Error in America/Montevideo 1898-06-28T03:44:44.000Z
Cannot find source zone 'Europe/Helsinki' to link alias 'Europe/Mariehamn' to
Cannot find source zone 'Europe/Rome' to link alias 'Europe/Vatican' to
Cannot find source zone 'Europe/Rome' to link alias 'Europe/San_Marino' to
Cannot find time zone 'America/Argentina/Cordoba' to link alias 'America/Cordoba' to
Cannot find time zone 'America/Argentina/Cordoba' to link alias 'America/Rosario' to
Cannot find time zone 'America/St_Johns' to link alias 'Canada/Newfoundland' to
Cannot find time zone 'America/Santiago' to link alias 'Chile/Continental' to
Cannot find time zone 'Pacific/Easter' to link alias 'Chile/EasterIsland' to
Cannot find time zone 'Asia/Tehran' to link alias 'Iran' to
Cannot find time zone 'America/Jamaica' to link alias 'Jamaica' to
Cannot find time zone 'Europe/Warsaw' to link alias 'Poland' to
Cannot find time zone 'Asia/Singapore' to link alias 'Singapore' to
Cannot find time zone 'Europe/Moscow' to link alias 'W-SU' to
Writing ZoneInfoMap
[INFO] 
[INFO] --- maven-resources-plugin:2.7:testResources (default-testResources) @ joda-time ---
[INFO] Using 'UTF-8' encoding to copy filtered resources.
[INFO] Copying 34 resources
[INFO] 
[INFO] --- maven-compiler-plugin:3.3:testCompile (default-testCompile) @ joda-time ---
[INFO] Nothing to compile - all classes are up to date
[INFO] 
[INFO] --- maven-surefire-plugin:2.18.1:test (default-test) @ joda-time ---
[INFO] Surefire report directory: /home/perham/Study/LittleDarwin/Cases/joda-time-2.8.1/target/surefire-reports

-------------------------------------------------------
 T E S T S
-------------------------------------------------------
Running org.joda.time.TestAllPackages

Results :

Tests run: 0, Failures: 0, Errors: 0, Skipped: 0

[INFO] ------------------------------------------------------------------------
[INFO] BUILD FAILURE
[INFO] ------------------------------------------------------------------------
[INFO] Total time: 10.309s
[INFO] Finished at: Thu Aug 06 12:06:48 BST 2015
[INFO] Final Memory: 9M/213M
[INFO] ------------------------------------------------------------------------
[ERROR] Failed to execute goal org.apache.maven.plugins:maven-surefire-plugin:2.18.1:test (default-test) on project joda-time: Execution default-test of goal org.apache.maven.plugins:maven-surefire-plugin:2.18.1:test failed: There was an error in the forked process
[ERROR] org.apache.maven.surefire.testset.TestSetFailedException: org.joda.time.TestAllPackages
[ERROR] at org.apache.maven.surefire.junit.JUnitTestSet.execute(JUnitTestSet.java:115)
[ERROR] at org.apache.maven.surefire.junit.JUnit3Provider.executeTestSet(JUnit3Provider.java:130)
[ERROR] at org.apache.maven.surefire.junit.JUnit3Provider.invoke(JUnit3Provider.java:107)
[ERROR] at org.apache.maven.surefire.booter.ForkedBooter.invokeProviderInSameClassLoader(ForkedBooter.java:203)
[ERROR] at org.apache.maven.surefire.booter.ForkedBooter.runSuitesInProcess(ForkedBooter.java:155)
[ERROR] at org.apache.maven.surefire.booter.ForkedBooter.main(ForkedBooter.java:103)
[ERROR] Caused by: java.lang.ExceptionInInitializerError
[ERROR] at org.joda.time.TestAll.suite(TestAll.java:41)
[ERROR] at org.joda.time.TestAllPackages.suite(TestAllPackages.java:36)
[ERROR] at sun.reflect.NativeMethodAccessorImpl.invoke0(Native Method)
[ERROR] at sun.reflect.NativeMethodAccessorImpl.invoke(NativeMethodAccessorImpl.java:57)
[ERROR] at sun.reflect.DelegatingMethodAccessorImpl.invoke(DelegatingMethodAccessorImpl.java:43)
[ERROR] at java.lang.reflect.Method.invoke(Method.java:606)
[ERROR] at org.apache.maven.surefire.common.junit3.JUnit3Reflector.createInstanceFromSuiteMethod(JUnit3Reflector.java:159)
[ERROR] at org.apache.maven.surefire.common.junit3.JUnit3Reflector.constructTestObject(JUnit3Reflector.java:124)
[ERROR] at org.apache.maven.surefire.junit.JUnitTestSet.execute(JUnitTestSet.java:74)
[ERROR] ... 5 more
[ERROR] Caused by: java.lang.IllegalArgumentException: The datetime zone id 'Europe/Paris' is not recognised
[ERROR] at org.joda.time.DateTimeZone.forID(DateTimeZone.java:229)
[ERROR] at org.joda.time.TestInstant_Constructors.<clinit>(TestInstant_Constructors.java:37)
[ERROR] ... 14 more
[ERROR] -> [Help 1]
[ERROR] 
[ERROR] To see the full stack trace of the errors, re-run Maven with the -e switch.
[ERROR] Re-run Maven using the -X switch to enable full debug logging.
[ERROR] 
[ERROR] For more information about the errors and possible solutions, please read the following articles:
[ERROR] [Help 1] http://cwiki.apache.org/confluence/display/MAVEN/PluginExecutionException
