[INFO] Scanning for projects...
[INFO]                                                                         
[INFO] ------------------------------------------------------------------------
[INFO] Building Joda-Time 2.8.1
[INFO] ------------------------------------------------------------------------
[INFO] 
[INFO] --- maven-resources-plugin:2.7:resources (default-resources) @ joda-time ---
[INFO] Using 'UTF-8' encoding to copy filtered resources.
[INFO] Copying 2 resources to META-INF
[INFO] Copying 10 resources
[INFO] 
[INFO] --- maven-compiler-plugin:3.3:compile (default-compile) @ joda-time ---
[INFO] Changes detected - recompiling the module!
[INFO] Compiling 166 source files to /home/perham/Study/LittleDarwin/Cases/joda-time-2.8.1/target/classes
[INFO] 
[INFO] --- exec-maven-plugin:1.4.0:java (compile-tzdb) @ joda-time ---
Writing zoneinfo files
*s* Error in Africa/Algiers 1891-03-14T23:48:48.000Z, nameKey=null
*s* Error in Africa/Ndjamena 1911-12-31T22:59:48.000Z, nameKey=null
*s* Error in Africa/Cairo 1900-09-30T21:54:51.000Z, nameKey=null
*s* Error in Africa/Accra 1918-01-01T00:00:52.000Z, nameKey=null
*s* Error in Africa/Nairobi 1928-06-30T21:32:44.000Z, nameKey=null
*s* Error in Africa/Tripoli 1919-12-31T23:07:16.000Z, nameKey=null
*s* Error in Indian/Mauritius 1906-12-31T20:10:00.000Z, nameKey=null
*s* Error in Africa/Casablanca 1913-10-26T00:30:20.000Z, nameKey=null
*s* Error in Africa/El_Aaiun 1934-01-01T00:52:48.000Z, nameKey=null
*s* Error in Africa/Windhoek 1892-02-07T22:51:36.000Z, nameKey=null
*s* Error in Africa/Johannesburg 1892-02-07T22:08:00.000Z, nameKey=null
*s* Error in Africa/Khartoum 1930-12-31T21:49:52.000Z, nameKey=null
*s* Error in Africa/Tunis 1881-05-11T23:19:16.000Z, nameKey=null
*s* Error in Antarctica/Casey 1969-01-01T00:00:00.000Z, nameKey=null
*s* Error in Antarctica/Davis 1957-01-13T00:00:00.000Z, nameKey=null
[WARNING] 
java.lang.reflect.InvocationTargetException
	at sun.reflect.NativeMethodAccessorImpl.invoke0(Native Method)
	at sun.reflect.NativeMethodAccessorImpl.invoke(NativeMethodAccessorImpl.java:57)
	at sun.reflect.DelegatingMethodAccessorImpl.invoke(DelegatingMethodAccessorImpl.java:43)
	at java.lang.reflect.Method.invoke(Method.java:606)
	at org.codehaus.mojo.exec.ExecJavaMojo$1.run(ExecJavaMojo.java:293)
	at java.lang.Thread.run(Thread.java:745)
Caused by: java.lang.NullPointerException
	at org.joda.time.tz.ZoneInfoCompiler.test(ZoneInfoCompiler.java:281)
	at org.joda.time.tz.ZoneInfoCompiler.compile(ZoneInfoCompiler.java:387)
	at org.joda.time.tz.ZoneInfoCompiler.main(ZoneInfoCompiler.java:123)
	... 6 more
[INFO] ------------------------------------------------------------------------
[INFO] BUILD FAILURE
[INFO] ------------------------------------------------------------------------
[INFO] Total time: 8.403s
[INFO] Finished at: Thu Aug 06 12:06:36 BST 2015
[INFO] Final Memory: 8M/151M
[INFO] ------------------------------------------------------------------------
[ERROR] Failed to execute goal org.codehaus.mojo:exec-maven-plugin:1.4.0:java (compile-tzdb) on project joda-time: An exception occured while executing the Java class. null: InvocationTargetException: NullPointerException -> [Help 1]
[ERROR] 
[ERROR] To see the full stack trace of the errors, re-run Maven with the -e switch.
[ERROR] Re-run Maven using the -X switch to enable full debug logging.
[ERROR] 
[ERROR] For more information about the errors and possible solutions, please read the following articles:
[ERROR] [Help 1] http://cwiki.apache.org/confluence/display/MAVEN/MojoExecutionException
