[INFO] Scanning for projects...
[INFO]                                                                         
[INFO] ------------------------------------------------------------------------
[INFO] Building Joda-Time 2.8.1
[INFO] ------------------------------------------------------------------------
[INFO] 
[INFO] --- maven-resources-plugin:2.7:resources (default-resources) @ joda-time ---
[INFO] Using 'UTF-8' encoding to copy filtered resources.
[INFO] Copying 2 resources to META-INF
[INFO] Copying 10 resources
[INFO] 
[INFO] --- maven-compiler-plugin:3.3:compile (default-compile) @ joda-time ---
[INFO] Changes detected - recompiling the module!
[INFO] Compiling 166 source files to /home/perham/Study/LittleDarwin/Cases/joda-time-2.8.1/target/classes
[INFO] 
[INFO] --- exec-maven-plugin:1.4.0:java (compile-tzdb) @ joda-time ---
Writing zoneinfo files
*d* Error in Asia/Qyzylorda 1992-01-18T21:00:00.000Z
*d* Error in Asia/Aqtau 1981-09-30T19:00:00.000Z
*d* Error in Asia/Seoul 1954-03-20T15:00:00.000Z
*d* Error in Asia/Kuala_Lumpur 1941-08-31T16:40:00.000Z
*d* Error in Asia/Singapore 1941-08-31T16:40:00.000Z
*d* Error in Asia/Ashgabat 1992-01-18T22:00:00.000Z
*d* Error in Pacific/Apia 1879-07-04T11:26:56.000Z
*d* Error in Europe/Moscow 1916-07-02T21:29:43.000Z
*d* Error in Europe/Volgograd 1930-06-20T21:00:00.000Z
*d* Error in America/Juneau 1867-10-17T08:57:41.000Z
*d* Error in America/Sitka 1867-10-17T09:01:13.000Z
*d* Error in America/Metlakatla 1867-10-17T08:46:18.000Z
*d* Error in America/Yakutat 1867-10-17T09:18:55.000Z
*d* Error in America/Anchorage 1867-10-17T09:59:36.000Z
*d* Error in America/Nome 1867-10-17T11:01:39.000Z
*d* Error in America/Adak 1867-10-17T11:46:39.000Z
*d* Error in America/Lima 1890-01-01T05:08:12.000Z
Cannot find time zone 'America/Adak' to link alias 'America/Atka' to
Cannot find time zone 'Asia/Ashgabat' to link alias 'Asia/Ashkhabad' to
Cannot find time zone 'Asia/Seoul' to link alias 'ROK' to
Cannot find time zone 'Asia/Singapore' to link alias 'Singapore' to
Cannot find time zone 'America/Anchorage' to link alias 'US/Alaska' to
Cannot find time zone 'America/Adak' to link alias 'US/Aleutian' to
Cannot find time zone 'Europe/Moscow' to link alias 'W-SU' to
Writing ZoneInfoMap
[INFO] 
[INFO] --- maven-resources-plugin:2.7:testResources (default-testResources) @ joda-time ---
[INFO] Using 'UTF-8' encoding to copy filtered resources.
[INFO] Copying 34 resources
[INFO] 
[INFO] --- maven-compiler-plugin:3.3:testCompile (default-testCompile) @ joda-time ---
[INFO] Nothing to compile - all classes are up to date
[INFO] 
[INFO] --- maven-surefire-plugin:2.18.1:test (default-test) @ joda-time ---
[INFO] Surefire report directory: /home/perham/Study/LittleDarwin/Cases/joda-time-2.8.1/target/surefire-reports

-------------------------------------------------------
 T E S T S
-------------------------------------------------------
Running org.joda.time.TestAllPackages

Results :

Tests run: 0, Failures: 0, Errors: 0, Skipped: 0

[INFO] ------------------------------------------------------------------------
[INFO] BUILD FAILURE
[INFO] ------------------------------------------------------------------------
[INFO] Total time: 11.069s
[INFO] Finished at: Thu Aug 06 12:06:15 BST 2015
[INFO] Final Memory: 9M/213M
[INFO] ------------------------------------------------------------------------
[ERROR] Failed to execute goal org.apache.maven.plugins:maven-surefire-plugin:2.18.1:test (default-test) on project joda-time: Execution default-test of goal org.apache.maven.plugins:maven-surefire-plugin:2.18.1:test failed: There was an error in the forked process
[ERROR] org.apache.maven.surefire.testset.TestSetFailedException: org.joda.time.TestAllPackages
[ERROR] at org.apache.maven.surefire.junit.JUnitTestSet.execute(JUnitTestSet.java:115)
[ERROR] at org.apache.maven.surefire.junit.JUnit3Provider.executeTestSet(JUnit3Provider.java:130)
[ERROR] at org.apache.maven.surefire.junit.JUnit3Provider.invoke(JUnit3Provider.java:107)
[ERROR] at org.apache.maven.surefire.booter.ForkedBooter.invokeProviderInSameClassLoader(ForkedBooter.java:203)
[ERROR] at org.apache.maven.surefire.booter.ForkedBooter.runSuitesInProcess(ForkedBooter.java:155)
[ERROR] at org.apache.maven.surefire.booter.ForkedBooter.main(ForkedBooter.java:103)
[ERROR] Caused by: java.lang.ExceptionInInitializerError
[ERROR] at org.joda.time.TestAll.suite(TestAll.java:62)
[ERROR] at org.joda.time.TestAllPackages.suite(TestAllPackages.java:36)
[ERROR] at sun.reflect.NativeMethodAccessorImpl.invoke0(Native Method)
[ERROR] at sun.reflect.NativeMethodAccessorImpl.invoke(NativeMethodAccessorImpl.java:57)
[ERROR] at sun.reflect.DelegatingMethodAccessorImpl.invoke(DelegatingMethodAccessorImpl.java:43)
[ERROR] at java.lang.reflect.Method.invoke(Method.java:606)
[ERROR] at org.apache.maven.surefire.common.junit3.JUnit3Reflector.createInstanceFromSuiteMethod(JUnit3Reflector.java:159)
[ERROR] at org.apache.maven.surefire.common.junit3.JUnit3Reflector.constructTestObject(JUnit3Reflector.java:124)
[ERROR] at org.apache.maven.surefire.junit.JUnitTestSet.execute(JUnitTestSet.java:74)
[ERROR] ... 5 more
[ERROR] Caused by: java.lang.IllegalArgumentException: The datetime zone id 'Europe/Moscow' is not recognised
[ERROR] at org.joda.time.DateTimeZone.forID(DateTimeZone.java:229)
[ERROR] at org.joda.time.TestInterval_Basics.<clinit>(TestInterval_Basics.java:44)
[ERROR] ... 14 more
[ERROR] -> [Help 1]
[ERROR] 
[ERROR] To see the full stack trace of the errors, re-run Maven with the -e switch.
[ERROR] Re-run Maven using the -X switch to enable full debug logging.
[ERROR] 
[ERROR] For more information about the errors and possible solutions, please read the following articles:
[ERROR] [Help 1] http://cwiki.apache.org/confluence/display/MAVEN/PluginExecutionException
