[INFO] Scanning for projects...
[INFO]                                                                         
[INFO] ------------------------------------------------------------------------
[INFO] Building Joda-Time 2.8.1
[INFO] ------------------------------------------------------------------------
[INFO] 
[INFO] --- maven-resources-plugin:2.7:resources (default-resources) @ joda-time ---
[INFO] Using 'UTF-8' encoding to copy filtered resources.
[INFO] Copying 2 resources to META-INF
[INFO] Copying 10 resources
[INFO] 
[INFO] --- maven-compiler-plugin:3.3:compile (default-compile) @ joda-time ---
[INFO] Changes detected - recompiling the module!
[INFO] Compiling 166 source files to /home/perham/Study/LittleDarwin/Cases/joda-time-2.8.1/target/classes
[INFO] 
[INFO] --- exec-maven-plugin:1.4.0:java (compile-tzdb) @ joda-time ---
Writing zoneinfo files
Writing ZoneInfoMap
[INFO] 
[INFO] --- maven-resources-plugin:2.7:testResources (default-testResources) @ joda-time ---
[INFO] Using 'UTF-8' encoding to copy filtered resources.
[INFO] Copying 34 resources
[INFO] 
[INFO] --- maven-compiler-plugin:3.3:testCompile (default-testCompile) @ joda-time ---
[INFO] Nothing to compile - all classes are up to date
[INFO] 
[INFO] --- maven-surefire-plugin:2.18.1:test (default-test) @ joda-time ---
[INFO] Surefire report directory: /home/perham/Study/LittleDarwin/Cases/joda-time-2.8.1/target/surefire-reports

-------------------------------------------------------
 T E S T S
-------------------------------------------------------
Running org.joda.time.TestAllPackages

TestBuddhistChronology.testCalendar

TestCopticChronology.testCalendar

TestEthiopicChronology.testCalendar

TestIslamicChronology.testCalendar

Testing Gregorian chronology over 1000 iterations
100% complete (i=1000)

Testing Julian chronology over 1000 iterations
100% complete (i=1000)
Writing zoneinfo files
Writing ZoneInfoMap
Tests run: 4157, Failures: 3, Errors: 64, Skipped: 0, Time elapsed: 5.321 sec <<< FAILURE! - in org.joda.time.TestAllPackages
testToString_PeriodFormatter(org.joda.time.TestPeriod_Basics)  Time elapsed: 0.007 sec  <<< ERROR!
java.lang.ArrayIndexOutOfBoundsException: 5
	at org.joda.time.format.PeriodFormatterBuilder$Separator.<init>(PeriodFormatterBuilder.java:557)
	at org.joda.time.format.PeriodFormatterBuilder.appendSeparator(PeriodFormatterBuilder.java:180)
	at org.joda.time.format.PeriodFormatterBuilder.appendSeparator(PeriodFormatterBuilder.java:162)
	at org.joda.time.format.PeriodFormat.buildNonRegExFormatter(PeriodFormat.java:313)
	at org.joda.time.format.PeriodFormat.buildWordBased(PeriodFormat.java:221)
	at org.joda.time.format.PeriodFormat.wordBased(PeriodFormat.java:205)
	at org.joda.time.format.PeriodFormat.getDefault(PeriodFormat.java:73)
	at org.joda.time.TestPeriod_Basics.testToString_PeriodFormatter(TestPeriod_Basics.java:484)

test_wordBased_pl_formatTwoFields(org.joda.time.format.TestPeriodFormat)  Time elapsed: 0.007 sec  <<< ERROR!
java.lang.ArrayIndexOutOfBoundsException: 5
	at org.joda.time.format.PeriodFormatterBuilder$Separator.<init>(PeriodFormatterBuilder.java:557)
	at org.joda.time.format.PeriodFormatterBuilder.appendSeparator(PeriodFormatterBuilder.java:180)
	at org.joda.time.format.PeriodFormatterBuilder.appendSeparator(PeriodFormatterBuilder.java:162)
	at org.joda.time.format.PeriodFormat.buildRegExFormatter(PeriodFormat.java:239)
	at org.joda.time.format.PeriodFormat.buildWordBased(PeriodFormat.java:219)
	at org.joda.time.format.PeriodFormat.wordBased(PeriodFormat.java:205)
	at org.joda.time.format.TestPeriodFormat.test_wordBased_pl_formatTwoFields(TestPeriodFormat.java:392)

test_wordBased_pl_parseOneField(org.joda.time.format.TestPeriodFormat)  Time elapsed: 0.001 sec  <<< ERROR!
java.lang.ArrayIndexOutOfBoundsException: 5
	at org.joda.time.format.PeriodFormatterBuilder$Separator.<init>(PeriodFormatterBuilder.java:557)
	at org.joda.time.format.PeriodFormatterBuilder.appendSeparator(PeriodFormatterBuilder.java:180)
	at org.joda.time.format.PeriodFormatterBuilder.appendSeparator(PeriodFormatterBuilder.java:162)
	at org.joda.time.format.PeriodFormat.buildRegExFormatter(PeriodFormat.java:239)
	at org.joda.time.format.PeriodFormat.buildWordBased(PeriodFormat.java:219)
	at org.joda.time.format.PeriodFormat.wordBased(PeriodFormat.java:205)
	at org.joda.time.format.TestPeriodFormat.test_wordBased_pl_parseOneField(TestPeriodFormat.java:398)

test_wordBased_pl_parseTwoFields(org.joda.time.format.TestPeriodFormat)  Time elapsed: 0.002 sec  <<< ERROR!
java.lang.ArrayIndexOutOfBoundsException: 5
	at org.joda.time.format.PeriodFormatterBuilder$Separator.<init>(PeriodFormatterBuilder.java:557)
	at org.joda.time.format.PeriodFormatterBuilder.appendSeparator(PeriodFormatterBuilder.java:180)
	at org.joda.time.format.PeriodFormatterBuilder.appendSeparator(PeriodFormatterBuilder.java:162)
	at org.joda.time.format.PeriodFormat.buildRegExFormatter(PeriodFormat.java:239)
	at org.joda.time.format.PeriodFormat.buildWordBased(PeriodFormat.java:219)
	at org.joda.time.format.PeriodFormat.wordBased(PeriodFormat.java:205)
	at org.joda.time.format.TestPeriodFormat.test_wordBased_pl_parseTwoFields(TestPeriodFormat.java:404)

test_wordBased_pl_checkRedundantSeparator(org.joda.time.format.TestPeriodFormat)  Time elapsed: 0.001 sec  <<< FAILURE!
junit.framework.AssertionFailedError: expected:<class java.lang.IllegalArgumentException> but was:<class java.lang.ArrayIndexOutOfBoundsException>
	at junit.framework.Assert.fail(Assert.java:47)
	at junit.framework.Assert.failNotEquals(Assert.java:280)
	at junit.framework.Assert.assertEquals(Assert.java:64)
	at junit.framework.Assert.assertEquals(Assert.java:71)
	at org.joda.time.format.TestPeriodFormat.test_wordBased_pl_checkRedundantSeparator(TestPeriodFormat.java:413)

test_wordBased_pl_cached(org.joda.time.format.TestPeriodFormat)  Time elapsed: 0.001 sec  <<< ERROR!
java.lang.ArrayIndexOutOfBoundsException: 5
	at org.joda.time.format.PeriodFormatterBuilder$Separator.<init>(PeriodFormatterBuilder.java:557)
	at org.joda.time.format.PeriodFormatterBuilder.appendSeparator(PeriodFormatterBuilder.java:180)
	at org.joda.time.format.PeriodFormatterBuilder.appendSeparator(PeriodFormatterBuilder.java:162)
	at org.joda.time.format.PeriodFormat.buildRegExFormatter(PeriodFormat.java:239)
	at org.joda.time.format.PeriodFormat.buildWordBased(PeriodFormat.java:219)
	at org.joda.time.format.PeriodFormat.wordBased(PeriodFormat.java:205)
	at org.joda.time.format.TestPeriodFormat.test_wordBased_pl_cached(TestPeriodFormat.java:419)

test_wordBased_pl_regEx(org.joda.time.format.TestPeriodFormat)  Time elapsed: 0.002 sec  <<< ERROR!
java.lang.ArrayIndexOutOfBoundsException: 5
	at org.joda.time.format.PeriodFormatterBuilder$Separator.<init>(PeriodFormatterBuilder.java:557)
	at org.joda.time.format.PeriodFormatterBuilder.appendSeparator(PeriodFormatterBuilder.java:180)
	at org.joda.time.format.PeriodFormatterBuilder.appendSeparator(PeriodFormatterBuilder.java:162)
	at org.joda.time.format.PeriodFormat.buildRegExFormatter(PeriodFormat.java:239)
	at org.joda.time.format.PeriodFormat.buildWordBased(PeriodFormat.java:219)
	at org.joda.time.format.PeriodFormat.wordBased(PeriodFormat.java:205)
	at org.joda.time.format.TestPeriodFormat.test_wordBased_pl_regEx(TestPeriodFormat.java:424)

test_wordBased_fr_from_de(org.joda.time.format.TestPeriodFormat)  Time elapsed: 0.002 sec  <<< ERROR!
java.lang.ArrayIndexOutOfBoundsException: 5
	at org.joda.time.format.PeriodFormatterBuilder$Separator.<init>(PeriodFormatterBuilder.java:557)
	at org.joda.time.format.PeriodFormatterBuilder.appendSeparator(PeriodFormatterBuilder.java:180)
	at org.joda.time.format.PeriodFormatterBuilder.appendSeparator(PeriodFormatterBuilder.java:162)
	at org.joda.time.format.PeriodFormat.buildNonRegExFormatter(PeriodFormat.java:313)
	at org.joda.time.format.PeriodFormat.buildWordBased(PeriodFormat.java:221)
	at org.joda.time.format.PeriodFormat.wordBased(PeriodFormat.java:205)
	at org.joda.time.format.TestPeriodFormat.test_wordBased_fr_from_de(TestPeriodFormat.java:580)

test_wordBased_fr_from_nl(org.joda.time.format.TestPeriodFormat)  Time elapsed: 0.001 sec  <<< ERROR!
java.lang.ArrayIndexOutOfBoundsException: 5
	at org.joda.time.format.PeriodFormatterBuilder$Separator.<init>(PeriodFormatterBuilder.java:557)
	at org.joda.time.format.PeriodFormatterBuilder.appendSeparator(PeriodFormatterBuilder.java:180)
	at org.joda.time.format.PeriodFormatterBuilder.appendSeparator(PeriodFormatterBuilder.java:162)
	at org.joda.time.format.PeriodFormat.buildNonRegExFormatter(PeriodFormat.java:313)
	at org.joda.time.format.PeriodFormat.buildWordBased(PeriodFormat.java:221)
	at org.joda.time.format.PeriodFormat.wordBased(PeriodFormat.java:205)
	at org.joda.time.format.TestPeriodFormat.test_wordBased_fr_from_nl(TestPeriodFormat.java:586)

test_wordBased_en_from_de(org.joda.time.format.TestPeriodFormat)  Time elapsed: 0 sec  <<< ERROR!
java.lang.ArrayIndexOutOfBoundsException: 5
	at org.joda.time.format.PeriodFormatterBuilder$Separator.<init>(PeriodFormatterBuilder.java:557)
	at org.joda.time.format.PeriodFormatterBuilder.appendSeparator(PeriodFormatterBuilder.java:180)
	at org.joda.time.format.PeriodFormatterBuilder.appendSeparator(PeriodFormatterBuilder.java:162)
	at org.joda.time.format.PeriodFormat.buildNonRegExFormatter(PeriodFormat.java:313)
	at org.joda.time.format.PeriodFormat.buildWordBased(PeriodFormat.java:221)
	at org.joda.time.format.PeriodFormat.wordBased(PeriodFormat.java:205)
	at org.joda.time.format.TestPeriodFormat.test_wordBased_en_from_de(TestPeriodFormat.java:592)

test_wordBased_en_from_nl(org.joda.time.format.TestPeriodFormat)  Time elapsed: 0.001 sec  <<< ERROR!
java.lang.ArrayIndexOutOfBoundsException: 5
	at org.joda.time.format.PeriodFormatterBuilder$Separator.<init>(PeriodFormatterBuilder.java:557)
	at org.joda.time.format.PeriodFormatterBuilder.appendSeparator(PeriodFormatterBuilder.java:180)
	at org.joda.time.format.PeriodFormatterBuilder.appendSeparator(PeriodFormatterBuilder.java:162)
	at org.joda.time.format.PeriodFormat.buildNonRegExFormatter(PeriodFormat.java:313)
	at org.joda.time.format.PeriodFormat.buildWordBased(PeriodFormat.java:221)
	at org.joda.time.format.PeriodFormat.wordBased(PeriodFormat.java:205)
	at org.joda.time.format.TestPeriodFormat.test_wordBased_en_from_nl(TestPeriodFormat.java:598)

test_wordBased_en_from_pl(org.joda.time.format.TestPeriodFormat)  Time elapsed: 0 sec  <<< ERROR!
java.lang.ArrayIndexOutOfBoundsException: 5
	at org.joda.time.format.PeriodFormatterBuilder$Separator.<init>(PeriodFormatterBuilder.java:557)
	at org.joda.time.format.PeriodFormatterBuilder.appendSeparator(PeriodFormatterBuilder.java:180)
	at org.joda.time.format.PeriodFormatterBuilder.appendSeparator(PeriodFormatterBuilder.java:162)
	at org.joda.time.format.PeriodFormat.buildNonRegExFormatter(PeriodFormat.java:313)
	at org.joda.time.format.PeriodFormat.buildWordBased(PeriodFormat.java:221)
	at org.joda.time.format.PeriodFormat.wordBased(PeriodFormat.java:205)
	at org.joda.time.format.TestPeriodFormat.test_wordBased_en_from_pl(TestPeriodFormat.java:604)

test_wordBased_pl_from_fr(org.joda.time.format.TestPeriodFormat)  Time elapsed: 0.001 sec  <<< ERROR!
java.lang.ArrayIndexOutOfBoundsException: 5
	at org.joda.time.format.PeriodFormatterBuilder$Separator.<init>(PeriodFormatterBuilder.java:557)
	at org.joda.time.format.PeriodFormatterBuilder.appendSeparator(PeriodFormatterBuilder.java:180)
	at org.joda.time.format.PeriodFormatterBuilder.appendSeparator(PeriodFormatterBuilder.java:162)
	at org.joda.time.format.PeriodFormat.buildRegExFormatter(PeriodFormat.java:239)
	at org.joda.time.format.PeriodFormat.buildWordBased(PeriodFormat.java:219)
	at org.joda.time.format.PeriodFormat.wordBased(PeriodFormat.java:205)
	at org.joda.time.format.TestPeriodFormat.test_wordBased_pl_from_fr(TestPeriodFormat.java:610)

test_getDefault_localeValue(org.joda.time.format.TestPeriodFormat)  Time elapsed: 0 sec  <<< ERROR!
java.lang.ArrayIndexOutOfBoundsException: 5
	at org.joda.time.format.PeriodFormatterBuilder$Separator.<init>(PeriodFormatterBuilder.java:557)
	at org.joda.time.format.PeriodFormatterBuilder.appendSeparator(PeriodFormatterBuilder.java:180)
	at org.joda.time.format.PeriodFormatterBuilder.appendSeparator(PeriodFormatterBuilder.java:162)
	at org.joda.time.format.PeriodFormat.buildNonRegExFormatter(PeriodFormat.java:313)
	at org.joda.time.format.PeriodFormat.buildWordBased(PeriodFormat.java:221)
	at org.joda.time.format.PeriodFormat.wordBased(PeriodFormat.java:205)
	at org.joda.time.format.PeriodFormat.getDefault(PeriodFormat.java:73)
	at org.joda.time.format.TestPeriodFormat.test_getDefault_localeValue(TestPeriodFormat.java:615)

test_wordBased_localeValue(org.joda.time.format.TestPeriodFormat)  Time elapsed: 0.002 sec  <<< ERROR!
java.lang.ArrayIndexOutOfBoundsException: 5
	at org.joda.time.format.PeriodFormatterBuilder$Separator.<init>(PeriodFormatterBuilder.java:557)
	at org.joda.time.format.PeriodFormatterBuilder.appendSeparator(PeriodFormatterBuilder.java:180)
	at org.joda.time.format.PeriodFormatterBuilder.appendSeparator(PeriodFormatterBuilder.java:162)
	at org.joda.time.format.PeriodFormat.buildNonRegExFormatter(PeriodFormat.java:313)
	at org.joda.time.format.PeriodFormat.buildWordBased(PeriodFormat.java:221)
	at org.joda.time.format.PeriodFormat.wordBased(PeriodFormat.java:205)
	at org.joda.time.format.PeriodFormat.wordBased(PeriodFormat.java:85)
	at org.joda.time.format.TestPeriodFormat.test_wordBased_localeValue(TestPeriodFormat.java:620)

test_wordBasedWithLocale_localeValue(org.joda.time.format.TestPeriodFormat)  Time elapsed: 0.001 sec  <<< ERROR!
java.lang.ArrayIndexOutOfBoundsException: 5
	at org.joda.time.format.PeriodFormatterBuilder$Separator.<init>(PeriodFormatterBuilder.java:557)
	at org.joda.time.format.PeriodFormatterBuilder.appendSeparator(PeriodFormatterBuilder.java:180)
	at org.joda.time.format.PeriodFormatterBuilder.appendSeparator(PeriodFormatterBuilder.java:162)
	at org.joda.time.format.PeriodFormat.buildNonRegExFormatter(PeriodFormat.java:313)
	at org.joda.time.format.PeriodFormat.buildWordBased(PeriodFormat.java:221)
	at org.joda.time.format.PeriodFormat.wordBased(PeriodFormat.java:205)
	at org.joda.time.format.TestPeriodFormat.test_wordBasedWithLocale_localeValue(TestPeriodFormat.java:625)

test_wordBased_en_withLocale_pt(org.joda.time.format.TestPeriodFormat)  Time elapsed: 0 sec  <<< ERROR!
java.lang.ArrayIndexOutOfBoundsException: 5
	at org.joda.time.format.PeriodFormatterBuilder$Separator.<init>(PeriodFormatterBuilder.java:557)
	at org.joda.time.format.PeriodFormatterBuilder.appendSeparator(PeriodFormatterBuilder.java:180)
	at org.joda.time.format.PeriodFormatterBuilder.appendSeparator(PeriodFormatterBuilder.java:162)
	at org.joda.time.format.PeriodFormat.buildNonRegExFormatter(PeriodFormat.java:313)
	at org.joda.time.format.PeriodFormat.buildWordBased(PeriodFormat.java:221)
	at org.joda.time.format.PeriodFormat.wordBased(PeriodFormat.java:205)
	at org.joda.time.format.TestPeriodFormat.test_wordBased_en_withLocale_pt(TestPeriodFormat.java:632)

test_getDefault_parseOneField(org.joda.time.format.TestPeriodFormat)  Time elapsed: 0.001 sec  <<< ERROR!
java.lang.ArrayIndexOutOfBoundsException: 5
	at org.joda.time.format.PeriodFormatterBuilder$Separator.<init>(PeriodFormatterBuilder.java:557)
	at org.joda.time.format.PeriodFormatterBuilder.appendSeparator(PeriodFormatterBuilder.java:180)
	at org.joda.time.format.PeriodFormatterBuilder.appendSeparator(PeriodFormatterBuilder.java:162)
	at org.joda.time.format.PeriodFormat.buildNonRegExFormatter(PeriodFormat.java:313)
	at org.joda.time.format.PeriodFormat.buildWordBased(PeriodFormat.java:221)
	at org.joda.time.format.PeriodFormat.wordBased(PeriodFormat.java:205)
	at org.joda.time.format.PeriodFormat.getDefault(PeriodFormat.java:73)
	at org.joda.time.format.TestPeriodFormat.test_getDefault_parseOneField(TestPeriodFormat.java:97)

test_getDefault_parseTwoFields(org.joda.time.format.TestPeriodFormat)  Time elapsed: 0 sec  <<< ERROR!
java.lang.ArrayIndexOutOfBoundsException: 5
	at org.joda.time.format.PeriodFormatterBuilder$Separator.<init>(PeriodFormatterBuilder.java:557)
	at org.joda.time.format.PeriodFormatterBuilder.appendSeparator(PeriodFormatterBuilder.java:180)
	at org.joda.time.format.PeriodFormatterBuilder.appendSeparator(PeriodFormatterBuilder.java:162)
	at org.joda.time.format.PeriodFormat.buildNonRegExFormatter(PeriodFormat.java:313)
	at org.joda.time.format.PeriodFormat.buildWordBased(PeriodFormat.java:221)
	at org.joda.time.format.PeriodFormat.wordBased(PeriodFormat.java:205)
	at org.joda.time.format.PeriodFormat.getDefault(PeriodFormat.java:73)
	at org.joda.time.format.TestPeriodFormat.test_getDefault_parseTwoFields(TestPeriodFormat.java:103)

test_getDefault_checkRedundantSeparator(org.joda.time.format.TestPeriodFormat)  Time elapsed: 0.001 sec  <<< FAILURE!
junit.framework.AssertionFailedError: expected:<class java.lang.IllegalArgumentException> but was:<class java.lang.ArrayIndexOutOfBoundsException>
	at junit.framework.Assert.fail(Assert.java:47)
	at junit.framework.Assert.failNotEquals(Assert.java:280)
	at junit.framework.Assert.assertEquals(Assert.java:64)
	at junit.framework.Assert.assertEquals(Assert.java:71)
	at org.joda.time.format.TestPeriodFormat.test_getDefault_checkRedundantSeparator(TestPeriodFormat.java:112)

test_getDefault_cached(org.joda.time.format.TestPeriodFormat)  Time elapsed: 0.001 sec  <<< ERROR!
java.lang.ArrayIndexOutOfBoundsException: 5
	at org.joda.time.format.PeriodFormatterBuilder$Separator.<init>(PeriodFormatterBuilder.java:557)
	at org.joda.time.format.PeriodFormatterBuilder.appendSeparator(PeriodFormatterBuilder.java:180)
	at org.joda.time.format.PeriodFormatterBuilder.appendSeparator(PeriodFormatterBuilder.java:162)
	at org.joda.time.format.PeriodFormat.buildNonRegExFormatter(PeriodFormat.java:313)
	at org.joda.time.format.PeriodFormat.buildWordBased(PeriodFormat.java:221)
	at org.joda.time.format.PeriodFormat.wordBased(PeriodFormat.java:205)
	at org.joda.time.format.PeriodFormat.getDefault(PeriodFormat.java:73)
	at org.joda.time.format.TestPeriodFormat.test_getDefault_cached(TestPeriodFormat.java:118)

test_wordBased_default(org.joda.time.format.TestPeriodFormat)  Time elapsed: 0.001 sec  <<< ERROR!
java.lang.ArrayIndexOutOfBoundsException: 5
	at org.joda.time.format.PeriodFormatterBuilder$Separator.<init>(PeriodFormatterBuilder.java:557)
	at org.joda.time.format.PeriodFormatterBuilder.appendSeparator(PeriodFormatterBuilder.java:180)
	at org.joda.time.format.PeriodFormatterBuilder.appendSeparator(PeriodFormatterBuilder.java:162)
	at org.joda.time.format.PeriodFormat.buildNonRegExFormatter(PeriodFormat.java:313)
	at org.joda.time.format.PeriodFormat.buildWordBased(PeriodFormat.java:221)
	at org.joda.time.format.PeriodFormat.wordBased(PeriodFormat.java:205)
	at org.joda.time.format.PeriodFormat.wordBased(PeriodFormat.java:85)
	at org.joda.time.format.TestPeriodFormat.test_wordBased_default(TestPeriodFormat.java:126)

test_wordBased_fr_formatStandard(org.joda.time.format.TestPeriodFormat)  Time elapsed: 0.001 sec  <<< ERROR!
java.lang.ArrayIndexOutOfBoundsException: 5
	at org.joda.time.format.PeriodFormatterBuilder$Separator.<init>(PeriodFormatterBuilder.java:557)
	at org.joda.time.format.PeriodFormatterBuilder.appendSeparator(PeriodFormatterBuilder.java:180)
	at org.joda.time.format.PeriodFormatterBuilder.appendSeparator(PeriodFormatterBuilder.java:162)
	at org.joda.time.format.PeriodFormat.buildNonRegExFormatter(PeriodFormat.java:313)
	at org.joda.time.format.PeriodFormat.buildWordBased(PeriodFormat.java:221)
	at org.joda.time.format.PeriodFormat.wordBased(PeriodFormat.java:205)
	at org.joda.time.format.TestPeriodFormat.test_wordBased_fr_formatStandard(TestPeriodFormat.java:134)

test_wordBased_fr_FormatOneField(org.joda.time.format.TestPeriodFormat)  Time elapsed: 0.001 sec  <<< ERROR!
java.lang.ArrayIndexOutOfBoundsException: 5
	at org.joda.time.format.PeriodFormatterBuilder$Separator.<init>(PeriodFormatterBuilder.java:557)
	at org.joda.time.format.PeriodFormatterBuilder.appendSeparator(PeriodFormatterBuilder.java:180)
	at org.joda.time.format.PeriodFormatterBuilder.appendSeparator(PeriodFormatterBuilder.java:162)
	at org.joda.time.format.PeriodFormat.buildNonRegExFormatter(PeriodFormat.java:313)
	at org.joda.time.format.PeriodFormat.buildWordBased(PeriodFormat.java:221)
	at org.joda.time.format.PeriodFormat.wordBased(PeriodFormat.java:205)
	at org.joda.time.format.TestPeriodFormat.test_wordBased_fr_FormatOneField(TestPeriodFormat.java:140)

test_wordBased_fr_formatTwoFields(org.joda.time.format.TestPeriodFormat)  Time elapsed: 0.001 sec  <<< ERROR!
java.lang.ArrayIndexOutOfBoundsException: 5
	at org.joda.time.format.PeriodFormatterBuilder$Separator.<init>(PeriodFormatterBuilder.java:557)
	at org.joda.time.format.PeriodFormatterBuilder.appendSeparator(PeriodFormatterBuilder.java:180)
	at org.joda.time.format.PeriodFormatterBuilder.appendSeparator(PeriodFormatterBuilder.java:162)
	at org.joda.time.format.PeriodFormat.buildNonRegExFormatter(PeriodFormat.java:313)
	at org.joda.time.format.PeriodFormat.buildWordBased(PeriodFormat.java:221)
	at org.joda.time.format.PeriodFormat.wordBased(PeriodFormat.java:205)
	at org.joda.time.format.TestPeriodFormat.test_wordBased_fr_formatTwoFields(TestPeriodFormat.java:146)

test_wordBased_fr_parseOneField(org.joda.time.format.TestPeriodFormat)  Time elapsed: 0 sec  <<< ERROR!
java.lang.ArrayIndexOutOfBoundsException: 5
	at org.joda.time.format.PeriodFormatterBuilder$Separator.<init>(PeriodFormatterBuilder.java:557)
	at org.joda.time.format.PeriodFormatterBuilder.appendSeparator(PeriodFormatterBuilder.java:180)
	at org.joda.time.format.PeriodFormatterBuilder.appendSeparator(PeriodFormatterBuilder.java:162)
	at org.joda.time.format.PeriodFormat.buildNonRegExFormatter(PeriodFormat.java:313)
	at org.joda.time.format.PeriodFormat.buildWordBased(PeriodFormat.java:221)
	at org.joda.time.format.PeriodFormat.wordBased(PeriodFormat.java:205)
	at org.joda.time.format.TestPeriodFormat.test_wordBased_fr_parseOneField(TestPeriodFormat.java:152)

test_wordBased_fr_parseTwoFields(org.joda.time.format.TestPeriodFormat)  Time elapsed: 0.001 sec  <<< ERROR!
java.lang.ArrayIndexOutOfBoundsException: 5
	at org.joda.time.format.PeriodFormatterBuilder$Separator.<init>(PeriodFormatterBuilder.java:557)
	at org.joda.time.format.PeriodFormatterBuilder.appendSeparator(PeriodFormatterBuilder.java:180)
	at org.joda.time.format.PeriodFormatterBuilder.appendSeparator(PeriodFormatterBuilder.java:162)
	at org.joda.time.format.PeriodFormat.buildNonRegExFormatter(PeriodFormat.java:313)
	at org.joda.time.format.PeriodFormat.buildWordBased(PeriodFormat.java:221)
	at org.joda.time.format.PeriodFormat.wordBased(PeriodFormat.java:205)
	at org.joda.time.format.TestPeriodFormat.test_wordBased_fr_parseTwoFields(TestPeriodFormat.java:158)

test_wordBased_fr_cached(org.joda.time.format.TestPeriodFormat)  Time elapsed: 0.001 sec  <<< ERROR!
java.lang.ArrayIndexOutOfBoundsException: 5
	at org.joda.time.format.PeriodFormatterBuilder$Separator.<init>(PeriodFormatterBuilder.java:557)
	at org.joda.time.format.PeriodFormatterBuilder.appendSeparator(PeriodFormatterBuilder.java:180)
	at org.joda.time.format.PeriodFormatterBuilder.appendSeparator(PeriodFormatterBuilder.java:162)
	at org.joda.time.format.PeriodFormat.buildNonRegExFormatter(PeriodFormat.java:313)
	at org.joda.time.format.PeriodFormat.buildWordBased(PeriodFormat.java:221)
	at org.joda.time.format.PeriodFormat.wordBased(PeriodFormat.java:205)
	at org.joda.time.format.TestPeriodFormat.test_wordBased_fr_cached(TestPeriodFormat.java:163)

test_wordBased_pt_formatStandard(org.joda.time.format.TestPeriodFormat)  Time elapsed: 0.002 sec  <<< ERROR!
java.lang.ArrayIndexOutOfBoundsException: 5
	at org.joda.time.format.PeriodFormatterBuilder$Separator.<init>(PeriodFormatterBuilder.java:557)
	at org.joda.time.format.PeriodFormatterBuilder.appendSeparator(PeriodFormatterBuilder.java:180)
	at org.joda.time.format.PeriodFormatterBuilder.appendSeparator(PeriodFormatterBuilder.java:162)
	at org.joda.time.format.PeriodFormat.buildNonRegExFormatter(PeriodFormat.java:313)
	at org.joda.time.format.PeriodFormat.buildWordBased(PeriodFormat.java:221)
	at org.joda.time.format.PeriodFormat.wordBased(PeriodFormat.java:205)
	at org.joda.time.format.TestPeriodFormat.test_wordBased_pt_formatStandard(TestPeriodFormat.java:171)

test_wordBased_pt_FormatOneField(org.joda.time.format.TestPeriodFormat)  Time elapsed: 0.001 sec  <<< ERROR!
java.lang.ArrayIndexOutOfBoundsException: 5
	at org.joda.time.format.PeriodFormatterBuilder$Separator.<init>(PeriodFormatterBuilder.java:557)
	at org.joda.time.format.PeriodFormatterBuilder.appendSeparator(PeriodFormatterBuilder.java:180)
	at org.joda.time.format.PeriodFormatterBuilder.appendSeparator(PeriodFormatterBuilder.java:162)
	at org.joda.time.format.PeriodFormat.buildNonRegExFormatter(PeriodFormat.java:313)
	at org.joda.time.format.PeriodFormat.buildWordBased(PeriodFormat.java:221)
	at org.joda.time.format.PeriodFormat.wordBased(PeriodFormat.java:205)
	at org.joda.time.format.TestPeriodFormat.test_wordBased_pt_FormatOneField(TestPeriodFormat.java:177)

test_wordBased_pt_formatTwoFields(org.joda.time.format.TestPeriodFormat)  Time elapsed: 0.001 sec  <<< ERROR!
java.lang.ArrayIndexOutOfBoundsException: 5
	at org.joda.time.format.PeriodFormatterBuilder$Separator.<init>(PeriodFormatterBuilder.java:557)
	at org.joda.time.format.PeriodFormatterBuilder.appendSeparator(PeriodFormatterBuilder.java:180)
	at org.joda.time.format.PeriodFormatterBuilder.appendSeparator(PeriodFormatterBuilder.java:162)
	at org.joda.time.format.PeriodFormat.buildNonRegExFormatter(PeriodFormat.java:313)
	at org.joda.time.format.PeriodFormat.buildWordBased(PeriodFormat.java:221)
	at org.joda.time.format.PeriodFormat.wordBased(PeriodFormat.java:205)
	at org.joda.time.format.TestPeriodFormat.test_wordBased_pt_formatTwoFields(TestPeriodFormat.java:183)

test_wordBased_pt_parseOneField(org.joda.time.format.TestPeriodFormat)  Time elapsed: 0 sec  <<< ERROR!
java.lang.ArrayIndexOutOfBoundsException: 5
	at org.joda.time.format.PeriodFormatterBuilder$Separator.<init>(PeriodFormatterBuilder.java:557)
	at org.joda.time.format.PeriodFormatterBuilder.appendSeparator(PeriodFormatterBuilder.java:180)
	at org.joda.time.format.PeriodFormatterBuilder.appendSeparator(PeriodFormatterBuilder.java:162)
	at org.joda.time.format.PeriodFormat.buildNonRegExFormatter(PeriodFormat.java:313)
	at org.joda.time.format.PeriodFormat.buildWordBased(PeriodFormat.java:221)
	at org.joda.time.format.PeriodFormat.wordBased(PeriodFormat.java:205)
	at org.joda.time.format.TestPeriodFormat.test_wordBased_pt_parseOneField(TestPeriodFormat.java:189)

test_wordBased_pt_parseTwoFields(org.joda.time.format.TestPeriodFormat)  Time elapsed: 0 sec  <<< ERROR!
java.lang.ArrayIndexOutOfBoundsException: 5
	at org.joda.time.format.PeriodFormatterBuilder$Separator.<init>(PeriodFormatterBuilder.java:557)
	at org.joda.time.format.PeriodFormatterBuilder.appendSeparator(PeriodFormatterBuilder.java:180)
	at org.joda.time.format.PeriodFormatterBuilder.appendSeparator(PeriodFormatterBuilder.java:162)
	at org.joda.time.format.PeriodFormat.buildNonRegExFormatter(PeriodFormat.java:313)
	at org.joda.time.format.PeriodFormat.buildWordBased(PeriodFormat.java:221)
	at org.joda.time.format.PeriodFormat.wordBased(PeriodFormat.java:205)
	at org.joda.time.format.TestPeriodFormat.test_wordBased_pt_parseTwoFields(TestPeriodFormat.java:195)

test_wordBased_pt_cached(org.joda.time.format.TestPeriodFormat)  Time elapsed: 0.001 sec  <<< ERROR!
java.lang.ArrayIndexOutOfBoundsException: 5
	at org.joda.time.format.PeriodFormatterBuilder$Separator.<init>(PeriodFormatterBuilder.java:557)
	at org.joda.time.format.PeriodFormatterBuilder.appendSeparator(PeriodFormatterBuilder.java:180)
	at org.joda.time.format.PeriodFormatterBuilder.appendSeparator(PeriodFormatterBuilder.java:162)
	at org.joda.time.format.PeriodFormat.buildNonRegExFormatter(PeriodFormat.java:313)
	at org.joda.time.format.PeriodFormat.buildWordBased(PeriodFormat.java:221)
	at org.joda.time.format.PeriodFormat.wordBased(PeriodFormat.java:205)
	at org.joda.time.format.TestPeriodFormat.test_wordBased_pt_cached(TestPeriodFormat.java:200)

test_wordBased_es_formatStandard(org.joda.time.format.TestPeriodFormat)  Time elapsed: 0.002 sec  <<< ERROR!
java.lang.ArrayIndexOutOfBoundsException: 5
	at org.joda.time.format.PeriodFormatterBuilder$Separator.<init>(PeriodFormatterBuilder.java:557)
	at org.joda.time.format.PeriodFormatterBuilder.appendSeparator(PeriodFormatterBuilder.java:180)
	at org.joda.time.format.PeriodFormatterBuilder.appendSeparator(PeriodFormatterBuilder.java:162)
	at org.joda.time.format.PeriodFormat.buildNonRegExFormatter(PeriodFormat.java:313)
	at org.joda.time.format.PeriodFormat.buildWordBased(PeriodFormat.java:221)
	at org.joda.time.format.PeriodFormat.wordBased(PeriodFormat.java:205)
	at org.joda.time.format.TestPeriodFormat.test_wordBased_es_formatStandard(TestPeriodFormat.java:208)

test_wordBased_es_FormatOneField(org.joda.time.format.TestPeriodFormat)  Time elapsed: 0.001 sec  <<< ERROR!
java.lang.ArrayIndexOutOfBoundsException: 5
	at org.joda.time.format.PeriodFormatterBuilder$Separator.<init>(PeriodFormatterBuilder.java:557)
	at org.joda.time.format.PeriodFormatterBuilder.appendSeparator(PeriodFormatterBuilder.java:180)
	at org.joda.time.format.PeriodFormatterBuilder.appendSeparator(PeriodFormatterBuilder.java:162)
	at org.joda.time.format.PeriodFormat.buildNonRegExFormatter(PeriodFormat.java:313)
	at org.joda.time.format.PeriodFormat.buildWordBased(PeriodFormat.java:221)
	at org.joda.time.format.PeriodFormat.wordBased(PeriodFormat.java:205)
	at org.joda.time.format.TestPeriodFormat.test_wordBased_es_FormatOneField(TestPeriodFormat.java:214)

test_wordBased_es_formatTwoFields(org.joda.time.format.TestPeriodFormat)  Time elapsed: 0.001 sec  <<< ERROR!
java.lang.ArrayIndexOutOfBoundsException: 5
	at org.joda.time.format.PeriodFormatterBuilder$Separator.<init>(PeriodFormatterBuilder.java:557)
	at org.joda.time.format.PeriodFormatterBuilder.appendSeparator(PeriodFormatterBuilder.java:180)
	at org.joda.time.format.PeriodFormatterBuilder.appendSeparator(PeriodFormatterBuilder.java:162)
	at org.joda.time.format.PeriodFormat.buildNonRegExFormatter(PeriodFormat.java:313)
	at org.joda.time.format.PeriodFormat.buildWordBased(PeriodFormat.java:221)
	at org.joda.time.format.PeriodFormat.wordBased(PeriodFormat.java:205)
	at org.joda.time.format.TestPeriodFormat.test_wordBased_es_formatTwoFields(TestPeriodFormat.java:220)

test_wordBased_es_parseOneField(org.joda.time.format.TestPeriodFormat)  Time elapsed: 0 sec  <<< ERROR!
java.lang.ArrayIndexOutOfBoundsException: 5
	at org.joda.time.format.PeriodFormatterBuilder$Separator.<init>(PeriodFormatterBuilder.java:557)
	at org.joda.time.format.PeriodFormatterBuilder.appendSeparator(PeriodFormatterBuilder.java:180)
	at org.joda.time.format.PeriodFormatterBuilder.appendSeparator(PeriodFormatterBuilder.java:162)
	at org.joda.time.format.PeriodFormat.buildNonRegExFormatter(PeriodFormat.java:313)
	at org.joda.time.format.PeriodFormat.buildWordBased(PeriodFormat.java:221)
	at org.joda.time.format.PeriodFormat.wordBased(PeriodFormat.java:205)
	at org.joda.time.format.TestPeriodFormat.test_wordBased_es_parseOneField(TestPeriodFormat.java:226)

test_wordBased_es_parseTwoFields(org.joda.time.format.TestPeriodFormat)  Time elapsed: 0 sec  <<< ERROR!
java.lang.ArrayIndexOutOfBoundsException: 5
	at org.joda.time.format.PeriodFormatterBuilder$Separator.<init>(PeriodFormatterBuilder.java:557)
	at org.joda.time.format.PeriodFormatterBuilder.appendSeparator(PeriodFormatterBuilder.java:180)
	at org.joda.time.format.PeriodFormatterBuilder.appendSeparator(PeriodFormatterBuilder.java:162)
	at org.joda.time.format.PeriodFormat.buildNonRegExFormatter(PeriodFormat.java:313)
	at org.joda.time.format.PeriodFormat.buildWordBased(PeriodFormat.java:221)
	at org.joda.time.format.PeriodFormat.wordBased(PeriodFormat.java:205)
	at org.joda.time.format.TestPeriodFormat.test_wordBased_es_parseTwoFields(TestPeriodFormat.java:232)

test_wordBased_es_cached(org.joda.time.format.TestPeriodFormat)  Time elapsed: 0.002 sec  <<< ERROR!
java.lang.ArrayIndexOutOfBoundsException: 5
	at org.joda.time.format.PeriodFormatterBuilder$Separator.<init>(PeriodFormatterBuilder.java:557)
	at org.joda.time.format.PeriodFormatterBuilder.appendSeparator(PeriodFormatterBuilder.java:180)
	at org.joda.time.format.PeriodFormatterBuilder.appendSeparator(PeriodFormatterBuilder.java:162)
	at org.joda.time.format.PeriodFormat.buildNonRegExFormatter(PeriodFormat.java:313)
	at org.joda.time.format.PeriodFormat.buildWordBased(PeriodFormat.java:221)
	at org.joda.time.format.PeriodFormat.wordBased(PeriodFormat.java:205)
	at org.joda.time.format.TestPeriodFormat.test_wordBased_es_cached(TestPeriodFormat.java:237)

test_wordBased_de_formatStandard(org.joda.time.format.TestPeriodFormat)  Time elapsed: 0 sec  <<< ERROR!
java.lang.ArrayIndexOutOfBoundsException: 5
	at org.joda.time.format.PeriodFormatterBuilder$Separator.<init>(PeriodFormatterBuilder.java:557)
	at org.joda.time.format.PeriodFormatterBuilder.appendSeparator(PeriodFormatterBuilder.java:180)
	at org.joda.time.format.PeriodFormatterBuilder.appendSeparator(PeriodFormatterBuilder.java:162)
	at org.joda.time.format.PeriodFormat.buildNonRegExFormatter(PeriodFormat.java:313)
	at org.joda.time.format.PeriodFormat.buildWordBased(PeriodFormat.java:221)
	at org.joda.time.format.PeriodFormat.wordBased(PeriodFormat.java:205)
	at org.joda.time.format.TestPeriodFormat.test_wordBased_de_formatStandard(TestPeriodFormat.java:245)

test_wordBased_de_FormatOneField(org.joda.time.format.TestPeriodFormat)  Time elapsed: 0.001 sec  <<< ERROR!
java.lang.ArrayIndexOutOfBoundsException: 5
	at org.joda.time.format.PeriodFormatterBuilder$Separator.<init>(PeriodFormatterBuilder.java:557)
	at org.joda.time.format.PeriodFormatterBuilder.appendSeparator(PeriodFormatterBuilder.java:180)
	at org.joda.time.format.PeriodFormatterBuilder.appendSeparator(PeriodFormatterBuilder.java:162)
	at org.joda.time.format.PeriodFormat.buildNonRegExFormatter(PeriodFormat.java:313)
	at org.joda.time.format.PeriodFormat.buildWordBased(PeriodFormat.java:221)
	at org.joda.time.format.PeriodFormat.wordBased(PeriodFormat.java:205)
	at org.joda.time.format.TestPeriodFormat.test_wordBased_de_FormatOneField(TestPeriodFormat.java:251)

test_wordBased_de_formatTwoFields(org.joda.time.format.TestPeriodFormat)  Time elapsed: 0 sec  <<< ERROR!
java.lang.ArrayIndexOutOfBoundsException: 5
	at org.joda.time.format.PeriodFormatterBuilder$Separator.<init>(PeriodFormatterBuilder.java:557)
	at org.joda.time.format.PeriodFormatterBuilder.appendSeparator(PeriodFormatterBuilder.java:180)
	at org.joda.time.format.PeriodFormatterBuilder.appendSeparator(PeriodFormatterBuilder.java:162)
	at org.joda.time.format.PeriodFormat.buildNonRegExFormatter(PeriodFormat.java:313)
	at org.joda.time.format.PeriodFormat.buildWordBased(PeriodFormat.java:221)
	at org.joda.time.format.PeriodFormat.wordBased(PeriodFormat.java:205)
	at org.joda.time.format.TestPeriodFormat.test_wordBased_de_formatTwoFields(TestPeriodFormat.java:257)

test_wordBased_de_parseOneField(org.joda.time.format.TestPeriodFormat)  Time elapsed: 0 sec  <<< ERROR!
java.lang.ArrayIndexOutOfBoundsException: 5
	at org.joda.time.format.PeriodFormatterBuilder$Separator.<init>(PeriodFormatterBuilder.java:557)
	at org.joda.time.format.PeriodFormatterBuilder.appendSeparator(PeriodFormatterBuilder.java:180)
	at org.joda.time.format.PeriodFormatterBuilder.appendSeparator(PeriodFormatterBuilder.java:162)
	at org.joda.time.format.PeriodFormat.buildNonRegExFormatter(PeriodFormat.java:313)
	at org.joda.time.format.PeriodFormat.buildWordBased(PeriodFormat.java:221)
	at org.joda.time.format.PeriodFormat.wordBased(PeriodFormat.java:205)
	at org.joda.time.format.TestPeriodFormat.test_wordBased_de_parseOneField(TestPeriodFormat.java:263)

test_wordBased_de_parseTwoFields(org.joda.time.format.TestPeriodFormat)  Time elapsed: 0.001 sec  <<< ERROR!
java.lang.ArrayIndexOutOfBoundsException: 5
	at org.joda.time.format.PeriodFormatterBuilder$Separator.<init>(PeriodFormatterBuilder.java:557)
	at org.joda.time.format.PeriodFormatterBuilder.appendSeparator(PeriodFormatterBuilder.java:180)
	at org.joda.time.format.PeriodFormatterBuilder.appendSeparator(PeriodFormatterBuilder.java:162)
	at org.joda.time.format.PeriodFormat.buildNonRegExFormatter(PeriodFormat.java:313)
	at org.joda.time.format.PeriodFormat.buildWordBased(PeriodFormat.java:221)
	at org.joda.time.format.PeriodFormat.wordBased(PeriodFormat.java:205)
	at org.joda.time.format.TestPeriodFormat.test_wordBased_de_parseTwoFields(TestPeriodFormat.java:269)

test_wordBased_de_cached(org.joda.time.format.TestPeriodFormat)  Time elapsed: 0 sec  <<< ERROR!
java.lang.ArrayIndexOutOfBoundsException: 5
	at org.joda.time.format.PeriodFormatterBuilder$Separator.<init>(PeriodFormatterBuilder.java:557)
	at org.joda.time.format.PeriodFormatterBuilder.appendSeparator(PeriodFormatterBuilder.java:180)
	at org.joda.time.format.PeriodFormatterBuilder.appendSeparator(PeriodFormatterBuilder.java:162)
	at org.joda.time.format.PeriodFormat.buildNonRegExFormatter(PeriodFormat.java:313)
	at org.joda.time.format.PeriodFormat.buildWordBased(PeriodFormat.java:221)
	at org.joda.time.format.PeriodFormat.wordBased(PeriodFormat.java:205)
	at org.joda.time.format.TestPeriodFormat.test_wordBased_de_cached(TestPeriodFormat.java:274)

test_wordBased_nl_formatStandard(org.joda.time.format.TestPeriodFormat)  Time elapsed: 0.002 sec  <<< ERROR!
java.lang.ArrayIndexOutOfBoundsException: 5
	at org.joda.time.format.PeriodFormatterBuilder$Separator.<init>(PeriodFormatterBuilder.java:557)
	at org.joda.time.format.PeriodFormatterBuilder.appendSeparator(PeriodFormatterBuilder.java:180)
	at org.joda.time.format.PeriodFormatterBuilder.appendSeparator(PeriodFormatterBuilder.java:162)
	at org.joda.time.format.PeriodFormat.buildNonRegExFormatter(PeriodFormat.java:313)
	at org.joda.time.format.PeriodFormat.buildWordBased(PeriodFormat.java:221)
	at org.joda.time.format.PeriodFormat.wordBased(PeriodFormat.java:205)
	at org.joda.time.format.TestPeriodFormat.test_wordBased_nl_formatStandard(TestPeriodFormat.java:282)

test_wordBased_nl_FormatOneField(org.joda.time.format.TestPeriodFormat)  Time elapsed: 0.001 sec  <<< ERROR!
java.lang.ArrayIndexOutOfBoundsException: 5
	at org.joda.time.format.PeriodFormatterBuilder$Separator.<init>(PeriodFormatterBuilder.java:557)
	at org.joda.time.format.PeriodFormatterBuilder.appendSeparator(PeriodFormatterBuilder.java:180)
	at org.joda.time.format.PeriodFormatterBuilder.appendSeparator(PeriodFormatterBuilder.java:162)
	at org.joda.time.format.PeriodFormat.buildNonRegExFormatter(PeriodFormat.java:313)
	at org.joda.time.format.PeriodFormat.buildWordBased(PeriodFormat.java:221)
	at org.joda.time.format.PeriodFormat.wordBased(PeriodFormat.java:205)
	at org.joda.time.format.TestPeriodFormat.test_wordBased_nl_FormatOneField(TestPeriodFormat.java:288)

test_wordBased_nl_formatTwoFields(org.joda.time.format.TestPeriodFormat)  Time elapsed: 0.001 sec  <<< ERROR!
java.lang.ArrayIndexOutOfBoundsException: 5
	at org.joda.time.format.PeriodFormatterBuilder$Separator.<init>(PeriodFormatterBuilder.java:557)
	at org.joda.time.format.PeriodFormatterBuilder.appendSeparator(PeriodFormatterBuilder.java:180)
	at org.joda.time.format.PeriodFormatterBuilder.appendSeparator(PeriodFormatterBuilder.java:162)
	at org.joda.time.format.PeriodFormat.buildNonRegExFormatter(PeriodFormat.java:313)
	at org.joda.time.format.PeriodFormat.buildWordBased(PeriodFormat.java:221)
	at org.joda.time.format.PeriodFormat.wordBased(PeriodFormat.java:205)
	at org.joda.time.format.TestPeriodFormat.test_wordBased_nl_formatTwoFields(TestPeriodFormat.java:294)

test_wordBased_nl_parseOneField(org.joda.time.format.TestPeriodFormat)  Time elapsed: 0 sec  <<< ERROR!
java.lang.ArrayIndexOutOfBoundsException: 5
	at org.joda.time.format.PeriodFormatterBuilder$Separator.<init>(PeriodFormatterBuilder.java:557)
	at org.joda.time.format.PeriodFormatterBuilder.appendSeparator(PeriodFormatterBuilder.java:180)
	at org.joda.time.format.PeriodFormatterBuilder.appendSeparator(PeriodFormatterBuilder.java:162)
	at org.joda.time.format.PeriodFormat.buildNonRegExFormatter(PeriodFormat.java:313)
	at org.joda.time.format.PeriodFormat.buildWordBased(PeriodFormat.java:221)
	at org.joda.time.format.PeriodFormat.wordBased(PeriodFormat.java:205)
	at org.joda.time.format.TestPeriodFormat.test_wordBased_nl_parseOneField(TestPeriodFormat.java:300)

test_wordBased_nl_parseTwoFields(org.joda.time.format.TestPeriodFormat)  Time elapsed: 0.001 sec  <<< ERROR!
java.lang.ArrayIndexOutOfBoundsException: 5
	at org.joda.time.format.PeriodFormatterBuilder$Separator.<init>(PeriodFormatterBuilder.java:557)
	at org.joda.time.format.PeriodFormatterBuilder.appendSeparator(PeriodFormatterBuilder.java:180)
	at org.joda.time.format.PeriodFormatterBuilder.appendSeparator(PeriodFormatterBuilder.java:162)
	at org.joda.time.format.PeriodFormat.buildNonRegExFormatter(PeriodFormat.java:313)
	at org.joda.time.format.PeriodFormat.buildWordBased(PeriodFormat.java:221)
	at org.joda.time.format.PeriodFormat.wordBased(PeriodFormat.java:205)
	at org.joda.time.format.TestPeriodFormat.test_wordBased_nl_parseTwoFields(TestPeriodFormat.java:306)

test_wordBased_nl_cached(org.joda.time.format.TestPeriodFormat)  Time elapsed: 0 sec  <<< ERROR!
java.lang.ArrayIndexOutOfBoundsException: 5
	at org.joda.time.format.PeriodFormatterBuilder$Separator.<init>(PeriodFormatterBuilder.java:557)
	at org.joda.time.format.PeriodFormatterBuilder.appendSeparator(PeriodFormatterBuilder.java:180)
	at org.joda.time.format.PeriodFormatterBuilder.appendSeparator(PeriodFormatterBuilder.java:162)
	at org.joda.time.format.PeriodFormat.buildNonRegExFormatter(PeriodFormat.java:313)
	at org.joda.time.format.PeriodFormat.buildWordBased(PeriodFormat.java:221)
	at org.joda.time.format.PeriodFormat.wordBased(PeriodFormat.java:205)
	at org.joda.time.format.TestPeriodFormat.test_wordBased_nl_cached(TestPeriodFormat.java:311)

test_wordBased_da_formatMultiple(org.joda.time.format.TestPeriodFormat)  Time elapsed: 0.002 sec  <<< ERROR!
java.lang.ArrayIndexOutOfBoundsException: 5
	at org.joda.time.format.PeriodFormatterBuilder$Separator.<init>(PeriodFormatterBuilder.java:557)
	at org.joda.time.format.PeriodFormatterBuilder.appendSeparator(PeriodFormatterBuilder.java:180)
	at org.joda.time.format.PeriodFormatterBuilder.appendSeparator(PeriodFormatterBuilder.java:162)
	at org.joda.time.format.PeriodFormat.buildNonRegExFormatter(PeriodFormat.java:313)
	at org.joda.time.format.PeriodFormat.buildWordBased(PeriodFormat.java:221)
	at org.joda.time.format.PeriodFormat.wordBased(PeriodFormat.java:205)
	at org.joda.time.format.TestPeriodFormat.test_wordBased_da_formatMultiple(TestPeriodFormat.java:319)

test_wordBased_da_formatSinglular(org.joda.time.format.TestPeriodFormat)  Time elapsed: 0 sec  <<< ERROR!
java.lang.ArrayIndexOutOfBoundsException: 5
	at org.joda.time.format.PeriodFormatterBuilder$Separator.<init>(PeriodFormatterBuilder.java:557)
	at org.joda.time.format.PeriodFormatterBuilder.appendSeparator(PeriodFormatterBuilder.java:180)
	at org.joda.time.format.PeriodFormatterBuilder.appendSeparator(PeriodFormatterBuilder.java:162)
	at org.joda.time.format.PeriodFormat.buildNonRegExFormatter(PeriodFormat.java:313)
	at org.joda.time.format.PeriodFormat.buildWordBased(PeriodFormat.java:221)
	at org.joda.time.format.PeriodFormat.wordBased(PeriodFormat.java:205)
	at org.joda.time.format.TestPeriodFormat.test_wordBased_da_formatSinglular(TestPeriodFormat.java:325)

test_wordBased_da_cached(org.joda.time.format.TestPeriodFormat)  Time elapsed: 0.001 sec  <<< ERROR!
java.lang.ArrayIndexOutOfBoundsException: 5
	at org.joda.time.format.PeriodFormatterBuilder$Separator.<init>(PeriodFormatterBuilder.java:557)
	at org.joda.time.format.PeriodFormatterBuilder.appendSeparator(PeriodFormatterBuilder.java:180)
	at org.joda.time.format.PeriodFormatterBuilder.appendSeparator(PeriodFormatterBuilder.java:162)
	at org.joda.time.format.PeriodFormat.buildNonRegExFormatter(PeriodFormat.java:313)
	at org.joda.time.format.PeriodFormat.buildWordBased(PeriodFormat.java:221)
	at org.joda.time.format.PeriodFormat.wordBased(PeriodFormat.java:205)
	at org.joda.time.format.TestPeriodFormat.test_wordBased_da_cached(TestPeriodFormat.java:330)

test_wordBased_ja_formatMultiple(org.joda.time.format.TestPeriodFormat)  Time elapsed: 0.001 sec  <<< ERROR!
java.lang.ArrayIndexOutOfBoundsException: 5
	at org.joda.time.format.PeriodFormatterBuilder$Separator.<init>(PeriodFormatterBuilder.java:557)
	at org.joda.time.format.PeriodFormatterBuilder.appendSeparator(PeriodFormatterBuilder.java:180)
	at org.joda.time.format.PeriodFormatterBuilder.appendSeparator(PeriodFormatterBuilder.java:162)
	at org.joda.time.format.PeriodFormat.buildNonRegExFormatter(PeriodFormat.java:313)
	at org.joda.time.format.PeriodFormat.buildWordBased(PeriodFormat.java:221)
	at org.joda.time.format.PeriodFormat.wordBased(PeriodFormat.java:205)
	at org.joda.time.format.TestPeriodFormat.test_wordBased_ja_formatMultiple(TestPeriodFormat.java:338)

test_wordBased_ja_formatSingular(org.joda.time.format.TestPeriodFormat)  Time elapsed: 0 sec  <<< ERROR!
java.lang.ArrayIndexOutOfBoundsException: 5
	at org.joda.time.format.PeriodFormatterBuilder$Separator.<init>(PeriodFormatterBuilder.java:557)
	at org.joda.time.format.PeriodFormatterBuilder.appendSeparator(PeriodFormatterBuilder.java:180)
	at org.joda.time.format.PeriodFormatterBuilder.appendSeparator(PeriodFormatterBuilder.java:162)
	at org.joda.time.format.PeriodFormat.buildNonRegExFormatter(PeriodFormat.java:313)
	at org.joda.time.format.PeriodFormat.buildWordBased(PeriodFormat.java:221)
	at org.joda.time.format.PeriodFormat.wordBased(PeriodFormat.java:205)
	at org.joda.time.format.TestPeriodFormat.test_wordBased_ja_formatSingular(TestPeriodFormat.java:344)

test_wordBased_ja_cached(org.joda.time.format.TestPeriodFormat)  Time elapsed: 0.001 sec  <<< ERROR!
java.lang.ArrayIndexOutOfBoundsException: 5
	at org.joda.time.format.PeriodFormatterBuilder$Separator.<init>(PeriodFormatterBuilder.java:557)
	at org.joda.time.format.PeriodFormatterBuilder.appendSeparator(PeriodFormatterBuilder.java:180)
	at org.joda.time.format.PeriodFormatterBuilder.appendSeparator(PeriodFormatterBuilder.java:162)
	at org.joda.time.format.PeriodFormat.buildNonRegExFormatter(PeriodFormat.java:313)
	at org.joda.time.format.PeriodFormat.buildWordBased(PeriodFormat.java:221)
	at org.joda.time.format.PeriodFormat.wordBased(PeriodFormat.java:205)
	at org.joda.time.format.TestPeriodFormat.test_wordBased_ja_cached(TestPeriodFormat.java:349)

test_wordBased_ja_parseOneField(org.joda.time.format.TestPeriodFormat)  Time elapsed: 0 sec  <<< ERROR!
java.lang.ArrayIndexOutOfBoundsException: 5
	at org.joda.time.format.PeriodFormatterBuilder$Separator.<init>(PeriodFormatterBuilder.java:557)
	at org.joda.time.format.PeriodFormatterBuilder.appendSeparator(PeriodFormatterBuilder.java:180)
	at org.joda.time.format.PeriodFormatterBuilder.appendSeparator(PeriodFormatterBuilder.java:162)
	at org.joda.time.format.PeriodFormat.buildNonRegExFormatter(PeriodFormat.java:313)
	at org.joda.time.format.PeriodFormat.buildWordBased(PeriodFormat.java:221)
	at org.joda.time.format.PeriodFormat.wordBased(PeriodFormat.java:205)
	at org.joda.time.format.TestPeriodFormat.test_wordBased_ja_parseOneField(TestPeriodFormat.java:355)

test_wordBased_ja_parseTwoFields(org.joda.time.format.TestPeriodFormat)  Time elapsed: 0.001 sec  <<< ERROR!
java.lang.ArrayIndexOutOfBoundsException: 5
	at org.joda.time.format.PeriodFormatterBuilder$Separator.<init>(PeriodFormatterBuilder.java:557)
	at org.joda.time.format.PeriodFormatterBuilder.appendSeparator(PeriodFormatterBuilder.java:180)
	at org.joda.time.format.PeriodFormatterBuilder.appendSeparator(PeriodFormatterBuilder.java:162)
	at org.joda.time.format.PeriodFormat.buildNonRegExFormatter(PeriodFormat.java:313)
	at org.joda.time.format.PeriodFormat.buildWordBased(PeriodFormat.java:221)
	at org.joda.time.format.PeriodFormat.wordBased(PeriodFormat.java:205)
	at org.joda.time.format.TestPeriodFormat.test_wordBased_ja_parseTwoFields(TestPeriodFormat.java:361)

test_wordBased_ja_checkRedundantSeparator(org.joda.time.format.TestPeriodFormat)  Time elapsed: 0 sec  <<< FAILURE!
junit.framework.AssertionFailedError: expected:<class java.lang.IllegalArgumentException> but was:<class java.lang.ArrayIndexOutOfBoundsException>
	at junit.framework.Assert.fail(Assert.java:47)
	at junit.framework.Assert.failNotEquals(Assert.java:280)
	at junit.framework.Assert.assertEquals(Assert.java:64)
	at junit.framework.Assert.assertEquals(Assert.java:71)
	at org.joda.time.format.TestPeriodFormat.test_wordBased_ja_checkRedundantSeparator(TestPeriodFormat.java:371)

test_wordBased_pl_formatStandard(org.joda.time.format.TestPeriodFormat)  Time elapsed: 0 sec  <<< ERROR!
java.lang.ArrayIndexOutOfBoundsException: 5
	at org.joda.time.format.PeriodFormatterBuilder$Separator.<init>(PeriodFormatterBuilder.java:557)
	at org.joda.time.format.PeriodFormatterBuilder.appendSeparator(PeriodFormatterBuilder.java:180)
	at org.joda.time.format.PeriodFormatterBuilder.appendSeparator(PeriodFormatterBuilder.java:162)
	at org.joda.time.format.PeriodFormat.buildRegExFormatter(PeriodFormat.java:239)
	at org.joda.time.format.PeriodFormat.buildWordBased(PeriodFormat.java:219)
	at org.joda.time.format.PeriodFormat.wordBased(PeriodFormat.java:205)
	at org.joda.time.format.TestPeriodFormat.test_wordBased_pl_formatStandard(TestPeriodFormat.java:380)

test_wordBased_pl_FormatOneField(org.joda.time.format.TestPeriodFormat)  Time elapsed: 0 sec  <<< ERROR!
java.lang.ArrayIndexOutOfBoundsException: 5
	at org.joda.time.format.PeriodFormatterBuilder$Separator.<init>(PeriodFormatterBuilder.java:557)
	at org.joda.time.format.PeriodFormatterBuilder.appendSeparator(PeriodFormatterBuilder.java:180)
	at org.joda.time.format.PeriodFormatterBuilder.appendSeparator(PeriodFormatterBuilder.java:162)
	at org.joda.time.format.PeriodFormat.buildRegExFormatter(PeriodFormat.java:239)
	at org.joda.time.format.PeriodFormat.buildWordBased(PeriodFormat.java:219)
	at org.joda.time.format.PeriodFormat.wordBased(PeriodFormat.java:205)
	at org.joda.time.format.TestPeriodFormat.test_wordBased_pl_FormatOneField(TestPeriodFormat.java:386)

test_getDefault_formatStandard(org.joda.time.format.TestPeriodFormat)  Time elapsed: 0 sec  <<< ERROR!
java.lang.ArrayIndexOutOfBoundsException: 5
	at org.joda.time.format.PeriodFormatterBuilder$Separator.<init>(PeriodFormatterBuilder.java:557)
	at org.joda.time.format.PeriodFormatterBuilder.appendSeparator(PeriodFormatterBuilder.java:180)
	at org.joda.time.format.PeriodFormatterBuilder.appendSeparator(PeriodFormatterBuilder.java:162)
	at org.joda.time.format.PeriodFormat.buildNonRegExFormatter(PeriodFormat.java:313)
	at org.joda.time.format.PeriodFormat.buildWordBased(PeriodFormat.java:221)
	at org.joda.time.format.PeriodFormat.wordBased(PeriodFormat.java:205)
	at org.joda.time.format.PeriodFormat.getDefault(PeriodFormat.java:73)
	at org.joda.time.format.TestPeriodFormat.test_getDefault_formatStandard(TestPeriodFormat.java:79)

test_getDefault_FormatOneField(org.joda.time.format.TestPeriodFormat)  Time elapsed: 0.001 sec  <<< ERROR!
java.lang.ArrayIndexOutOfBoundsException: 5
	at org.joda.time.format.PeriodFormatterBuilder$Separator.<init>(PeriodFormatterBuilder.java:557)
	at org.joda.time.format.PeriodFormatterBuilder.appendSeparator(PeriodFormatterBuilder.java:180)
	at org.joda.time.format.PeriodFormatterBuilder.appendSeparator(PeriodFormatterBuilder.java:162)
	at org.joda.time.format.PeriodFormat.buildNonRegExFormatter(PeriodFormat.java:313)
	at org.joda.time.format.PeriodFormat.buildWordBased(PeriodFormat.java:221)
	at org.joda.time.format.PeriodFormat.wordBased(PeriodFormat.java:205)
	at org.joda.time.format.PeriodFormat.getDefault(PeriodFormat.java:73)
	at org.joda.time.format.TestPeriodFormat.test_getDefault_FormatOneField(TestPeriodFormat.java:85)

test_getDefault_formatTwoFields(org.joda.time.format.TestPeriodFormat)  Time elapsed: 0 sec  <<< ERROR!
java.lang.ArrayIndexOutOfBoundsException: 5
	at org.joda.time.format.PeriodFormatterBuilder$Separator.<init>(PeriodFormatterBuilder.java:557)
	at org.joda.time.format.PeriodFormatterBuilder.appendSeparator(PeriodFormatterBuilder.java:180)
	at org.joda.time.format.PeriodFormatterBuilder.appendSeparator(PeriodFormatterBuilder.java:162)
	at org.joda.time.format.PeriodFormat.buildNonRegExFormatter(PeriodFormat.java:313)
	at org.joda.time.format.PeriodFormat.buildWordBased(PeriodFormat.java:221)
	at org.joda.time.format.PeriodFormat.wordBased(PeriodFormat.java:205)
	at org.joda.time.format.PeriodFormat.getDefault(PeriodFormat.java:73)
	at org.joda.time.format.TestPeriodFormat.test_getDefault_formatTwoFields(TestPeriodFormat.java:91)

testParseStandard1(org.joda.time.format.TestPeriodFormatParsing)  Time elapsed: 0.001 sec  <<< ERROR!
java.lang.ArrayIndexOutOfBoundsException: 5
	at org.joda.time.format.PeriodFormatterBuilder$Separator.<init>(PeriodFormatterBuilder.java:557)
	at org.joda.time.format.PeriodFormatterBuilder.appendSeparator(PeriodFormatterBuilder.java:180)
	at org.joda.time.format.PeriodFormatterBuilder.appendSeparator(PeriodFormatterBuilder.java:162)
	at org.joda.time.format.PeriodFormat.buildNonRegExFormatter(PeriodFormat.java:313)
	at org.joda.time.format.PeriodFormat.buildWordBased(PeriodFormat.java:221)
	at org.joda.time.format.PeriodFormat.wordBased(PeriodFormat.java:205)
	at org.joda.time.format.PeriodFormat.getDefault(PeriodFormat.java:73)
	at org.joda.time.format.TestPeriodFormatParsing.testParseStandard1(TestPeriodFormatParsing.java:93)


Results :

Failed tests: 
  org.joda.time.format.TestPeriodFormat#test_getDefault_checkRedundantSeparator AssertionFailedError
  org.joda.time.format.TestPeriodFormat#test_wordBased_ja_checkRedundantSeparator AssertionFailedError
  org.joda.time.format.TestPeriodFormat#test_wordBased_pl_checkRedundantSeparator AssertionFailedError
Tests in error: 
  org.joda.time.TestPeriod_Basics#testToString_PeriodFormatter ArrayIndexOutOfBoundsException
  org.joda.time.format.TestPeriodFormat#test_getDefault_FormatOneField ArrayIndexOutOfBoundsException
  org.joda.time.format.TestPeriodFormat#test_getDefault_cached ArrayIndexOutOfBoundsException
  org.joda.time.format.TestPeriodFormat#test_getDefault_formatStandard ArrayIndexOutOfBoundsException
  org.joda.time.format.TestPeriodFormat#test_getDefault_formatTwoFields ArrayIndexOutOfBoundsException
  org.joda.time.format.TestPeriodFormat#test_getDefault_localeValue ArrayIndexOutOfBoundsException
  org.joda.time.format.TestPeriodFormat#test_getDefault_parseOneField ArrayIndexOutOfBoundsException
  org.joda.time.format.TestPeriodFormat#test_getDefault_parseTwoFields ArrayIndexOutOfBoundsException
  org.joda.time.format.TestPeriodFormat#test_wordBasedWithLocale_localeValue ArrayIndexOutOfBoundsException
  org.joda.time.format.TestPeriodFormat#test_wordBased_da_cached ArrayIndexOutOfBoundsException
  org.joda.time.format.TestPeriodFormat#test_wordBased_da_formatMultiple ArrayIndexOutOfBoundsException
  org.joda.time.format.TestPeriodFormat#test_wordBased_da_formatSinglular ArrayIndexOutOfBoundsException
  org.joda.time.format.TestPeriodFormat#test_wordBased_de_FormatOneField ArrayIndexOutOfBoundsException
  org.joda.time.format.TestPeriodFormat#test_wordBased_de_cached ArrayIndexOutOfBoundsException
  org.joda.time.format.TestPeriodFormat#test_wordBased_de_formatStandard ArrayIndexOutOfBoundsException
  org.joda.time.format.TestPeriodFormat#test_wordBased_de_formatTwoFields ArrayIndexOutOfBoundsException
  org.joda.time.format.TestPeriodFormat#test_wordBased_de_parseOneField ArrayIndexOutOfBoundsException
  org.joda.time.format.TestPeriodFormat#test_wordBased_de_parseTwoFields ArrayIndexOutOfBoundsException
  org.joda.time.format.TestPeriodFormat#test_wordBased_default ArrayIndexOutOfBoundsException
  org.joda.time.format.TestPeriodFormat#test_wordBased_en_from_de ArrayIndexOutOfBoundsException
  org.joda.time.format.TestPeriodFormat#test_wordBased_en_from_nl ArrayIndexOutOfBoundsException
  org.joda.time.format.TestPeriodFormat#test_wordBased_en_from_pl ArrayIndexOutOfBoundsException
  org.joda.time.format.TestPeriodFormat#test_wordBased_en_withLocale_pt ArrayIndexOutOfBoundsException
  org.joda.time.format.TestPeriodFormat#test_wordBased_es_FormatOneField ArrayIndexOutOfBoundsException
  org.joda.time.format.TestPeriodFormat#test_wordBased_es_cached ArrayIndexOutOfBoundsException
  org.joda.time.format.TestPeriodFormat#test_wordBased_es_formatStandard ArrayIndexOutOfBoundsException
  org.joda.time.format.TestPeriodFormat#test_wordBased_es_formatTwoFields ArrayIndexOutOfBoundsException
  org.joda.time.format.TestPeriodFormat#test_wordBased_es_parseOneField ArrayIndexOutOfBoundsException
  org.joda.time.format.TestPeriodFormat#test_wordBased_es_parseTwoFields ArrayIndexOutOfBoundsException
  org.joda.time.format.TestPeriodFormat#test_wordBased_fr_FormatOneField ArrayIndexOutOfBoundsException
  org.joda.time.format.TestPeriodFormat#test_wordBased_fr_cached ArrayIndexOutOfBoundsException
  org.joda.time.format.TestPeriodFormat#test_wordBased_fr_formatStandard ArrayIndexOutOfBoundsException
  org.joda.time.format.TestPeriodFormat#test_wordBased_fr_formatTwoFields ArrayIndexOutOfBoundsException
  org.joda.time.format.TestPeriodFormat#test_wordBased_fr_from_de ArrayIndexOutOfBoundsException
  org.joda.time.format.TestPeriodFormat#test_wordBased_fr_from_nl ArrayIndexOutOfBoundsException
  org.joda.time.format.TestPeriodFormat#test_wordBased_fr_parseOneField ArrayIndexOutOfBoundsException
  org.joda.time.format.TestPeriodFormat#test_wordBased_fr_parseTwoFields ArrayIndexOutOfBoundsException
  org.joda.time.format.TestPeriodFormat#test_wordBased_ja_cached ArrayIndexOutOfBoundsException
  org.joda.time.format.TestPeriodFormat#test_wordBased_ja_formatMultiple ArrayIndexOutOfBoundsException
  org.joda.time.format.TestPeriodFormat#test_wordBased_ja_formatSingular ArrayIndexOutOfBoundsException
  org.joda.time.format.TestPeriodFormat#test_wordBased_ja_parseOneField ArrayIndexOutOfBoundsException
  org.joda.time.format.TestPeriodFormat#test_wordBased_ja_parseTwoFields ArrayIndexOutOfBoundsException
  org.joda.time.format.TestPeriodFormat#test_wordBased_localeValue ArrayIndexOutOfBoundsException
  org.joda.time.format.TestPeriodFormat#test_wordBased_nl_FormatOneField ArrayIndexOutOfBoundsException
  org.joda.time.format.TestPeriodFormat#test_wordBased_nl_cached ArrayIndexOutOfBoundsException
  org.joda.time.format.TestPeriodFormat#test_wordBased_nl_formatStandard ArrayIndexOutOfBoundsException
  org.joda.time.format.TestPeriodFormat#test_wordBased_nl_formatTwoFields ArrayIndexOutOfBoundsException
  org.joda.time.format.TestPeriodFormat#test_wordBased_nl_parseOneField ArrayIndexOutOfBoundsException
  org.joda.time.format.TestPeriodFormat#test_wordBased_nl_parseTwoFields ArrayIndexOutOfBoundsException
  org.joda.time.format.TestPeriodFormat#test_wordBased_pl_FormatOneField ArrayIndexOutOfBoundsException
  org.joda.time.format.TestPeriodFormat#test_wordBased_pl_cached ArrayIndexOutOfBoundsException
  org.joda.time.format.TestPeriodFormat#test_wordBased_pl_formatStandard ArrayIndexOutOfBoundsException
  org.joda.time.format.TestPeriodFormat#test_wordBased_pl_formatTwoFields ArrayIndexOutOfBoundsException
  org.joda.time.format.TestPeriodFormat#test_wordBased_pl_from_fr ArrayIndexOutOfBoundsException
  org.joda.time.format.TestPeriodFormat#test_wordBased_pl_parseOneField ArrayIndexOutOfBoundsException
  org.joda.time.format.TestPeriodFormat#test_wordBased_pl_parseTwoFields ArrayIndexOutOfBoundsException
  org.joda.time.format.TestPeriodFormat#test_wordBased_pl_regEx ArrayIndexOutOfBoundsException
  org.joda.time.format.TestPeriodFormat#test_wordBased_pt_FormatOneField ArrayIndexOutOfBoundsException
  org.joda.time.format.TestPeriodFormat#test_wordBased_pt_cached ArrayIndexOutOfBoundsException
  org.joda.time.format.TestPeriodFormat#test_wordBased_pt_formatStandard ArrayIndexOutOfBoundsException
  org.joda.time.format.TestPeriodFormat#test_wordBased_pt_formatTwoFields ArrayIndexOutOfBoundsException
  org.joda.time.format.TestPeriodFormat#test_wordBased_pt_parseOneField ArrayIndexOutOfBoundsException
  org.joda.time.format.TestPeriodFormat#test_wordBased_pt_parseTwoFields ArrayIndexOutOfBoundsException
  org.joda.time.format.TestPeriodFormatParsing#testParseStandard1 ArrayIndexOutOfBoundsException

Tests run: 4157, Failures: 3, Errors: 64, Skipped: 0

[INFO] ------------------------------------------------------------------------
[INFO] BUILD FAILURE
[INFO] ------------------------------------------------------------------------
[INFO] Total time: 15.723s
[INFO] Finished at: Thu Aug 06 10:19:13 BST 2015
[INFO] Final Memory: 10M/343M
[INFO] ------------------------------------------------------------------------
[ERROR] Failed to execute goal org.apache.maven.plugins:maven-surefire-plugin:2.18.1:test (default-test) on project joda-time: There are test failures.
[ERROR] 
[ERROR] Please refer to /home/perham/Study/LittleDarwin/Cases/joda-time-2.8.1/target/surefire-reports for the individual test results.
[ERROR] -> [Help 1]
[ERROR] 
[ERROR] To see the full stack trace of the errors, re-run Maven with the -e switch.
[ERROR] Re-run Maven using the -X switch to enable full debug logging.
[ERROR] 
[ERROR] For more information about the errors and possible solutions, please read the following articles:
[ERROR] [Help 1] http://cwiki.apache.org/confluence/display/MAVEN/MojoFailureException
