[INFO] Scanning for projects...
[INFO]                                                                         
[INFO] ------------------------------------------------------------------------
[INFO] Building Joda-Time 2.8.1
[INFO] ------------------------------------------------------------------------
[INFO] 
[INFO] --- maven-resources-plugin:2.7:resources (default-resources) @ joda-time ---
[INFO] Using 'UTF-8' encoding to copy filtered resources.
[INFO] Copying 2 resources to META-INF
[INFO] Copying 10 resources
[INFO] 
[INFO] --- maven-compiler-plugin:3.3:compile (default-compile) @ joda-time ---
[INFO] Changes detected - recompiling the module!
[INFO] Compiling 166 source files to /home/perham/Study/LittleDarwin/Cases/joda-time-2.8.1/target/classes
[INFO] 
[INFO] --- exec-maven-plugin:1.4.0:java (compile-tzdb) @ joda-time ---
Writing zoneinfo files
Writing ZoneInfoMap
[INFO] 
[INFO] --- maven-resources-plugin:2.7:testResources (default-testResources) @ joda-time ---
[INFO] Using 'UTF-8' encoding to copy filtered resources.
[INFO] Copying 34 resources
[INFO] 
[INFO] --- maven-compiler-plugin:3.3:testCompile (default-testCompile) @ joda-time ---
[INFO] Nothing to compile - all classes are up to date
[INFO] 
[INFO] --- maven-surefire-plugin:2.18.1:test (default-test) @ joda-time ---
[INFO] Surefire report directory: /home/perham/Study/LittleDarwin/Cases/joda-time-2.8.1/target/surefire-reports

-------------------------------------------------------
 T E S T S
-------------------------------------------------------
Running org.joda.time.TestAllPackages

TestBuddhistChronology.testCalendar

TestCopticChronology.testCalendar

TestEthiopicChronology.testCalendar

TestIslamicChronology.testCalendar

Testing Gregorian chronology over 1000 iterations
100% complete (i=1000)

Testing Julian chronology over 1000 iterations
100% complete (i=1000)
Writing zoneinfo files
Writing ZoneInfoMap
Tests run: 4157, Failures: 2, Errors: 42, Skipped: 0, Time elapsed: 5.349 sec <<< FAILURE! - in org.joda.time.TestAllPackages
testConstructor_Object1(org.joda.time.TestPeriod_Constructors)  Time elapsed: 0.005 sec  <<< ERROR!
java.lang.ArrayIndexOutOfBoundsException: -1
	at org.joda.time.format.PeriodFormatterBuilder$Separator.parseInto(PeriodFormatterBuilder.java:601)
	at org.joda.time.format.PeriodFormatter.parseInto(PeriodFormatter.java:295)
	at org.joda.time.convert.StringConverter.setInto(StringConverter.java:165)
	at org.joda.time.base.BasePeriod.<init>(BasePeriod.java:279)
	at org.joda.time.MutablePeriod.<init>(MutablePeriod.java:426)
	at org.joda.time.base.BasePeriod.<init>(BasePeriod.java:281)
	at org.joda.time.Period.<init>(Period.java:674)
	at org.joda.time.TestPeriod_Constructors.testConstructor_Object1(TestPeriod_Constructors.java:1145)

testConstructor_Object_PeriodType1(org.joda.time.TestPeriod_Constructors)  Time elapsed: 0.001 sec  <<< ERROR!
java.lang.ArrayIndexOutOfBoundsException: -1
	at org.joda.time.format.PeriodFormatterBuilder$Separator.parseInto(PeriodFormatterBuilder.java:601)
	at org.joda.time.format.PeriodFormatter.parseInto(PeriodFormatter.java:295)
	at org.joda.time.convert.StringConverter.setInto(StringConverter.java:165)
	at org.joda.time.base.BasePeriod.<init>(BasePeriod.java:279)
	at org.joda.time.MutablePeriod.<init>(MutablePeriod.java:426)
	at org.joda.time.base.BasePeriod.<init>(BasePeriod.java:281)
	at org.joda.time.Period.<init>(Period.java:691)
	at org.joda.time.TestPeriod_Constructors.testConstructor_Object_PeriodType1(TestPeriod_Constructors.java:1202)

testConstructor_Object1(org.joda.time.TestMutablePeriod_Constructors)  Time elapsed: 0 sec  <<< ERROR!
java.lang.ArrayIndexOutOfBoundsException: -1
	at org.joda.time.format.PeriodFormatterBuilder$Separator.parseInto(PeriodFormatterBuilder.java:601)
	at org.joda.time.format.PeriodFormatter.parseInto(PeriodFormatter.java:295)
	at org.joda.time.convert.StringConverter.setInto(StringConverter.java:165)
	at org.joda.time.base.BasePeriod.<init>(BasePeriod.java:279)
	at org.joda.time.MutablePeriod.<init>(MutablePeriod.java:374)
	at org.joda.time.TestMutablePeriod_Constructors.testConstructor_Object1(TestMutablePeriod_Constructors.java:827)

testConstructor_Object_PeriodType1(org.joda.time.TestMutablePeriod_Constructors)  Time elapsed: 0.001 sec  <<< ERROR!
java.lang.ArrayIndexOutOfBoundsException: -1
	at org.joda.time.format.PeriodFormatterBuilder$Separator.parseInto(PeriodFormatterBuilder.java:601)
	at org.joda.time.format.PeriodFormatter.parseInto(PeriodFormatter.java:295)
	at org.joda.time.convert.StringConverter.setInto(StringConverter.java:165)
	at org.joda.time.base.BasePeriod.<init>(BasePeriod.java:279)
	at org.joda.time.MutablePeriod.<init>(MutablePeriod.java:391)
	at org.joda.time.TestMutablePeriod_Constructors.testConstructor_Object_PeriodType1(TestMutablePeriod_Constructors.java:884)

testFactory_parseYears_String(org.joda.time.TestYears)  Time elapsed: 0.001 sec  <<< ERROR!
java.lang.ArrayIndexOutOfBoundsException: -1
	at org.joda.time.format.PeriodFormatterBuilder$Separator.parseInto(PeriodFormatterBuilder.java:601)
	at org.joda.time.format.PeriodFormatter.parseMutablePeriod(PeriodFormatter.java:322)
	at org.joda.time.format.PeriodFormatter.parsePeriod(PeriodFormatter.java:308)
	at org.joda.time.Years.parseYears(Years.java:162)
	at org.joda.time.TestYears.testFactory_parseYears_String(TestYears.java:116)

testFactory_parseMonths_String(org.joda.time.TestMonths)  Time elapsed: 0 sec  <<< ERROR!
java.lang.ArrayIndexOutOfBoundsException: -1
	at org.joda.time.format.PeriodFormatterBuilder$Separator.parseInto(PeriodFormatterBuilder.java:601)
	at org.joda.time.format.PeriodFormatter.parseMutablePeriod(PeriodFormatter.java:322)
	at org.joda.time.format.PeriodFormatter.parsePeriod(PeriodFormatter.java:308)
	at org.joda.time.Months.parseMonths(Months.java:198)
	at org.joda.time.TestMonths.testFactory_parseMonths_String(TestMonths.java:161)

testFactory_parseWeeks_String(org.joda.time.TestWeeks)  Time elapsed: 0 sec  <<< ERROR!
java.lang.ArrayIndexOutOfBoundsException: -1
	at org.joda.time.format.PeriodFormatterBuilder$Separator.parseInto(PeriodFormatterBuilder.java:601)
	at org.joda.time.format.PeriodFormatter.parseMutablePeriod(PeriodFormatter.java:322)
	at org.joda.time.format.PeriodFormatter.parsePeriod(PeriodFormatter.java:308)
	at org.joda.time.Weeks.parseWeeks(Weeks.java:185)
	at org.joda.time.TestWeeks.testFactory_parseWeeks_String(TestWeeks.java:133)

testFactory_parseDays_String(org.joda.time.TestDays)  Time elapsed: 0.001 sec  <<< ERROR!
java.lang.ArrayIndexOutOfBoundsException: -1
	at org.joda.time.format.PeriodFormatterBuilder$Separator.parseInto(PeriodFormatterBuilder.java:601)
	at org.joda.time.format.PeriodFormatter.parseMutablePeriod(PeriodFormatter.java:322)
	at org.joda.time.format.PeriodFormatter.parsePeriod(PeriodFormatter.java:308)
	at org.joda.time.Days.parseDays(Days.java:203)
	at org.joda.time.TestDays.testFactory_parseDays_String(TestDays.java:175)

testYears(org.joda.time.TestStringConvert)  Time elapsed: 0.001 sec  <<< ERROR!
java.lang.ArrayIndexOutOfBoundsException: -1
	at org.joda.time.format.PeriodFormatterBuilder$Separator.parseInto(PeriodFormatterBuilder.java:601)
	at org.joda.time.format.PeriodFormatter.parseMutablePeriod(PeriodFormatter.java:322)
	at org.joda.time.format.PeriodFormatter.parsePeriod(PeriodFormatter.java:308)
	at org.joda.time.Years.parseYears(Years.java:162)
	at sun.reflect.NativeMethodAccessorImpl.invoke0(Native Method)
	at sun.reflect.NativeMethodAccessorImpl.invoke(NativeMethodAccessorImpl.java:57)
	at sun.reflect.DelegatingMethodAccessorImpl.invoke(DelegatingMethodAccessorImpl.java:43)
	at java.lang.reflect.Method.invoke(Method.java:606)
	at org.joda.convert.MethodsStringConverter.convertFromString(MethodsStringConverter.java:70)
	at org.joda.convert.StringConvert.convertFromString(StringConvert.java:163)
	at org.joda.time.TestStringConvert.testYears(TestStringConvert.java:158)

testMonths(org.joda.time.TestStringConvert)  Time elapsed: 0.001 sec  <<< ERROR!
java.lang.ArrayIndexOutOfBoundsException: -1
	at org.joda.time.format.PeriodFormatterBuilder$Separator.parseInto(PeriodFormatterBuilder.java:601)
	at org.joda.time.format.PeriodFormatter.parseMutablePeriod(PeriodFormatter.java:322)
	at org.joda.time.format.PeriodFormatter.parsePeriod(PeriodFormatter.java:308)
	at org.joda.time.Months.parseMonths(Months.java:198)
	at sun.reflect.NativeMethodAccessorImpl.invoke0(Native Method)
	at sun.reflect.NativeMethodAccessorImpl.invoke(NativeMethodAccessorImpl.java:57)
	at sun.reflect.DelegatingMethodAccessorImpl.invoke(DelegatingMethodAccessorImpl.java:43)
	at java.lang.reflect.Method.invoke(Method.java:606)
	at org.joda.convert.MethodsStringConverter.convertFromString(MethodsStringConverter.java:70)
	at org.joda.convert.StringConvert.convertFromString(StringConvert.java:163)
	at org.joda.time.TestStringConvert.testMonths(TestStringConvert.java:165)

testWeeks(org.joda.time.TestStringConvert)  Time elapsed: 0.001 sec  <<< ERROR!
java.lang.ArrayIndexOutOfBoundsException: -1
	at org.joda.time.format.PeriodFormatterBuilder$Separator.parseInto(PeriodFormatterBuilder.java:601)
	at org.joda.time.format.PeriodFormatter.parseMutablePeriod(PeriodFormatter.java:322)
	at org.joda.time.format.PeriodFormatter.parsePeriod(PeriodFormatter.java:308)
	at org.joda.time.Weeks.parseWeeks(Weeks.java:185)
	at sun.reflect.NativeMethodAccessorImpl.invoke0(Native Method)
	at sun.reflect.NativeMethodAccessorImpl.invoke(NativeMethodAccessorImpl.java:57)
	at sun.reflect.DelegatingMethodAccessorImpl.invoke(DelegatingMethodAccessorImpl.java:43)
	at java.lang.reflect.Method.invoke(Method.java:606)
	at org.joda.convert.MethodsStringConverter.convertFromString(MethodsStringConverter.java:70)
	at org.joda.convert.StringConvert.convertFromString(StringConvert.java:163)
	at org.joda.time.TestStringConvert.testWeeks(TestStringConvert.java:172)

testDays(org.joda.time.TestStringConvert)  Time elapsed: 0 sec  <<< ERROR!
java.lang.ArrayIndexOutOfBoundsException: -1
	at org.joda.time.format.PeriodFormatterBuilder$Separator.parseInto(PeriodFormatterBuilder.java:601)
	at org.joda.time.format.PeriodFormatter.parseMutablePeriod(PeriodFormatter.java:322)
	at org.joda.time.format.PeriodFormatter.parsePeriod(PeriodFormatter.java:308)
	at org.joda.time.Days.parseDays(Days.java:203)
	at sun.reflect.NativeMethodAccessorImpl.invoke0(Native Method)
	at sun.reflect.NativeMethodAccessorImpl.invoke(NativeMethodAccessorImpl.java:57)
	at sun.reflect.DelegatingMethodAccessorImpl.invoke(DelegatingMethodAccessorImpl.java:43)
	at java.lang.reflect.Method.invoke(Method.java:606)
	at org.joda.convert.MethodsStringConverter.convertFromString(MethodsStringConverter.java:70)
	at org.joda.convert.StringConvert.convertFromString(StringConvert.java:163)
	at org.joda.time.TestStringConvert.testDays(TestStringConvert.java:179)

testSetIntoPeriod_Object7(org.joda.time.convert.TestStringConverter)  Time elapsed: 0 sec  <<< ERROR!
java.lang.ArrayIndexOutOfBoundsException: -1
	at org.joda.time.format.PeriodFormatterBuilder$Separator.parseInto(PeriodFormatterBuilder.java:601)
	at org.joda.time.format.PeriodFormatter.parseInto(PeriodFormatter.java:295)
	at org.joda.time.convert.StringConverter.setInto(StringConverter.java:165)
	at org.joda.time.convert.TestStringConverter.testSetIntoPeriod_Object7(TestStringConverter.java:437)

testSetIntoPeriod_Object8(org.joda.time.convert.TestStringConverter)  Time elapsed: 0 sec  <<< ERROR!
java.lang.ArrayIndexOutOfBoundsException: -1
	at org.joda.time.format.PeriodFormatterBuilder$Separator.parseInto(PeriodFormatterBuilder.java:601)
	at org.joda.time.format.PeriodFormatter.parseInto(PeriodFormatter.java:295)
	at org.joda.time.convert.StringConverter.setInto(StringConverter.java:165)
	at org.joda.time.convert.TestStringConverter.testSetIntoPeriod_Object8(TestStringConverter.java:455)

testSetIntoInterval_Object_Chronology1(org.joda.time.convert.TestStringConverter)  Time elapsed: 0 sec  <<< ERROR!
java.lang.ArrayIndexOutOfBoundsException: -1
	at org.joda.time.format.PeriodFormatterBuilder$Separator.parseInto(PeriodFormatterBuilder.java:601)
	at org.joda.time.format.PeriodFormatter.parseMutablePeriod(PeriodFormatter.java:322)
	at org.joda.time.format.PeriodFormatter.parsePeriod(PeriodFormatter.java:308)
	at org.joda.time.convert.StringConverter.setInto(StringConverter.java:223)
	at org.joda.time.convert.TestStringConverter.testSetIntoInterval_Object_Chronology1(TestStringConverter.java:476)

testSetIntoInterval_Object_Chronology2(org.joda.time.convert.TestStringConverter)  Time elapsed: 0.001 sec  <<< ERROR!
java.lang.ArrayIndexOutOfBoundsException: -1
	at org.joda.time.format.PeriodFormatterBuilder$Separator.parseInto(PeriodFormatterBuilder.java:601)
	at org.joda.time.format.PeriodFormatter.parseMutablePeriod(PeriodFormatter.java:322)
	at org.joda.time.format.PeriodFormatter.parsePeriod(PeriodFormatter.java:308)
	at org.joda.time.convert.StringConverter.setInto(StringConverter.java:210)
	at org.joda.time.convert.TestStringConverter.testSetIntoInterval_Object_Chronology2(TestStringConverter.java:484)

testSetIntoInterval_Object_Chronology4(org.joda.time.convert.TestStringConverter)  Time elapsed: 0 sec  <<< ERROR!
java.lang.ArrayIndexOutOfBoundsException: -1
	at org.joda.time.format.PeriodFormatterBuilder$Separator.parseInto(PeriodFormatterBuilder.java:601)
	at org.joda.time.format.PeriodFormatter.parseMutablePeriod(PeriodFormatter.java:322)
	at org.joda.time.format.PeriodFormatter.parsePeriod(PeriodFormatter.java:308)
	at org.joda.time.convert.StringConverter.setInto(StringConverter.java:223)
	at org.joda.time.convert.TestStringConverter.testSetIntoInterval_Object_Chronology4(TestStringConverter.java:500)

testSetIntoInterval_Object_Chronology5(org.joda.time.convert.TestStringConverter)  Time elapsed: 0.001 sec  <<< ERROR!
java.lang.ArrayIndexOutOfBoundsException: -1
	at org.joda.time.format.PeriodFormatterBuilder$Separator.parseInto(PeriodFormatterBuilder.java:601)
	at org.joda.time.format.PeriodFormatter.parseMutablePeriod(PeriodFormatter.java:322)
	at org.joda.time.format.PeriodFormatter.parsePeriod(PeriodFormatter.java:308)
	at org.joda.time.convert.StringConverter.setInto(StringConverter.java:210)
	at org.joda.time.convert.TestStringConverter.testSetIntoInterval_Object_Chronology5(TestStringConverter.java:508)

testSetIntoIntervalEx_Object_Chronology5(org.joda.time.convert.TestStringConverter)  Time elapsed: 0.001 sec  <<< ERROR!
java.lang.ArrayIndexOutOfBoundsException: -1
	at org.joda.time.format.PeriodFormatterBuilder$Separator.parseInto(PeriodFormatterBuilder.java:601)
	at org.joda.time.format.PeriodFormatter.parseMutablePeriod(PeriodFormatter.java:322)
	at org.joda.time.format.PeriodFormatter.parsePeriod(PeriodFormatter.java:308)
	at org.joda.time.convert.StringConverter.setInto(StringConverter.java:210)
	at org.joda.time.convert.TestStringConverter.testSetIntoIntervalEx_Object_Chronology5(TestStringConverter.java:573)

test_wordBased_pl_parseOneField(org.joda.time.format.TestPeriodFormat)  Time elapsed: 0 sec  <<< ERROR!
java.lang.ArrayIndexOutOfBoundsException: -1
	at org.joda.time.format.PeriodFormatterBuilder$Separator.parseInto(PeriodFormatterBuilder.java:601)
	at org.joda.time.format.PeriodFormatterBuilder$Separator.parseInto(PeriodFormatterBuilder.java:607)
	at org.joda.time.format.PeriodFormatterBuilder$Separator.parseInto(PeriodFormatterBuilder.java:607)
	at org.joda.time.format.PeriodFormatterBuilder$Separator.parseInto(PeriodFormatterBuilder.java:607)
	at org.joda.time.format.PeriodFormat$DynamicWordBased.parseInto(PeriodFormat.java:396)
	at org.joda.time.format.PeriodFormatter.parseMutablePeriod(PeriodFormatter.java:322)
	at org.joda.time.format.PeriodFormatter.parsePeriod(PeriodFormatter.java:308)
	at org.joda.time.format.TestPeriodFormat.test_wordBased_pl_parseOneField(TestPeriodFormat.java:398)

test_wordBased_pl_parseTwoFields(org.joda.time.format.TestPeriodFormat)  Time elapsed: 0.001 sec  <<< ERROR!
java.lang.ArrayIndexOutOfBoundsException: -1
	at org.joda.time.format.PeriodFormatterBuilder$Separator.parseInto(PeriodFormatterBuilder.java:601)
	at org.joda.time.format.PeriodFormatterBuilder$Separator.parseInto(PeriodFormatterBuilder.java:607)
	at org.joda.time.format.PeriodFormatterBuilder$Separator.parseInto(PeriodFormatterBuilder.java:607)
	at org.joda.time.format.PeriodFormatterBuilder$Separator.parseInto(PeriodFormatterBuilder.java:607)
	at org.joda.time.format.PeriodFormat$DynamicWordBased.parseInto(PeriodFormat.java:396)
	at org.joda.time.format.PeriodFormatter.parseMutablePeriod(PeriodFormatter.java:322)
	at org.joda.time.format.PeriodFormatter.parsePeriod(PeriodFormatter.java:308)
	at org.joda.time.format.TestPeriodFormat.test_wordBased_pl_parseTwoFields(TestPeriodFormat.java:404)

test_wordBased_pl_checkRedundantSeparator(org.joda.time.format.TestPeriodFormat)  Time elapsed: 0 sec  <<< FAILURE!
junit.framework.AssertionFailedError: expected:<class java.lang.IllegalArgumentException> but was:<class java.lang.ArrayIndexOutOfBoundsException>
	at junit.framework.Assert.fail(Assert.java:47)
	at junit.framework.Assert.failNotEquals(Assert.java:280)
	at junit.framework.Assert.assertEquals(Assert.java:64)
	at junit.framework.Assert.assertEquals(Assert.java:71)
	at org.joda.time.format.TestPeriodFormat.test_wordBased_pl_checkRedundantSeparator(TestPeriodFormat.java:413)

test_wordBased_en_withLocale_pt(org.joda.time.format.TestPeriodFormat)  Time elapsed: 0.001 sec  <<< ERROR!
java.lang.ArrayIndexOutOfBoundsException: -1
	at org.joda.time.format.PeriodFormatterBuilder$Separator.parseInto(PeriodFormatterBuilder.java:601)
	at org.joda.time.format.PeriodFormatterBuilder$Separator.parseInto(PeriodFormatterBuilder.java:607)
	at org.joda.time.format.PeriodFormatterBuilder$Separator.parseInto(PeriodFormatterBuilder.java:607)
	at org.joda.time.format.PeriodFormatterBuilder$Separator.parseInto(PeriodFormatterBuilder.java:607)
	at org.joda.time.format.PeriodFormat$DynamicWordBased.parseInto(PeriodFormat.java:396)
	at org.joda.time.format.PeriodFormatter.parseMutablePeriod(PeriodFormatter.java:322)
	at org.joda.time.format.PeriodFormatter.parsePeriod(PeriodFormatter.java:308)
	at org.joda.time.format.TestPeriodFormat.test_wordBased_en_withLocale_pt(TestPeriodFormat.java:634)

test_getDefault_parseOneField(org.joda.time.format.TestPeriodFormat)  Time elapsed: 0 sec  <<< ERROR!
java.lang.ArrayIndexOutOfBoundsException: -1
	at org.joda.time.format.PeriodFormatterBuilder$Separator.parseInto(PeriodFormatterBuilder.java:601)
	at org.joda.time.format.PeriodFormatterBuilder$Separator.parseInto(PeriodFormatterBuilder.java:607)
	at org.joda.time.format.PeriodFormatterBuilder$Separator.parseInto(PeriodFormatterBuilder.java:607)
	at org.joda.time.format.PeriodFormatterBuilder$Separator.parseInto(PeriodFormatterBuilder.java:607)
	at org.joda.time.format.PeriodFormat$DynamicWordBased.parseInto(PeriodFormat.java:396)
	at org.joda.time.format.PeriodFormatter.parseMutablePeriod(PeriodFormatter.java:322)
	at org.joda.time.format.PeriodFormatter.parsePeriod(PeriodFormatter.java:308)
	at org.joda.time.format.TestPeriodFormat.test_getDefault_parseOneField(TestPeriodFormat.java:97)

test_getDefault_parseTwoFields(org.joda.time.format.TestPeriodFormat)  Time elapsed: 0.001 sec  <<< ERROR!
java.lang.ArrayIndexOutOfBoundsException: -1
	at org.joda.time.format.PeriodFormatterBuilder$Separator.parseInto(PeriodFormatterBuilder.java:601)
	at org.joda.time.format.PeriodFormatterBuilder$Separator.parseInto(PeriodFormatterBuilder.java:607)
	at org.joda.time.format.PeriodFormatterBuilder$Separator.parseInto(PeriodFormatterBuilder.java:607)
	at org.joda.time.format.PeriodFormatterBuilder$Separator.parseInto(PeriodFormatterBuilder.java:607)
	at org.joda.time.format.PeriodFormat$DynamicWordBased.parseInto(PeriodFormat.java:396)
	at org.joda.time.format.PeriodFormatter.parseMutablePeriod(PeriodFormatter.java:322)
	at org.joda.time.format.PeriodFormatter.parsePeriod(PeriodFormatter.java:308)
	at org.joda.time.format.TestPeriodFormat.test_getDefault_parseTwoFields(TestPeriodFormat.java:103)

test_getDefault_checkRedundantSeparator(org.joda.time.format.TestPeriodFormat)  Time elapsed: 0.001 sec  <<< FAILURE!
junit.framework.AssertionFailedError: expected:<class java.lang.IllegalArgumentException> but was:<class java.lang.ArrayIndexOutOfBoundsException>
	at junit.framework.Assert.fail(Assert.java:47)
	at junit.framework.Assert.failNotEquals(Assert.java:280)
	at junit.framework.Assert.assertEquals(Assert.java:64)
	at junit.framework.Assert.assertEquals(Assert.java:71)
	at org.joda.time.format.TestPeriodFormat.test_getDefault_checkRedundantSeparator(TestPeriodFormat.java:112)

test_wordBased_fr_parseOneField(org.joda.time.format.TestPeriodFormat)  Time elapsed: 0 sec  <<< ERROR!
java.lang.ArrayIndexOutOfBoundsException: -1
	at org.joda.time.format.PeriodFormatterBuilder$Separator.parseInto(PeriodFormatterBuilder.java:601)
	at org.joda.time.format.PeriodFormatterBuilder$Separator.parseInto(PeriodFormatterBuilder.java:607)
	at org.joda.time.format.PeriodFormatterBuilder$Separator.parseInto(PeriodFormatterBuilder.java:607)
	at org.joda.time.format.PeriodFormatterBuilder$Separator.parseInto(PeriodFormatterBuilder.java:607)
	at org.joda.time.format.PeriodFormat$DynamicWordBased.parseInto(PeriodFormat.java:396)
	at org.joda.time.format.PeriodFormatter.parseMutablePeriod(PeriodFormatter.java:322)
	at org.joda.time.format.PeriodFormatter.parsePeriod(PeriodFormatter.java:308)
	at org.joda.time.format.TestPeriodFormat.test_wordBased_fr_parseOneField(TestPeriodFormat.java:152)

test_wordBased_fr_parseTwoFields(org.joda.time.format.TestPeriodFormat)  Time elapsed: 0.001 sec  <<< ERROR!
java.lang.ArrayIndexOutOfBoundsException: -1
	at org.joda.time.format.PeriodFormatterBuilder$Separator.parseInto(PeriodFormatterBuilder.java:601)
	at org.joda.time.format.PeriodFormatterBuilder$Separator.parseInto(PeriodFormatterBuilder.java:607)
	at org.joda.time.format.PeriodFormatterBuilder$Separator.parseInto(PeriodFormatterBuilder.java:607)
	at org.joda.time.format.PeriodFormatterBuilder$Separator.parseInto(PeriodFormatterBuilder.java:607)
	at org.joda.time.format.PeriodFormat$DynamicWordBased.parseInto(PeriodFormat.java:396)
	at org.joda.time.format.PeriodFormatter.parseMutablePeriod(PeriodFormatter.java:322)
	at org.joda.time.format.PeriodFormatter.parsePeriod(PeriodFormatter.java:308)
	at org.joda.time.format.TestPeriodFormat.test_wordBased_fr_parseTwoFields(TestPeriodFormat.java:158)

test_wordBased_pt_parseOneField(org.joda.time.format.TestPeriodFormat)  Time elapsed: 0.001 sec  <<< ERROR!
java.lang.ArrayIndexOutOfBoundsException: -1
	at org.joda.time.format.PeriodFormatterBuilder$Separator.parseInto(PeriodFormatterBuilder.java:601)
	at org.joda.time.format.PeriodFormatterBuilder$Separator.parseInto(PeriodFormatterBuilder.java:607)
	at org.joda.time.format.PeriodFormatterBuilder$Separator.parseInto(PeriodFormatterBuilder.java:607)
	at org.joda.time.format.PeriodFormatterBuilder$Separator.parseInto(PeriodFormatterBuilder.java:607)
	at org.joda.time.format.PeriodFormat$DynamicWordBased.parseInto(PeriodFormat.java:396)
	at org.joda.time.format.PeriodFormatter.parseMutablePeriod(PeriodFormatter.java:322)
	at org.joda.time.format.PeriodFormatter.parsePeriod(PeriodFormatter.java:308)
	at org.joda.time.format.TestPeriodFormat.test_wordBased_pt_parseOneField(TestPeriodFormat.java:189)

test_wordBased_pt_parseTwoFields(org.joda.time.format.TestPeriodFormat)  Time elapsed: 0 sec  <<< ERROR!
java.lang.ArrayIndexOutOfBoundsException: -1
	at org.joda.time.format.PeriodFormatterBuilder$Separator.parseInto(PeriodFormatterBuilder.java:601)
	at org.joda.time.format.PeriodFormatterBuilder$Separator.parseInto(PeriodFormatterBuilder.java:607)
	at org.joda.time.format.PeriodFormatterBuilder$Separator.parseInto(PeriodFormatterBuilder.java:607)
	at org.joda.time.format.PeriodFormatterBuilder$Separator.parseInto(PeriodFormatterBuilder.java:607)
	at org.joda.time.format.PeriodFormat$DynamicWordBased.parseInto(PeriodFormat.java:396)
	at org.joda.time.format.PeriodFormatter.parseMutablePeriod(PeriodFormatter.java:322)
	at org.joda.time.format.PeriodFormatter.parsePeriod(PeriodFormatter.java:308)
	at org.joda.time.format.TestPeriodFormat.test_wordBased_pt_parseTwoFields(TestPeriodFormat.java:195)

test_wordBased_es_parseOneField(org.joda.time.format.TestPeriodFormat)  Time elapsed: 0.001 sec  <<< ERROR!
java.lang.ArrayIndexOutOfBoundsException: -1
	at org.joda.time.format.PeriodFormatterBuilder$Separator.parseInto(PeriodFormatterBuilder.java:601)
	at org.joda.time.format.PeriodFormatterBuilder$Separator.parseInto(PeriodFormatterBuilder.java:607)
	at org.joda.time.format.PeriodFormatterBuilder$Separator.parseInto(PeriodFormatterBuilder.java:607)
	at org.joda.time.format.PeriodFormatterBuilder$Separator.parseInto(PeriodFormatterBuilder.java:607)
	at org.joda.time.format.PeriodFormat$DynamicWordBased.parseInto(PeriodFormat.java:396)
	at org.joda.time.format.PeriodFormatter.parseMutablePeriod(PeriodFormatter.java:322)
	at org.joda.time.format.PeriodFormatter.parsePeriod(PeriodFormatter.java:308)
	at org.joda.time.format.TestPeriodFormat.test_wordBased_es_parseOneField(TestPeriodFormat.java:226)

test_wordBased_es_parseTwoFields(org.joda.time.format.TestPeriodFormat)  Time elapsed: 0 sec  <<< ERROR!
java.lang.ArrayIndexOutOfBoundsException: -1
	at org.joda.time.format.PeriodFormatterBuilder$Separator.parseInto(PeriodFormatterBuilder.java:601)
	at org.joda.time.format.PeriodFormatterBuilder$Separator.parseInto(PeriodFormatterBuilder.java:607)
	at org.joda.time.format.PeriodFormatterBuilder$Separator.parseInto(PeriodFormatterBuilder.java:607)
	at org.joda.time.format.PeriodFormatterBuilder$Separator.parseInto(PeriodFormatterBuilder.java:607)
	at org.joda.time.format.PeriodFormat$DynamicWordBased.parseInto(PeriodFormat.java:396)
	at org.joda.time.format.PeriodFormatter.parseMutablePeriod(PeriodFormatter.java:322)
	at org.joda.time.format.PeriodFormatter.parsePeriod(PeriodFormatter.java:308)
	at org.joda.time.format.TestPeriodFormat.test_wordBased_es_parseTwoFields(TestPeriodFormat.java:232)

test_wordBased_de_parseOneField(org.joda.time.format.TestPeriodFormat)  Time elapsed: 0 sec  <<< ERROR!
java.lang.ArrayIndexOutOfBoundsException: -1
	at org.joda.time.format.PeriodFormatterBuilder$Separator.parseInto(PeriodFormatterBuilder.java:601)
	at org.joda.time.format.PeriodFormatterBuilder$Separator.parseInto(PeriodFormatterBuilder.java:607)
	at org.joda.time.format.PeriodFormatterBuilder$Separator.parseInto(PeriodFormatterBuilder.java:607)
	at org.joda.time.format.PeriodFormatterBuilder$Separator.parseInto(PeriodFormatterBuilder.java:607)
	at org.joda.time.format.PeriodFormat$DynamicWordBased.parseInto(PeriodFormat.java:396)
	at org.joda.time.format.PeriodFormatter.parseMutablePeriod(PeriodFormatter.java:322)
	at org.joda.time.format.PeriodFormatter.parsePeriod(PeriodFormatter.java:308)
	at org.joda.time.format.TestPeriodFormat.test_wordBased_de_parseOneField(TestPeriodFormat.java:263)

test_wordBased_de_parseTwoFields(org.joda.time.format.TestPeriodFormat)  Time elapsed: 0.001 sec  <<< ERROR!
java.lang.ArrayIndexOutOfBoundsException: -1
	at org.joda.time.format.PeriodFormatterBuilder$Separator.parseInto(PeriodFormatterBuilder.java:601)
	at org.joda.time.format.PeriodFormatterBuilder$Separator.parseInto(PeriodFormatterBuilder.java:607)
	at org.joda.time.format.PeriodFormatterBuilder$Separator.parseInto(PeriodFormatterBuilder.java:607)
	at org.joda.time.format.PeriodFormatterBuilder$Separator.parseInto(PeriodFormatterBuilder.java:607)
	at org.joda.time.format.PeriodFormat$DynamicWordBased.parseInto(PeriodFormat.java:396)
	at org.joda.time.format.PeriodFormatter.parseMutablePeriod(PeriodFormatter.java:322)
	at org.joda.time.format.PeriodFormatter.parsePeriod(PeriodFormatter.java:308)
	at org.joda.time.format.TestPeriodFormat.test_wordBased_de_parseTwoFields(TestPeriodFormat.java:269)

test_wordBased_nl_parseOneField(org.joda.time.format.TestPeriodFormat)  Time elapsed: 0 sec  <<< ERROR!
java.lang.ArrayIndexOutOfBoundsException: -1
	at org.joda.time.format.PeriodFormatterBuilder$Separator.parseInto(PeriodFormatterBuilder.java:601)
	at org.joda.time.format.PeriodFormatterBuilder$Separator.parseInto(PeriodFormatterBuilder.java:607)
	at org.joda.time.format.PeriodFormatterBuilder$Separator.parseInto(PeriodFormatterBuilder.java:607)
	at org.joda.time.format.PeriodFormatterBuilder$Separator.parseInto(PeriodFormatterBuilder.java:607)
	at org.joda.time.format.PeriodFormat$DynamicWordBased.parseInto(PeriodFormat.java:396)
	at org.joda.time.format.PeriodFormatter.parseMutablePeriod(PeriodFormatter.java:322)
	at org.joda.time.format.PeriodFormatter.parsePeriod(PeriodFormatter.java:308)
	at org.joda.time.format.TestPeriodFormat.test_wordBased_nl_parseOneField(TestPeriodFormat.java:300)

test_wordBased_nl_parseTwoFields(org.joda.time.format.TestPeriodFormat)  Time elapsed: 0.001 sec  <<< ERROR!
java.lang.ArrayIndexOutOfBoundsException: -1
	at org.joda.time.format.PeriodFormatterBuilder$Separator.parseInto(PeriodFormatterBuilder.java:601)
	at org.joda.time.format.PeriodFormatterBuilder$Separator.parseInto(PeriodFormatterBuilder.java:607)
	at org.joda.time.format.PeriodFormatterBuilder$Separator.parseInto(PeriodFormatterBuilder.java:607)
	at org.joda.time.format.PeriodFormatterBuilder$Separator.parseInto(PeriodFormatterBuilder.java:607)
	at org.joda.time.format.PeriodFormat$DynamicWordBased.parseInto(PeriodFormat.java:396)
	at org.joda.time.format.PeriodFormatter.parseMutablePeriod(PeriodFormatter.java:322)
	at org.joda.time.format.PeriodFormatter.parsePeriod(PeriodFormatter.java:308)
	at org.joda.time.format.TestPeriodFormat.test_wordBased_nl_parseTwoFields(TestPeriodFormat.java:306)

testParseStandard7(org.joda.time.format.TestISOPeriodFormatParsing)  Time elapsed: 0.001 sec  <<< ERROR!
java.lang.ArrayIndexOutOfBoundsException: -1
	at org.joda.time.format.PeriodFormatterBuilder$Separator.parseInto(PeriodFormatterBuilder.java:601)
	at org.joda.time.format.PeriodFormatter.parseMutablePeriod(PeriodFormatter.java:322)
	at org.joda.time.format.PeriodFormatter.parsePeriod(PeriodFormatter.java:308)
	at org.joda.time.format.TestISOPeriodFormatParsing.testParseStandard7(TestISOPeriodFormatParsing.java:136)

testParseStandard10(org.joda.time.format.TestISOPeriodFormatParsing)  Time elapsed: 0.001 sec  <<< ERROR!
java.lang.ArrayIndexOutOfBoundsException: -1
	at org.joda.time.format.PeriodFormatterBuilder$Separator.parseInto(PeriodFormatterBuilder.java:601)
	at org.joda.time.format.PeriodFormatter.parseMutablePeriod(PeriodFormatter.java:322)
	at org.joda.time.format.PeriodFormatter.parsePeriod(PeriodFormatter.java:308)
	at org.joda.time.format.TestISOPeriodFormatParsing.testParseStandard10(TestISOPeriodFormatParsing.java:157)

testParseStandard11(org.joda.time.format.TestISOPeriodFormatParsing)  Time elapsed: 0 sec  <<< ERROR!
java.lang.ArrayIndexOutOfBoundsException: -1
	at org.joda.time.format.PeriodFormatterBuilder$Separator.parseInto(PeriodFormatterBuilder.java:601)
	at org.joda.time.format.PeriodFormatter.parseMutablePeriod(PeriodFormatter.java:322)
	at org.joda.time.format.PeriodFormatter.parsePeriod(PeriodFormatter.java:308)
	at org.joda.time.format.TestISOPeriodFormatParsing.testParseStandard11(TestISOPeriodFormatParsing.java:164)

testParseStandardFail1(org.joda.time.format.TestISOPeriodFormatParsing)  Time elapsed: 0 sec  <<< ERROR!
java.lang.ArrayIndexOutOfBoundsException: -1
	at org.joda.time.format.PeriodFormatterBuilder$Separator.parseInto(PeriodFormatterBuilder.java:601)
	at org.joda.time.format.PeriodFormatter.parseMutablePeriod(PeriodFormatter.java:322)
	at org.joda.time.format.PeriodFormatter.parsePeriod(PeriodFormatter.java:308)
	at org.joda.time.format.TestISOPeriodFormatParsing.testParseStandardFail1(TestISOPeriodFormatParsing.java:172)

testParseStandardFail2(org.joda.time.format.TestISOPeriodFormatParsing)  Time elapsed: 0.001 sec  <<< ERROR!
java.lang.ArrayIndexOutOfBoundsException: -1
	at org.joda.time.format.PeriodFormatterBuilder$Separator.parseInto(PeriodFormatterBuilder.java:601)
	at org.joda.time.format.PeriodFormatter.parseMutablePeriod(PeriodFormatter.java:322)
	at org.joda.time.format.PeriodFormatter.parsePeriod(PeriodFormatter.java:308)
	at org.joda.time.format.TestISOPeriodFormatParsing.testParseStandardFail2(TestISOPeriodFormatParsing.java:181)

testParseStandardFail4(org.joda.time.format.TestISOPeriodFormatParsing)  Time elapsed: 0 sec  <<< ERROR!
java.lang.ArrayIndexOutOfBoundsException: -1
	at org.joda.time.format.PeriodFormatterBuilder$Separator.parseInto(PeriodFormatterBuilder.java:601)
	at org.joda.time.format.PeriodFormatter.parseMutablePeriod(PeriodFormatter.java:322)
	at org.joda.time.format.PeriodFormatter.parsePeriod(PeriodFormatter.java:308)
	at org.joda.time.format.TestISOPeriodFormatParsing.testParseStandardFail4(TestISOPeriodFormatParsing.java:199)

testParseStandard1(org.joda.time.format.TestPeriodFormatParsing)  Time elapsed: 0 sec  <<< ERROR!
java.lang.ArrayIndexOutOfBoundsException: -1
	at org.joda.time.format.PeriodFormatterBuilder$Separator.parseInto(PeriodFormatterBuilder.java:601)
	at org.joda.time.format.PeriodFormat$DynamicWordBased.parseInto(PeriodFormat.java:396)
	at org.joda.time.format.PeriodFormatter.parseMutablePeriod(PeriodFormatter.java:322)
	at org.joda.time.format.PeriodFormatter.parsePeriod(PeriodFormatter.java:308)
	at org.joda.time.format.TestPeriodFormatParsing.testParseStandard1(TestPeriodFormatParsing.java:94)

testMonthsAndMinutesAreConsideredSeparateAndCaseIsNotIgnored(org.joda.time.format.TestPeriodFormatterBuilder)  Time elapsed: 0.001 sec  <<< ERROR!
java.lang.ArrayIndexOutOfBoundsException: -1
	at org.joda.time.format.PeriodFormatterBuilder$Separator.parseInto(PeriodFormatterBuilder.java:601)
	at org.joda.time.format.PeriodFormatter.parseMutablePeriod(PeriodFormatter.java:322)
	at org.joda.time.format.PeriodFormatter.parsePeriod(PeriodFormatter.java:308)
	at org.joda.time.format.TestPeriodFormatterBuilder.testMonthsAndMinutesAreConsideredSeparateAndCaseIsNotIgnored(TestPeriodFormatterBuilder.java:1179)


Results :

Failed tests: 
  org.joda.time.format.TestPeriodFormat#test_getDefault_checkRedundantSeparator AssertionFailedError
  org.joda.time.format.TestPeriodFormat#test_wordBased_pl_checkRedundantSeparator AssertionFailedError
Tests in error: 
  org.joda.time.TestDays#testFactory_parseDays_String ArrayIndexOutOfBoundsException
  org.joda.time.TestMonths#testFactory_parseMonths_String ArrayIndexOutOfBoundsException
  org.joda.time.TestMutablePeriod_Constructors#testConstructor_Object1 ArrayIndexOutOfBoundsException
  org.joda.time.TestMutablePeriod_Constructors#testConstructor_Object_PeriodType1 ArrayIndexOutOfBoundsException
  org.joda.time.TestPeriod_Constructors#testConstructor_Object1 ArrayIndexOutOfBoundsException
  org.joda.time.TestPeriod_Constructors#testConstructor_Object_PeriodType1 ArrayIndexOutOfBoundsException
  org.joda.time.TestStringConvert#testDays ArrayIndexOutOfBoundsException -1
  org.joda.time.TestStringConvert#testMonths ArrayIndexOutOfBoundsException -1
  org.joda.time.TestStringConvert#testWeeks ArrayIndexOutOfBoundsException -1
  org.joda.time.TestStringConvert#testYears ArrayIndexOutOfBoundsException -1
  org.joda.time.TestWeeks#testFactory_parseWeeks_String ArrayIndexOutOfBoundsException
  org.joda.time.TestYears#testFactory_parseYears_String ArrayIndexOutOfBoundsException
  org.joda.time.convert.TestStringConverter#testSetIntoIntervalEx_Object_Chronology5 ArrayIndexOutOfBoundsException
  org.joda.time.convert.TestStringConverter#testSetIntoInterval_Object_Chronology1 ArrayIndexOutOfBoundsException
  org.joda.time.convert.TestStringConverter#testSetIntoInterval_Object_Chronology2 ArrayIndexOutOfBoundsException
  org.joda.time.convert.TestStringConverter#testSetIntoInterval_Object_Chronology4 ArrayIndexOutOfBoundsException
  org.joda.time.convert.TestStringConverter#testSetIntoInterval_Object_Chronology5 ArrayIndexOutOfBoundsException
  org.joda.time.convert.TestStringConverter#testSetIntoPeriod_Object7 ArrayIndexOutOfBoundsException
  org.joda.time.convert.TestStringConverter#testSetIntoPeriod_Object8 ArrayIndexOutOfBoundsException
  org.joda.time.format.TestISOPeriodFormatParsing#testParseStandard10 ArrayIndexOutOfBoundsException
  org.joda.time.format.TestISOPeriodFormatParsing#testParseStandard11 ArrayIndexOutOfBoundsException
  org.joda.time.format.TestISOPeriodFormatParsing#testParseStandard7 ArrayIndexOutOfBoundsException
  org.joda.time.format.TestISOPeriodFormatParsing#testParseStandardFail1 ArrayIndexOutOfBoundsException
  org.joda.time.format.TestISOPeriodFormatParsing#testParseStandardFail2 ArrayIndexOutOfBoundsException
  org.joda.time.format.TestISOPeriodFormatParsing#testParseStandardFail4 ArrayIndexOutOfBoundsException
  org.joda.time.format.TestPeriodFormat#test_getDefault_parseOneField ArrayIndexOutOfBoundsException
  org.joda.time.format.TestPeriodFormat#test_getDefault_parseTwoFields ArrayIndexOutOfBoundsException
  org.joda.time.format.TestPeriodFormat#test_wordBased_de_parseOneField ArrayIndexOutOfBoundsException
  org.joda.time.format.TestPeriodFormat#test_wordBased_de_parseTwoFields ArrayIndexOutOfBoundsException
  org.joda.time.format.TestPeriodFormat#test_wordBased_en_withLocale_pt ArrayIndexOutOfBoundsException
  org.joda.time.format.TestPeriodFormat#test_wordBased_es_parseOneField ArrayIndexOutOfBoundsException
  org.joda.time.format.TestPeriodFormat#test_wordBased_es_parseTwoFields ArrayIndexOutOfBoundsException
  org.joda.time.format.TestPeriodFormat#test_wordBased_fr_parseOneField ArrayIndexOutOfBoundsException
  org.joda.time.format.TestPeriodFormat#test_wordBased_fr_parseTwoFields ArrayIndexOutOfBoundsException
  org.joda.time.format.TestPeriodFormat#test_wordBased_nl_parseOneField ArrayIndexOutOfBoundsException
  org.joda.time.format.TestPeriodFormat#test_wordBased_nl_parseTwoFields ArrayIndexOutOfBoundsException
  org.joda.time.format.TestPeriodFormat#test_wordBased_pl_parseOneField ArrayIndexOutOfBoundsException
  org.joda.time.format.TestPeriodFormat#test_wordBased_pl_parseTwoFields ArrayIndexOutOfBoundsException
  org.joda.time.format.TestPeriodFormat#test_wordBased_pt_parseOneField ArrayIndexOutOfBoundsException
  org.joda.time.format.TestPeriodFormat#test_wordBased_pt_parseTwoFields ArrayIndexOutOfBoundsException
  org.joda.time.format.TestPeriodFormatParsing#testParseStandard1 ArrayIndexOutOfBoundsException
  org.joda.time.format.TestPeriodFormatterBuilder#testMonthsAndMinutesAreConsideredSeparateAndCaseIsNotIgnored ArrayIndexOutOfBoundsException

Tests run: 4157, Failures: 2, Errors: 42, Skipped: 0

[INFO] ------------------------------------------------------------------------
[INFO] BUILD FAILURE
[INFO] ------------------------------------------------------------------------
[INFO] Total time: 15.946s
[INFO] Finished at: Thu Aug 06 10:18:55 BST 2015
[INFO] Final Memory: 9M/213M
[INFO] ------------------------------------------------------------------------
[ERROR] Failed to execute goal org.apache.maven.plugins:maven-surefire-plugin:2.18.1:test (default-test) on project joda-time: There are test failures.
[ERROR] 
[ERROR] Please refer to /home/perham/Study/LittleDarwin/Cases/joda-time-2.8.1/target/surefire-reports for the individual test results.
[ERROR] -> [Help 1]
[ERROR] 
[ERROR] To see the full stack trace of the errors, re-run Maven with the -e switch.
[ERROR] Re-run Maven using the -X switch to enable full debug logging.
[ERROR] 
[ERROR] For more information about the errors and possible solutions, please read the following articles:
[ERROR] [Help 1] http://cwiki.apache.org/confluence/display/MAVEN/MojoFailureException
