[INFO] Scanning for projects...
[INFO]                                                                         
[INFO] ------------------------------------------------------------------------
[INFO] Building Joda-Time 2.8.1
[INFO] ------------------------------------------------------------------------
[INFO] 
[INFO] --- maven-resources-plugin:2.7:resources (default-resources) @ joda-time ---
[INFO] Using 'UTF-8' encoding to copy filtered resources.
[INFO] Copying 2 resources to META-INF
[INFO] Copying 10 resources
[INFO] 
[INFO] --- maven-compiler-plugin:3.3:compile (default-compile) @ joda-time ---
[INFO] Changes detected - recompiling the module!
[INFO] Compiling 166 source files to /home/perham/Study/LittleDarwin/Cases/joda-time-2.8.1/target/classes
[INFO] 
[INFO] --- exec-maven-plugin:1.4.0:java (compile-tzdb) @ joda-time ---
Writing zoneinfo files
Writing ZoneInfoMap
[INFO] 
[INFO] --- maven-resources-plugin:2.7:testResources (default-testResources) @ joda-time ---
[INFO] Using 'UTF-8' encoding to copy filtered resources.
[INFO] Copying 34 resources
[INFO] 
[INFO] --- maven-compiler-plugin:3.3:testCompile (default-testCompile) @ joda-time ---
[INFO] Nothing to compile - all classes are up to date
[INFO] 
[INFO] --- maven-surefire-plugin:2.18.1:test (default-test) @ joda-time ---
[INFO] Surefire report directory: /home/perham/Study/LittleDarwin/Cases/joda-time-2.8.1/target/surefire-reports

-------------------------------------------------------
 T E S T S
-------------------------------------------------------
Running org.joda.time.TestAllPackages

TestBuddhistChronology.testCalendar

TestCopticChronology.testCalendar

TestEthiopicChronology.testCalendar

TestIslamicChronology.testCalendar

Testing Gregorian chronology over 1000 iterations
100% complete (i=1000)

Testing Julian chronology over 1000 iterations
100% complete (i=1000)
Writing zoneinfo files
Writing ZoneInfoMap
Tests run: 4157, Failures: 1, Errors: 55, Skipped: 0, Time elapsed: 5.57 sec <<< FAILURE! - in org.joda.time.TestAllPackages
testParse_noFormatter(org.joda.time.TestInterval_Constructors)  Time elapsed: 0.005 sec  <<< ERROR!
java.lang.IllegalArgumentException: Invalid format: "P1DT2H"
	at org.joda.time.format.PeriodFormatter.parseMutablePeriod(PeriodFormatter.java:330)
	at org.joda.time.format.PeriodFormatter.parsePeriod(PeriodFormatter.java:308)
	at org.joda.time.convert.StringConverter.setInto(StringConverter.java:223)
	at org.joda.time.base.BaseInterval.<init>(BaseInterval.java:200)
	at org.joda.time.Interval.<init>(Interval.java:193)
	at org.joda.time.Interval.parse(Interval.java:69)
	at org.joda.time.TestInterval_Constructors.testParse_noFormatter(TestInterval_Constructors.java:109)

testParse_noFormatter(org.joda.time.TestMutableInterval_Constructors)  Time elapsed: 0.002 sec  <<< ERROR!
java.lang.IllegalArgumentException: Invalid format: "P1DT2H"
	at org.joda.time.format.PeriodFormatter.parseMutablePeriod(PeriodFormatter.java:330)
	at org.joda.time.format.PeriodFormatter.parsePeriod(PeriodFormatter.java:308)
	at org.joda.time.convert.StringConverter.setInto(StringConverter.java:223)
	at org.joda.time.base.BaseInterval.<init>(BaseInterval.java:197)
	at org.joda.time.MutableInterval.<init>(MutableInterval.java:186)
	at org.joda.time.MutableInterval.parse(MutableInterval.java:71)
	at org.joda.time.TestMutableInterval_Constructors.testParse_noFormatter(TestMutableInterval_Constructors.java:115)

testParse_noFormatter(org.joda.time.TestPeriod_Constructors)  Time elapsed: 0.001 sec  <<< ERROR!
java.lang.IllegalArgumentException: Invalid format: "P1Y2M3W4DT5H6M7.890S"
	at org.joda.time.format.PeriodFormatter.parseMutablePeriod(PeriodFormatter.java:330)
	at org.joda.time.format.PeriodFormatter.parsePeriod(PeriodFormatter.java:308)
	at org.joda.time.Period.parse(Period.java:92)
	at org.joda.time.Period.parse(Period.java:81)
	at org.joda.time.TestPeriod_Constructors.testParse_noFormatter(TestPeriod_Constructors.java:104)

testConstructor_Object1(org.joda.time.TestPeriod_Constructors)  Time elapsed: 0.001 sec  <<< ERROR!
java.lang.IllegalArgumentException: Invalid format: "P1Y2M3D"
	at org.joda.time.format.PeriodFormatter.parseMutablePeriod(PeriodFormatter.java:330)
	at org.joda.time.convert.StringConverter.setInto(StringConverter.java:169)
	at org.joda.time.base.BasePeriod.<init>(BasePeriod.java:279)
	at org.joda.time.MutablePeriod.<init>(MutablePeriod.java:426)
	at org.joda.time.base.BasePeriod.<init>(BasePeriod.java:281)
	at org.joda.time.Period.<init>(Period.java:674)
	at org.joda.time.TestPeriod_Constructors.testConstructor_Object1(TestPeriod_Constructors.java:1145)

testConstructor_Object_PeriodType1(org.joda.time.TestPeriod_Constructors)  Time elapsed: 0.001 sec  <<< ERROR!
java.lang.IllegalArgumentException: Invalid format: "P1Y2M3D"
	at org.joda.time.format.PeriodFormatter.parseMutablePeriod(PeriodFormatter.java:330)
	at org.joda.time.convert.StringConverter.setInto(StringConverter.java:169)
	at org.joda.time.base.BasePeriod.<init>(BasePeriod.java:279)
	at org.joda.time.MutablePeriod.<init>(MutablePeriod.java:426)
	at org.joda.time.base.BasePeriod.<init>(BasePeriod.java:281)
	at org.joda.time.Period.<init>(Period.java:691)
	at org.joda.time.TestPeriod_Constructors.testConstructor_Object_PeriodType1(TestPeriod_Constructors.java:1202)

testParse_noFormatter(org.joda.time.TestMutablePeriod_Constructors)  Time elapsed: 0 sec  <<< ERROR!
java.lang.IllegalArgumentException: Invalid format: "P1Y2M3W4DT5H6M7.890S"
	at org.joda.time.format.PeriodFormatter.parseMutablePeriod(PeriodFormatter.java:330)
	at org.joda.time.format.PeriodFormatter.parsePeriod(PeriodFormatter.java:308)
	at org.joda.time.MutablePeriod.parse(MutablePeriod.java:85)
	at org.joda.time.MutablePeriod.parse(MutablePeriod.java:74)
	at org.joda.time.TestMutablePeriod_Constructors.testParse_noFormatter(TestMutablePeriod_Constructors.java:102)

testConstructor_Object1(org.joda.time.TestMutablePeriod_Constructors)  Time elapsed: 0 sec  <<< ERROR!
java.lang.IllegalArgumentException: Invalid format: "P1Y2M3D"
	at org.joda.time.format.PeriodFormatter.parseMutablePeriod(PeriodFormatter.java:330)
	at org.joda.time.convert.StringConverter.setInto(StringConverter.java:169)
	at org.joda.time.base.BasePeriod.<init>(BasePeriod.java:279)
	at org.joda.time.MutablePeriod.<init>(MutablePeriod.java:374)
	at org.joda.time.TestMutablePeriod_Constructors.testConstructor_Object1(TestMutablePeriod_Constructors.java:827)

testConstructor_Object_PeriodType1(org.joda.time.TestMutablePeriod_Constructors)  Time elapsed: 0 sec  <<< ERROR!
java.lang.IllegalArgumentException: Invalid format: "P1Y2M3D"
	at org.joda.time.format.PeriodFormatter.parseMutablePeriod(PeriodFormatter.java:330)
	at org.joda.time.convert.StringConverter.setInto(StringConverter.java:169)
	at org.joda.time.base.BasePeriod.<init>(BasePeriod.java:279)
	at org.joda.time.MutablePeriod.<init>(MutablePeriod.java:391)
	at org.joda.time.TestMutablePeriod_Constructors.testConstructor_Object_PeriodType1(TestMutablePeriod_Constructors.java:884)

testFactory_parseYears_String(org.joda.time.TestYears)  Time elapsed: 0 sec  <<< ERROR!
java.lang.IllegalArgumentException: Invalid format: "P0Y"
	at org.joda.time.format.PeriodFormatter.parseMutablePeriod(PeriodFormatter.java:330)
	at org.joda.time.format.PeriodFormatter.parsePeriod(PeriodFormatter.java:308)
	at org.joda.time.Years.parseYears(Years.java:162)
	at org.joda.time.TestYears.testFactory_parseYears_String(TestYears.java:116)

testFactory_parseMonths_String(org.joda.time.TestMonths)  Time elapsed: 0.002 sec  <<< ERROR!
java.lang.IllegalArgumentException: Invalid format: "P0M"
	at org.joda.time.format.PeriodFormatter.parseMutablePeriod(PeriodFormatter.java:330)
	at org.joda.time.format.PeriodFormatter.parsePeriod(PeriodFormatter.java:308)
	at org.joda.time.Months.parseMonths(Months.java:198)
	at org.joda.time.TestMonths.testFactory_parseMonths_String(TestMonths.java:161)

testFactory_parseWeeks_String(org.joda.time.TestWeeks)  Time elapsed: 0 sec  <<< ERROR!
java.lang.IllegalArgumentException: Invalid format: "P0W"
	at org.joda.time.format.PeriodFormatter.parseMutablePeriod(PeriodFormatter.java:330)
	at org.joda.time.format.PeriodFormatter.parsePeriod(PeriodFormatter.java:308)
	at org.joda.time.Weeks.parseWeeks(Weeks.java:185)
	at org.joda.time.TestWeeks.testFactory_parseWeeks_String(TestWeeks.java:133)

testFactory_parseDays_String(org.joda.time.TestDays)  Time elapsed: 0.001 sec  <<< ERROR!
java.lang.IllegalArgumentException: Invalid format: "P0D"
	at org.joda.time.format.PeriodFormatter.parseMutablePeriod(PeriodFormatter.java:330)
	at org.joda.time.format.PeriodFormatter.parsePeriod(PeriodFormatter.java:308)
	at org.joda.time.Days.parseDays(Days.java:203)
	at org.joda.time.TestDays.testFactory_parseDays_String(TestDays.java:175)

testFactory_parseHours_String(org.joda.time.TestHours)  Time elapsed: 0 sec  <<< ERROR!
java.lang.IllegalArgumentException: Invalid format: "PT0H"
	at org.joda.time.format.PeriodFormatter.parseMutablePeriod(PeriodFormatter.java:330)
	at org.joda.time.format.PeriodFormatter.parsePeriod(PeriodFormatter.java:308)
	at org.joda.time.Hours.parseHours(Hours.java:205)
	at org.joda.time.TestHours.testFactory_parseHours_String(TestHours.java:144)

testFactory_parseMinutes_String(org.joda.time.TestMinutes)  Time elapsed: 0 sec  <<< ERROR!
java.lang.IllegalArgumentException: Invalid format: "PT0M"
	at org.joda.time.format.PeriodFormatter.parseMutablePeriod(PeriodFormatter.java:330)
	at org.joda.time.format.PeriodFormatter.parsePeriod(PeriodFormatter.java:308)
	at org.joda.time.Minutes.parseMinutes(Minutes.java:185)
	at org.joda.time.TestMinutes.testFactory_parseMinutes_String(TestMinutes.java:134)

testFactory_parseSeconds_String(org.joda.time.TestSeconds)  Time elapsed: 0.001 sec  <<< ERROR!
java.lang.IllegalArgumentException: Invalid format: "PT0S"
	at org.joda.time.format.PeriodFormatter.parseMutablePeriod(PeriodFormatter.java:330)
	at org.joda.time.format.PeriodFormatter.parsePeriod(PeriodFormatter.java:308)
	at org.joda.time.Seconds.parseSeconds(Seconds.java:185)
	at org.joda.time.TestSeconds.testFactory_parseSeconds_String(TestSeconds.java:131)

testYears(org.joda.time.TestStringConvert)  Time elapsed: 0.03 sec  <<< ERROR!
java.lang.IllegalArgumentException: Invalid format: "P5Y"
	at org.joda.time.format.PeriodFormatter.parseMutablePeriod(PeriodFormatter.java:330)
	at org.joda.time.format.PeriodFormatter.parsePeriod(PeriodFormatter.java:308)
	at org.joda.time.Years.parseYears(Years.java:162)
	at sun.reflect.NativeMethodAccessorImpl.invoke0(Native Method)
	at sun.reflect.NativeMethodAccessorImpl.invoke(NativeMethodAccessorImpl.java:57)
	at sun.reflect.DelegatingMethodAccessorImpl.invoke(DelegatingMethodAccessorImpl.java:43)
	at java.lang.reflect.Method.invoke(Method.java:606)
	at org.joda.convert.MethodsStringConverter.convertFromString(MethodsStringConverter.java:70)
	at org.joda.convert.StringConvert.convertFromString(StringConvert.java:163)
	at org.joda.time.TestStringConvert.testYears(TestStringConvert.java:158)

testMonths(org.joda.time.TestStringConvert)  Time elapsed: 0.001 sec  <<< ERROR!
java.lang.IllegalArgumentException: Invalid format: "P5M"
	at org.joda.time.format.PeriodFormatter.parseMutablePeriod(PeriodFormatter.java:330)
	at org.joda.time.format.PeriodFormatter.parsePeriod(PeriodFormatter.java:308)
	at org.joda.time.Months.parseMonths(Months.java:198)
	at sun.reflect.NativeMethodAccessorImpl.invoke0(Native Method)
	at sun.reflect.NativeMethodAccessorImpl.invoke(NativeMethodAccessorImpl.java:57)
	at sun.reflect.DelegatingMethodAccessorImpl.invoke(DelegatingMethodAccessorImpl.java:43)
	at java.lang.reflect.Method.invoke(Method.java:606)
	at org.joda.convert.MethodsStringConverter.convertFromString(MethodsStringConverter.java:70)
	at org.joda.convert.StringConvert.convertFromString(StringConvert.java:163)
	at org.joda.time.TestStringConvert.testMonths(TestStringConvert.java:165)

testWeeks(org.joda.time.TestStringConvert)  Time elapsed: 0.001 sec  <<< ERROR!
java.lang.IllegalArgumentException: Invalid format: "P5W"
	at org.joda.time.format.PeriodFormatter.parseMutablePeriod(PeriodFormatter.java:330)
	at org.joda.time.format.PeriodFormatter.parsePeriod(PeriodFormatter.java:308)
	at org.joda.time.Weeks.parseWeeks(Weeks.java:185)
	at sun.reflect.NativeMethodAccessorImpl.invoke0(Native Method)
	at sun.reflect.NativeMethodAccessorImpl.invoke(NativeMethodAccessorImpl.java:57)
	at sun.reflect.DelegatingMethodAccessorImpl.invoke(DelegatingMethodAccessorImpl.java:43)
	at java.lang.reflect.Method.invoke(Method.java:606)
	at org.joda.convert.MethodsStringConverter.convertFromString(MethodsStringConverter.java:70)
	at org.joda.convert.StringConvert.convertFromString(StringConvert.java:163)
	at org.joda.time.TestStringConvert.testWeeks(TestStringConvert.java:172)

testDays(org.joda.time.TestStringConvert)  Time elapsed: 0.002 sec  <<< ERROR!
java.lang.IllegalArgumentException: Invalid format: "P5D"
	at org.joda.time.format.PeriodFormatter.parseMutablePeriod(PeriodFormatter.java:330)
	at org.joda.time.format.PeriodFormatter.parsePeriod(PeriodFormatter.java:308)
	at org.joda.time.Days.parseDays(Days.java:203)
	at sun.reflect.NativeMethodAccessorImpl.invoke0(Native Method)
	at sun.reflect.NativeMethodAccessorImpl.invoke(NativeMethodAccessorImpl.java:57)
	at sun.reflect.DelegatingMethodAccessorImpl.invoke(DelegatingMethodAccessorImpl.java:43)
	at java.lang.reflect.Method.invoke(Method.java:606)
	at org.joda.convert.MethodsStringConverter.convertFromString(MethodsStringConverter.java:70)
	at org.joda.convert.StringConvert.convertFromString(StringConvert.java:163)
	at org.joda.time.TestStringConvert.testDays(TestStringConvert.java:179)

testHours(org.joda.time.TestStringConvert)  Time elapsed: 0.001 sec  <<< ERROR!
java.lang.IllegalArgumentException: Invalid format: "PT5H"
	at org.joda.time.format.PeriodFormatter.parseMutablePeriod(PeriodFormatter.java:330)
	at org.joda.time.format.PeriodFormatter.parsePeriod(PeriodFormatter.java:308)
	at org.joda.time.Hours.parseHours(Hours.java:205)
	at sun.reflect.NativeMethodAccessorImpl.invoke0(Native Method)
	at sun.reflect.NativeMethodAccessorImpl.invoke(NativeMethodAccessorImpl.java:57)
	at sun.reflect.DelegatingMethodAccessorImpl.invoke(DelegatingMethodAccessorImpl.java:43)
	at java.lang.reflect.Method.invoke(Method.java:606)
	at org.joda.convert.MethodsStringConverter.convertFromString(MethodsStringConverter.java:70)
	at org.joda.convert.StringConvert.convertFromString(StringConvert.java:163)
	at org.joda.time.TestStringConvert.testHours(TestStringConvert.java:186)

testMinutes(org.joda.time.TestStringConvert)  Time elapsed: 0.002 sec  <<< ERROR!
java.lang.IllegalArgumentException: Invalid format: "PT5M"
	at org.joda.time.format.PeriodFormatter.parseMutablePeriod(PeriodFormatter.java:330)
	at org.joda.time.format.PeriodFormatter.parsePeriod(PeriodFormatter.java:308)
	at org.joda.time.Minutes.parseMinutes(Minutes.java:185)
	at sun.reflect.NativeMethodAccessorImpl.invoke0(Native Method)
	at sun.reflect.NativeMethodAccessorImpl.invoke(NativeMethodAccessorImpl.java:57)
	at sun.reflect.DelegatingMethodAccessorImpl.invoke(DelegatingMethodAccessorImpl.java:43)
	at java.lang.reflect.Method.invoke(Method.java:606)
	at org.joda.convert.MethodsStringConverter.convertFromString(MethodsStringConverter.java:70)
	at org.joda.convert.StringConvert.convertFromString(StringConvert.java:163)
	at org.joda.time.TestStringConvert.testMinutes(TestStringConvert.java:193)

testSeconds(org.joda.time.TestStringConvert)  Time elapsed: 0.001 sec  <<< ERROR!
java.lang.IllegalArgumentException: Invalid format: "PT5S"
	at org.joda.time.format.PeriodFormatter.parseMutablePeriod(PeriodFormatter.java:330)
	at org.joda.time.format.PeriodFormatter.parsePeriod(PeriodFormatter.java:308)
	at org.joda.time.Seconds.parseSeconds(Seconds.java:185)
	at sun.reflect.NativeMethodAccessorImpl.invoke0(Native Method)
	at sun.reflect.NativeMethodAccessorImpl.invoke(NativeMethodAccessorImpl.java:57)
	at sun.reflect.DelegatingMethodAccessorImpl.invoke(DelegatingMethodAccessorImpl.java:43)
	at java.lang.reflect.Method.invoke(Method.java:606)
	at org.joda.convert.MethodsStringConverter.convertFromString(MethodsStringConverter.java:70)
	at org.joda.convert.StringConvert.convertFromString(StringConvert.java:163)
	at org.joda.time.TestStringConvert.testSeconds(TestStringConvert.java:200)

testMutablePeriod(org.joda.time.TestStringConvert)  Time elapsed: 0.002 sec  <<< ERROR!
java.lang.IllegalArgumentException: Invalid format: "P1Y2M3W4DT5H6M7.008S"
	at org.joda.time.format.PeriodFormatter.parseMutablePeriod(PeriodFormatter.java:330)
	at org.joda.time.format.PeriodFormatter.parsePeriod(PeriodFormatter.java:308)
	at org.joda.time.MutablePeriod.parse(MutablePeriod.java:85)
	at org.joda.time.MutablePeriod.parse(MutablePeriod.java:74)
	at sun.reflect.NativeMethodAccessorImpl.invoke0(Native Method)
	at sun.reflect.NativeMethodAccessorImpl.invoke(NativeMethodAccessorImpl.java:57)
	at sun.reflect.DelegatingMethodAccessorImpl.invoke(DelegatingMethodAccessorImpl.java:43)
	at java.lang.reflect.Method.invoke(Method.java:606)
	at org.joda.convert.MethodsStringConverter.convertFromString(MethodsStringConverter.java:70)
	at org.joda.convert.StringConvert.convertFromString(StringConvert.java:163)
	at org.joda.time.TestStringConvert.testMutablePeriod(TestStringConvert.java:151)

testPeriod(org.joda.time.TestStringConvert)  Time elapsed: 0.001 sec  <<< ERROR!
java.lang.IllegalArgumentException: Invalid format: "P1Y2M3W4DT5H6M7.008S"
	at org.joda.time.format.PeriodFormatter.parseMutablePeriod(PeriodFormatter.java:330)
	at org.joda.time.format.PeriodFormatter.parsePeriod(PeriodFormatter.java:308)
	at org.joda.time.Period.parse(Period.java:92)
	at org.joda.time.Period.parse(Period.java:81)
	at sun.reflect.NativeMethodAccessorImpl.invoke0(Native Method)
	at sun.reflect.NativeMethodAccessorImpl.invoke(NativeMethodAccessorImpl.java:57)
	at sun.reflect.DelegatingMethodAccessorImpl.invoke(DelegatingMethodAccessorImpl.java:43)
	at java.lang.reflect.Method.invoke(Method.java:606)
	at org.joda.convert.MethodsStringConverter.convertFromString(MethodsStringConverter.java:70)
	at org.joda.convert.StringConvert.convertFromString(StringConvert.java:163)
	at org.joda.time.TestStringConvert.testPeriod(TestStringConvert.java:144)

testSetIntoPeriod_Object3(org.joda.time.convert.TestStringConverter)  Time elapsed: 0.001 sec  <<< ERROR!
java.lang.IllegalArgumentException: Invalid format: "P2Y4W3DT12H24M48.034S"
	at org.joda.time.format.PeriodFormatter.parseMutablePeriod(PeriodFormatter.java:330)
	at org.joda.time.convert.StringConverter.setInto(StringConverter.java:169)
	at org.joda.time.convert.TestStringConverter.testSetIntoPeriod_Object3(TestStringConverter.java:389)

testSetIntoPeriod_Object4(org.joda.time.convert.TestStringConverter)  Time elapsed: 0 sec  <<< ERROR!
java.lang.IllegalArgumentException: Invalid format: "P2Y4W3DT12H24M.056S"
	at org.joda.time.format.PeriodFormatter.parseMutablePeriod(PeriodFormatter.java:330)
	at org.joda.time.convert.StringConverter.setInto(StringConverter.java:169)
	at org.joda.time.convert.TestStringConverter.testSetIntoPeriod_Object4(TestStringConverter.java:401)

testSetIntoPeriod_Object5(org.joda.time.convert.TestStringConverter)  Time elapsed: 0.001 sec  <<< ERROR!
java.lang.IllegalArgumentException: Invalid format: "P2Y4W3DT12H24M56.S"
	at org.joda.time.format.PeriodFormatter.parseMutablePeriod(PeriodFormatter.java:330)
	at org.joda.time.convert.StringConverter.setInto(StringConverter.java:169)
	at org.joda.time.convert.TestStringConverter.testSetIntoPeriod_Object5(TestStringConverter.java:413)

testSetIntoPeriod_Object6(org.joda.time.convert.TestStringConverter)  Time elapsed: 0.001 sec  <<< ERROR!
java.lang.IllegalArgumentException: Invalid format: "P2Y4W3DT12H24M56.1234567S"
	at org.joda.time.format.PeriodFormatter.parseMutablePeriod(PeriodFormatter.java:330)
	at org.joda.time.convert.StringConverter.setInto(StringConverter.java:169)
	at org.joda.time.convert.TestStringConverter.testSetIntoPeriod_Object6(TestStringConverter.java:425)

testSetIntoPeriod_Object7(org.joda.time.convert.TestStringConverter)  Time elapsed: 0 sec  <<< ERROR!
java.lang.IllegalArgumentException: Invalid format: "P2Y4W3D"
	at org.joda.time.format.PeriodFormatter.parseMutablePeriod(PeriodFormatter.java:330)
	at org.joda.time.convert.StringConverter.setInto(StringConverter.java:169)
	at org.joda.time.convert.TestStringConverter.testSetIntoPeriod_Object7(TestStringConverter.java:437)

testSetIntoInterval_Object_Chronology1(org.joda.time.convert.TestStringConverter)  Time elapsed: 0 sec  <<< ERROR!
java.lang.IllegalArgumentException: Invalid format: "P1Y2M"
	at org.joda.time.format.PeriodFormatter.parseMutablePeriod(PeriodFormatter.java:330)
	at org.joda.time.format.PeriodFormatter.parsePeriod(PeriodFormatter.java:308)
	at org.joda.time.convert.StringConverter.setInto(StringConverter.java:223)
	at org.joda.time.convert.TestStringConverter.testSetIntoInterval_Object_Chronology1(TestStringConverter.java:476)

testSetIntoInterval_Object_Chronology2(org.joda.time.convert.TestStringConverter)  Time elapsed: 0.001 sec  <<< ERROR!
java.lang.IllegalArgumentException: Invalid format: "P1Y2M"
	at org.joda.time.format.PeriodFormatter.parseMutablePeriod(PeriodFormatter.java:330)
	at org.joda.time.format.PeriodFormatter.parsePeriod(PeriodFormatter.java:308)
	at org.joda.time.convert.StringConverter.setInto(StringConverter.java:210)
	at org.joda.time.convert.TestStringConverter.testSetIntoInterval_Object_Chronology2(TestStringConverter.java:484)

testSetIntoInterval_Object_Chronology4(org.joda.time.convert.TestStringConverter)  Time elapsed: 0.001 sec  <<< ERROR!
java.lang.IllegalArgumentException: Invalid format: "P1Y2M"
	at org.joda.time.format.PeriodFormatter.parseMutablePeriod(PeriodFormatter.java:330)
	at org.joda.time.format.PeriodFormatter.parsePeriod(PeriodFormatter.java:308)
	at org.joda.time.convert.StringConverter.setInto(StringConverter.java:223)
	at org.joda.time.convert.TestStringConverter.testSetIntoInterval_Object_Chronology4(TestStringConverter.java:500)

testSetIntoInterval_Object_Chronology5(org.joda.time.convert.TestStringConverter)  Time elapsed: 0 sec  <<< ERROR!
java.lang.IllegalArgumentException: Invalid format: "P1Y2M"
	at org.joda.time.format.PeriodFormatter.parseMutablePeriod(PeriodFormatter.java:330)
	at org.joda.time.format.PeriodFormatter.parsePeriod(PeriodFormatter.java:308)
	at org.joda.time.convert.StringConverter.setInto(StringConverter.java:210)
	at org.joda.time.convert.TestStringConverter.testSetIntoInterval_Object_Chronology5(TestStringConverter.java:508)

testSetIntoPeriod_Object1(org.joda.time.convert.TestStringConverter)  Time elapsed: 0.001 sec  <<< ERROR!
java.lang.IllegalArgumentException: Invalid format: "P2Y6M9DT12H24M48S"
	at org.joda.time.format.PeriodFormatter.parseMutablePeriod(PeriodFormatter.java:330)
	at org.joda.time.convert.StringConverter.setInto(StringConverter.java:169)
	at org.joda.time.convert.TestStringConverter.testSetIntoPeriod_Object1(TestStringConverter.java:365)

testSetIntoPeriod_Object2(org.joda.time.convert.TestStringConverter)  Time elapsed: 0 sec  <<< ERROR!
java.lang.IllegalArgumentException: Invalid format: "P2Y4W3DT12H24M48S"
	at org.joda.time.format.PeriodFormatter.parseMutablePeriod(PeriodFormatter.java:330)
	at org.joda.time.convert.StringConverter.setInto(StringConverter.java:169)
	at org.joda.time.convert.TestStringConverter.testSetIntoPeriod_Object2(TestStringConverter.java:377)

testParseInto_simple(org.joda.time.format.TestPeriodFormatter)  Time elapsed: 0 sec  <<< FAILURE!
junit.framework.AssertionFailedError: expected:<20> but was:<-1>
	at junit.framework.Assert.fail(Assert.java:47)
	at junit.framework.Assert.failNotEquals(Assert.java:280)
	at junit.framework.Assert.assertEquals(Assert.java:64)
	at junit.framework.Assert.assertEquals(Assert.java:198)
	at junit.framework.Assert.assertEquals(Assert.java:204)
	at org.joda.time.format.TestPeriodFormatter.testParseInto_simple(TestPeriodFormatter.java:221)

testPrinterParserMethods(org.joda.time.format.TestPeriodFormatter)  Time elapsed: 0.001 sec  <<< ERROR!
java.lang.IllegalArgumentException: Invalid format: "P1Y2M3W4DT5H6M7.008S"
	at org.joda.time.format.PeriodFormatter.parseMutablePeriod(PeriodFormatter.java:330)
	at org.joda.time.format.PeriodFormatter.parsePeriod(PeriodFormatter.java:308)
	at org.joda.time.format.TestPeriodFormatter.testPrinterParserMethods(TestPeriodFormatter.java:161)

testParsePeriod_simple(org.joda.time.format.TestPeriodFormatter)  Time elapsed: 0 sec  <<< ERROR!
java.lang.IllegalArgumentException: Invalid format: "P1Y2M3W4DT5H6M7.008S"
	at org.joda.time.format.PeriodFormatter.parseMutablePeriod(PeriodFormatter.java:330)
	at org.joda.time.format.PeriodFormatter.parsePeriod(PeriodFormatter.java:308)
	at org.joda.time.format.TestPeriodFormatter.testParsePeriod_simple(TestPeriodFormatter.java:189)

testParsePeriod_parseType(org.joda.time.format.TestPeriodFormatter)  Time elapsed: 0.001 sec  <<< ERROR!
java.lang.IllegalArgumentException: Invalid format: "P4DT5H6M7.008S"
	at org.joda.time.format.PeriodFormatter.parseMutablePeriod(PeriodFormatter.java:330)
	at org.joda.time.format.PeriodFormatter.parsePeriod(PeriodFormatter.java:308)
	at org.joda.time.format.TestPeriodFormatter.testParsePeriod_parseType(TestPeriodFormatter.java:199)

testParseMutablePeriod_simple(org.joda.time.format.TestPeriodFormatter)  Time elapsed: 0 sec  <<< ERROR!
java.lang.IllegalArgumentException: Invalid format: "P1Y2M3W4DT5H6M7.008S"
	at org.joda.time.format.PeriodFormatter.parseMutablePeriod(PeriodFormatter.java:330)
	at org.joda.time.format.TestPeriodFormatter.testParseMutablePeriod_simple(TestPeriodFormatter.java:209)

testParseStandard9(org.joda.time.format.TestISOPeriodFormatParsing)  Time elapsed: 0.001 sec  <<< ERROR!
java.lang.IllegalArgumentException: Invalid format: "PT0S"
	at org.joda.time.format.PeriodFormatter.parseMutablePeriod(PeriodFormatter.java:330)
	at org.joda.time.format.PeriodFormatter.parsePeriod(PeriodFormatter.java:308)
	at org.joda.time.format.TestISOPeriodFormatParsing.testParseStandard9(TestISOPeriodFormatParsing.java:150)

testParseStandard10(org.joda.time.format.TestISOPeriodFormatParsing)  Time elapsed: 0 sec  <<< ERROR!
java.lang.IllegalArgumentException: Invalid format: "P0D"
	at org.joda.time.format.PeriodFormatter.parseMutablePeriod(PeriodFormatter.java:330)
	at org.joda.time.format.PeriodFormatter.parsePeriod(PeriodFormatter.java:308)
	at org.joda.time.format.TestISOPeriodFormatParsing.testParseStandard10(TestISOPeriodFormatParsing.java:157)

testParseStandard11(org.joda.time.format.TestISOPeriodFormatParsing)  Time elapsed: 0.001 sec  <<< ERROR!
java.lang.IllegalArgumentException: Invalid format: "P0Y"
	at org.joda.time.format.PeriodFormatter.parseMutablePeriod(PeriodFormatter.java:330)
	at org.joda.time.format.PeriodFormatter.parsePeriod(PeriodFormatter.java:308)
	at org.joda.time.format.TestISOPeriodFormatParsing.testParseStandard11(TestISOPeriodFormatParsing.java:164)

testParseStandard1(org.joda.time.format.TestISOPeriodFormatParsing)  Time elapsed: 0.001 sec  <<< ERROR!
java.lang.IllegalArgumentException: Invalid format: "P1Y2M3W4DT5H6M7.008S"
	at org.joda.time.format.PeriodFormatter.parseMutablePeriod(PeriodFormatter.java:330)
	at org.joda.time.format.PeriodFormatter.parsePeriod(PeriodFormatter.java:308)
	at org.joda.time.format.TestISOPeriodFormatParsing.testParseStandard1(TestISOPeriodFormatParsing.java:94)

testParseStandard2(org.joda.time.format.TestISOPeriodFormatParsing)  Time elapsed: 0 sec  <<< ERROR!
java.lang.IllegalArgumentException: Invalid format: "P0Y0M0W0DT5H6M7.008S"
	at org.joda.time.format.PeriodFormatter.parseMutablePeriod(PeriodFormatter.java:330)
	at org.joda.time.format.PeriodFormatter.parsePeriod(PeriodFormatter.java:308)
	at org.joda.time.format.TestISOPeriodFormatParsing.testParseStandard2(TestISOPeriodFormatParsing.java:101)

testParseStandard3(org.joda.time.format.TestISOPeriodFormatParsing)  Time elapsed: 0 sec  <<< ERROR!
java.lang.IllegalArgumentException: Invalid format: "P0DT5H6M7.008S"
	at org.joda.time.format.PeriodFormatter.parseMutablePeriod(PeriodFormatter.java:330)
	at org.joda.time.format.PeriodFormatter.parsePeriod(PeriodFormatter.java:308)
	at org.joda.time.format.TestISOPeriodFormatParsing.testParseStandard3(TestISOPeriodFormatParsing.java:108)

testParseStandard4(org.joda.time.format.TestISOPeriodFormatParsing)  Time elapsed: 0 sec  <<< ERROR!
java.lang.IllegalArgumentException: Invalid format: "P2Y3DT5H6M7.008S"
	at org.joda.time.format.PeriodFormatter.parseMutablePeriod(PeriodFormatter.java:330)
	at org.joda.time.format.PeriodFormatter.parsePeriod(PeriodFormatter.java:308)
	at org.joda.time.format.TestISOPeriodFormatParsing.testParseStandard4(TestISOPeriodFormatParsing.java:115)

testParseStandard5(org.joda.time.format.TestISOPeriodFormatParsing)  Time elapsed: 0.001 sec  <<< ERROR!
java.lang.IllegalArgumentException: Invalid format: "P2YT5H6M7.008S"
	at org.joda.time.format.PeriodFormatter.parseMutablePeriod(PeriodFormatter.java:330)
	at org.joda.time.format.PeriodFormatter.parsePeriod(PeriodFormatter.java:308)
	at org.joda.time.format.TestISOPeriodFormatParsing.testParseStandard5(TestISOPeriodFormatParsing.java:122)

testParseStandard6(org.joda.time.format.TestISOPeriodFormatParsing)  Time elapsed: 0 sec  <<< ERROR!
java.lang.IllegalArgumentException: Invalid format: "PT5H6M7.008S"
	at org.joda.time.format.PeriodFormatter.parseMutablePeriod(PeriodFormatter.java:330)
	at org.joda.time.format.PeriodFormatter.parsePeriod(PeriodFormatter.java:308)
	at org.joda.time.format.TestISOPeriodFormatParsing.testParseStandard6(TestISOPeriodFormatParsing.java:129)

testParseStandard7(org.joda.time.format.TestISOPeriodFormatParsing)  Time elapsed: 0.001 sec  <<< ERROR!
java.lang.IllegalArgumentException: Invalid format: "P1Y2M3W4D"
	at org.joda.time.format.PeriodFormatter.parseMutablePeriod(PeriodFormatter.java:330)
	at org.joda.time.format.PeriodFormatter.parsePeriod(PeriodFormatter.java:308)
	at org.joda.time.format.TestISOPeriodFormatParsing.testParseStandard7(TestISOPeriodFormatParsing.java:136)

testParseStandard8(org.joda.time.format.TestISOPeriodFormatParsing)  Time elapsed: 0 sec  <<< ERROR!
java.lang.IllegalArgumentException: Invalid format: "PT5H6M7S"
	at org.joda.time.format.PeriodFormatter.parseMutablePeriod(PeriodFormatter.java:330)
	at org.joda.time.format.PeriodFormatter.parsePeriod(PeriodFormatter.java:308)
	at org.joda.time.format.TestISOPeriodFormatParsing.testParseStandard8(TestISOPeriodFormatParsing.java:143)

testParseNegativeMillis1(org.joda.time.format.TestPeriodFormatParsing)  Time elapsed: 0.001 sec  <<< ERROR!
java.lang.IllegalArgumentException: Invalid format: "PT-0.001S"
	at org.joda.time.format.PeriodFormatter.parseMutablePeriod(PeriodFormatter.java:330)
	at org.joda.time.format.PeriodFormatter.parsePeriod(PeriodFormatter.java:308)
	at org.joda.time.Period.parse(Period.java:92)
	at org.joda.time.Period.parse(Period.java:81)
	at org.joda.time.format.TestPeriodFormatParsing.testParseNegativeMillis1(TestPeriodFormatParsing.java:102)

testParseNegativeMillis2(org.joda.time.format.TestPeriodFormatParsing)  Time elapsed: 0 sec  <<< ERROR!
java.lang.IllegalArgumentException: Invalid format: "PT-0.999S"
	at org.joda.time.format.PeriodFormatter.parseMutablePeriod(PeriodFormatter.java:330)
	at org.joda.time.format.PeriodFormatter.parsePeriod(PeriodFormatter.java:308)
	at org.joda.time.Period.parse(Period.java:92)
	at org.joda.time.Period.parse(Period.java:81)
	at org.joda.time.format.TestPeriodFormatParsing.testParseNegativeMillis2(TestPeriodFormatParsing.java:110)

testFormatAppend_PrinterParser_null_Parser(org.joda.time.format.TestPeriodFormatterBuilder)  Time elapsed: 0 sec  <<< ERROR!
java.lang.IllegalArgumentException: Invalid format: "1-2" is malformed at "-2"
	at org.joda.time.format.PeriodFormatter.parseMutablePeriod(PeriodFormatter.java:330)
	at org.joda.time.format.PeriodFormatter.parsePeriod(PeriodFormatter.java:308)
	at org.joda.time.format.TestPeriodFormatterBuilder.testFormatAppend_PrinterParser_null_Parser(TestPeriodFormatterBuilder.java:1104)

testFormatAppend_PrinterParser_PrinterParser(org.joda.time.format.TestPeriodFormatterBuilder)  Time elapsed: 0 sec  <<< ERROR!
java.lang.IllegalArgumentException: Invalid format: "1-2" is malformed at "-2"
	at org.joda.time.format.PeriodFormatter.parseMutablePeriod(PeriodFormatter.java:330)
	at org.joda.time.format.PeriodFormatter.parsePeriod(PeriodFormatter.java:308)
	at org.joda.time.format.TestPeriodFormatterBuilder.testFormatAppend_PrinterParser_PrinterParser(TestPeriodFormatterBuilder.java:1116)

testBug2495455(org.joda.time.format.TestPeriodFormatterBuilder)  Time elapsed: 0 sec  <<< ERROR!
java.lang.IllegalArgumentException: Invalid format: "PT1003199059S"
	at org.joda.time.format.PeriodFormatter.parseMutablePeriod(PeriodFormatter.java:330)
	at org.joda.time.format.PeriodFormatter.parsePeriod(PeriodFormatter.java:308)
	at org.joda.time.format.TestPeriodFormatterBuilder.testBug2495455(TestPeriodFormatterBuilder.java:1166)


Results :

Failed tests: 
  org.joda.time.format.TestPeriodFormatter#testParseInto_simple AssertionFailedError
Tests in error: 
  org.joda.time.TestDays#testFactory_parseDays_String IllegalArgumentException I...
  org.joda.time.TestHours#testFactory_parseHours_String IllegalArgumentException
  org.joda.time.TestInterval_Constructors#testParse_noFormatter IllegalArgumentException
  org.joda.time.TestMinutes#testFactory_parseMinutes_String IllegalArgumentException
  org.joda.time.TestMonths#testFactory_parseMonths_String IllegalArgumentException
  org.joda.time.TestMutableInterval_Constructors#testParse_noFormatter IllegalArgumentException
  org.joda.time.TestMutablePeriod_Constructors#testConstructor_Object1 IllegalArgumentException
  org.joda.time.TestMutablePeriod_Constructors#testConstructor_Object_PeriodType1 IllegalArgumentException
  org.joda.time.TestMutablePeriod_Constructors#testParse_noFormatter IllegalArgumentException
  org.joda.time.TestPeriod_Constructors#testConstructor_Object1 IllegalArgumentException
  org.joda.time.TestPeriod_Constructors#testConstructor_Object_PeriodType1 IllegalArgumentException
  org.joda.time.TestPeriod_Constructors#testParse_noFormatter IllegalArgumentException
  org.joda.time.TestSeconds#testFactory_parseSeconds_String IllegalArgumentException
  org.joda.time.TestStringConvert#testDays IllegalArgumentException Invalid form...
  org.joda.time.TestStringConvert#testHours IllegalArgumentException Invalid for...
  org.joda.time.TestStringConvert#testMinutes IllegalArgumentException Invalid f...
  org.joda.time.TestStringConvert#testMonths IllegalArgumentException Invalid fo...
  org.joda.time.TestStringConvert#testMutablePeriod IllegalArgumentException Inv...
  org.joda.time.TestStringConvert#testPeriod IllegalArgumentException Invalid fo...
  org.joda.time.TestStringConvert#testSeconds IllegalArgumentException Invalid f...
  org.joda.time.TestStringConvert#testWeeks IllegalArgumentException Invalid for...
  org.joda.time.TestStringConvert#testYears IllegalArgumentException Invalid for...
  org.joda.time.TestWeeks#testFactory_parseWeeks_String IllegalArgumentException
  org.joda.time.TestYears#testFactory_parseYears_String IllegalArgumentException
  org.joda.time.convert.TestStringConverter#testSetIntoInterval_Object_Chronology1 IllegalArgumentException
  org.joda.time.convert.TestStringConverter#testSetIntoInterval_Object_Chronology2 IllegalArgumentException
  org.joda.time.convert.TestStringConverter#testSetIntoInterval_Object_Chronology4 IllegalArgumentException
  org.joda.time.convert.TestStringConverter#testSetIntoInterval_Object_Chronology5 IllegalArgumentException
  org.joda.time.convert.TestStringConverter#testSetIntoPeriod_Object1 IllegalArgumentException
  org.joda.time.convert.TestStringConverter#testSetIntoPeriod_Object2 IllegalArgumentException
  org.joda.time.convert.TestStringConverter#testSetIntoPeriod_Object3 IllegalArgumentException
  org.joda.time.convert.TestStringConverter#testSetIntoPeriod_Object4 IllegalArgumentException
  org.joda.time.convert.TestStringConverter#testSetIntoPeriod_Object5 IllegalArgumentException
  org.joda.time.convert.TestStringConverter#testSetIntoPeriod_Object6 IllegalArgumentException
  org.joda.time.convert.TestStringConverter#testSetIntoPeriod_Object7 IllegalArgumentException
  org.joda.time.format.TestISOPeriodFormatParsing#testParseStandard1 IllegalArgumentException
  org.joda.time.format.TestISOPeriodFormatParsing#testParseStandard10 IllegalArgumentException
  org.joda.time.format.TestISOPeriodFormatParsing#testParseStandard11 IllegalArgumentException
  org.joda.time.format.TestISOPeriodFormatParsing#testParseStandard2 IllegalArgumentException
  org.joda.time.format.TestISOPeriodFormatParsing#testParseStandard3 IllegalArgumentException
  org.joda.time.format.TestISOPeriodFormatParsing#testParseStandard4 IllegalArgumentException
  org.joda.time.format.TestISOPeriodFormatParsing#testParseStandard5 IllegalArgumentException
  org.joda.time.format.TestISOPeriodFormatParsing#testParseStandard6 IllegalArgumentException
  org.joda.time.format.TestISOPeriodFormatParsing#testParseStandard7 IllegalArgumentException
  org.joda.time.format.TestISOPeriodFormatParsing#testParseStandard8 IllegalArgumentException
  org.joda.time.format.TestISOPeriodFormatParsing#testParseStandard9 IllegalArgumentException
  org.joda.time.format.TestPeriodFormatParsing#testParseNegativeMillis1 IllegalArgumentException
  org.joda.time.format.TestPeriodFormatParsing#testParseNegativeMillis2 IllegalArgumentException
  org.joda.time.format.TestPeriodFormatter#testParseMutablePeriod_simple IllegalArgumentException
  org.joda.time.format.TestPeriodFormatter#testParsePeriod_parseType IllegalArgumentException
  org.joda.time.format.TestPeriodFormatter#testParsePeriod_simple IllegalArgumentException
  org.joda.time.format.TestPeriodFormatter#testPrinterParserMethods IllegalArgumentException
  org.joda.time.format.TestPeriodFormatterBuilder#testBug2495455 IllegalArgumentException
  org.joda.time.format.TestPeriodFormatterBuilder#testFormatAppend_PrinterParser_PrinterParser IllegalArgumentException
  org.joda.time.format.TestPeriodFormatterBuilder#testFormatAppend_PrinterParser_null_Parser IllegalArgumentException

Tests run: 4157, Failures: 1, Errors: 55, Skipped: 0

[INFO] ------------------------------------------------------------------------
[INFO] BUILD FAILURE
[INFO] ------------------------------------------------------------------------
[INFO] Total time: 16.469s
[INFO] Finished at: Thu Aug 06 10:03:35 BST 2015
[INFO] Final Memory: 9M/214M
[INFO] ------------------------------------------------------------------------
[ERROR] Failed to execute goal org.apache.maven.plugins:maven-surefire-plugin:2.18.1:test (default-test) on project joda-time: There are test failures.
[ERROR] 
[ERROR] Please refer to /home/perham/Study/LittleDarwin/Cases/joda-time-2.8.1/target/surefire-reports for the individual test results.
[ERROR] -> [Help 1]
[ERROR] 
[ERROR] To see the full stack trace of the errors, re-run Maven with the -e switch.
[ERROR] Re-run Maven using the -X switch to enable full debug logging.
[ERROR] 
[ERROR] For more information about the errors and possible solutions, please read the following articles:
[ERROR] [Help 1] http://cwiki.apache.org/confluence/display/MAVEN/MojoFailureException
