[INFO] Scanning for projects...
[INFO]                                                                         
[INFO] ------------------------------------------------------------------------
[INFO] Building Joda-Time 2.8.1
[INFO] ------------------------------------------------------------------------
[INFO] 
[INFO] --- maven-resources-plugin:2.7:resources (default-resources) @ joda-time ---
[INFO] Using 'UTF-8' encoding to copy filtered resources.
[INFO] Copying 2 resources to META-INF
[INFO] Copying 10 resources
[INFO] 
[INFO] --- maven-compiler-plugin:3.3:compile (default-compile) @ joda-time ---
[INFO] Changes detected - recompiling the module!
[INFO] Compiling 166 source files to /home/perham/Study/LittleDarwin/Cases/joda-time-2.8.1/target/classes
[INFO] 
[INFO] --- exec-maven-plugin:1.4.0:java (compile-tzdb) @ joda-time ---
Writing zoneinfo files
Writing ZoneInfoMap
[INFO] 
[INFO] --- maven-resources-plugin:2.7:testResources (default-testResources) @ joda-time ---
[INFO] Using 'UTF-8' encoding to copy filtered resources.
[INFO] Copying 34 resources
[INFO] 
[INFO] --- maven-compiler-plugin:3.3:testCompile (default-testCompile) @ joda-time ---
[INFO] Nothing to compile - all classes are up to date
[INFO] 
[INFO] --- maven-surefire-plugin:2.18.1:test (default-test) @ joda-time ---
[INFO] Surefire report directory: /home/perham/Study/LittleDarwin/Cases/joda-time-2.8.1/target/surefire-reports

-------------------------------------------------------
 T E S T S
-------------------------------------------------------
Running org.joda.time.TestAllPackages

TestBuddhistChronology.testCalendar

TestCopticChronology.testCalendar

TestEthiopicChronology.testCalendar

TestIslamicChronology.testCalendar

Testing Gregorian chronology over 1000 iterations
100% complete (i=1000)

Testing Julian chronology over 1000 iterations
100% complete (i=1000)
Writing zoneinfo files
Writing ZoneInfoMap
Tests run: 4157, Failures: 0, Errors: 15, Skipped: 0, Time elapsed: 5.724 sec <<< FAILURE! - in org.joda.time.TestAllPackages
test_wordBased_pl_formatTwoFields(org.joda.time.format.TestPeriodFormat)  Time elapsed: 0.005 sec  <<< ERROR!
java.lang.IllegalArgumentException
	at org.joda.time.format.PeriodFormatterBuilder.appendSuffix(PeriodFormatterBuilder.java:143)
	at org.joda.time.format.PeriodFormat.buildRegExFormatter(PeriodFormat.java:232)
	at org.joda.time.format.PeriodFormat.buildWordBased(PeriodFormat.java:219)
	at org.joda.time.format.PeriodFormat.wordBased(PeriodFormat.java:205)
	at org.joda.time.format.TestPeriodFormat.test_wordBased_pl_formatTwoFields(TestPeriodFormat.java:392)

test_wordBased_pl_parseOneField(org.joda.time.format.TestPeriodFormat)  Time elapsed: 0 sec  <<< ERROR!
java.lang.IllegalArgumentException
	at org.joda.time.format.PeriodFormatterBuilder.appendSuffix(PeriodFormatterBuilder.java:143)
	at org.joda.time.format.PeriodFormat.buildRegExFormatter(PeriodFormat.java:232)
	at org.joda.time.format.PeriodFormat.buildWordBased(PeriodFormat.java:219)
	at org.joda.time.format.PeriodFormat.wordBased(PeriodFormat.java:205)
	at org.joda.time.format.TestPeriodFormat.test_wordBased_pl_parseOneField(TestPeriodFormat.java:398)

test_wordBased_pl_parseTwoFields(org.joda.time.format.TestPeriodFormat)  Time elapsed: 0 sec  <<< ERROR!
java.lang.IllegalArgumentException
	at org.joda.time.format.PeriodFormatterBuilder.appendSuffix(PeriodFormatterBuilder.java:143)
	at org.joda.time.format.PeriodFormat.buildRegExFormatter(PeriodFormat.java:232)
	at org.joda.time.format.PeriodFormat.buildWordBased(PeriodFormat.java:219)
	at org.joda.time.format.PeriodFormat.wordBased(PeriodFormat.java:205)
	at org.joda.time.format.TestPeriodFormat.test_wordBased_pl_parseTwoFields(TestPeriodFormat.java:404)

test_wordBased_pl_cached(org.joda.time.format.TestPeriodFormat)  Time elapsed: 0 sec  <<< ERROR!
java.lang.IllegalArgumentException
	at org.joda.time.format.PeriodFormatterBuilder.appendSuffix(PeriodFormatterBuilder.java:143)
	at org.joda.time.format.PeriodFormat.buildRegExFormatter(PeriodFormat.java:232)
	at org.joda.time.format.PeriodFormat.buildWordBased(PeriodFormat.java:219)
	at org.joda.time.format.PeriodFormat.wordBased(PeriodFormat.java:205)
	at org.joda.time.format.TestPeriodFormat.test_wordBased_pl_cached(TestPeriodFormat.java:419)

test_wordBased_pl_regEx(org.joda.time.format.TestPeriodFormat)  Time elapsed: 0 sec  <<< ERROR!
java.lang.IllegalArgumentException
	at org.joda.time.format.PeriodFormatterBuilder.appendSuffix(PeriodFormatterBuilder.java:143)
	at org.joda.time.format.PeriodFormat.buildRegExFormatter(PeriodFormat.java:232)
	at org.joda.time.format.PeriodFormat.buildWordBased(PeriodFormat.java:219)
	at org.joda.time.format.PeriodFormat.wordBased(PeriodFormat.java:205)
	at org.joda.time.format.TestPeriodFormat.test_wordBased_pl_regEx(TestPeriodFormat.java:424)

test_wordBased_pl_from_fr(org.joda.time.format.TestPeriodFormat)  Time elapsed: 0.001 sec  <<< ERROR!
java.lang.IllegalArgumentException
	at org.joda.time.format.PeriodFormatterBuilder.appendSuffix(PeriodFormatterBuilder.java:143)
	at org.joda.time.format.PeriodFormat.buildRegExFormatter(PeriodFormat.java:232)
	at org.joda.time.format.PeriodFormat.buildWordBased(PeriodFormat.java:219)
	at org.joda.time.format.PeriodFormat.wordBased(PeriodFormat.java:205)
	at org.joda.time.format.TestPeriodFormat.test_wordBased_pl_from_fr(TestPeriodFormat.java:610)

test_wordBased_pl_formatStandard(org.joda.time.format.TestPeriodFormat)  Time elapsed: 0.001 sec  <<< ERROR!
java.lang.IllegalArgumentException
	at org.joda.time.format.PeriodFormatterBuilder.appendSuffix(PeriodFormatterBuilder.java:143)
	at org.joda.time.format.PeriodFormat.buildRegExFormatter(PeriodFormat.java:232)
	at org.joda.time.format.PeriodFormat.buildWordBased(PeriodFormat.java:219)
	at org.joda.time.format.PeriodFormat.wordBased(PeriodFormat.java:205)
	at org.joda.time.format.TestPeriodFormat.test_wordBased_pl_formatStandard(TestPeriodFormat.java:380)

test_wordBased_pl_FormatOneField(org.joda.time.format.TestPeriodFormat)  Time elapsed: 0.001 sec  <<< ERROR!
java.lang.IllegalArgumentException
	at org.joda.time.format.PeriodFormatterBuilder.appendSuffix(PeriodFormatterBuilder.java:143)
	at org.joda.time.format.PeriodFormat.buildRegExFormatter(PeriodFormat.java:232)
	at org.joda.time.format.PeriodFormat.buildWordBased(PeriodFormat.java:219)
	at org.joda.time.format.PeriodFormat.wordBased(PeriodFormat.java:205)
	at org.joda.time.format.TestPeriodFormat.test_wordBased_pl_FormatOneField(TestPeriodFormat.java:386)

testRegExAffixParseOrder(org.joda.time.format.TestPeriodFormatterBuilder)  Time elapsed: 0 sec  <<< ERROR!
java.lang.IllegalArgumentException
	at org.joda.time.format.PeriodFormatterBuilder.appendSuffix(PeriodFormatterBuilder.java:143)
	at org.joda.time.format.TestPeriodFormatterBuilder.testRegExAffixParseOrder(TestPeriodFormatterBuilder.java:421)

testFormatSuffixRegEx1(org.joda.time.format.TestPeriodFormatterBuilder)  Time elapsed: 0.001 sec  <<< ERROR!
java.lang.IllegalArgumentException
	at org.joda.time.format.PeriodFormatterBuilder.appendSuffix(PeriodFormatterBuilder.java:143)
	at org.joda.time.format.TestPeriodFormatterBuilder.testFormatSuffixRegEx1(TestPeriodFormatterBuilder.java:645)

testFormatSuffixRegEx2(org.joda.time.format.TestPeriodFormatterBuilder)  Time elapsed: 0 sec  <<< ERROR!
java.lang.IllegalArgumentException
	at org.joda.time.format.PeriodFormatterBuilder.appendSuffix(PeriodFormatterBuilder.java:143)
	at org.joda.time.format.TestPeriodFormatterBuilder.testFormatSuffixRegEx2(TestPeriodFormatterBuilder.java:663)

testFormatSuffixRegEx3(org.joda.time.format.TestPeriodFormatterBuilder)  Time elapsed: 0 sec  <<< ERROR!
java.lang.IllegalStateException: No field to apply suffix to
	at org.joda.time.format.PeriodFormatterBuilder.appendSuffix(PeriodFormatterBuilder.java:151)
	at org.joda.time.format.PeriodFormatterBuilder.appendSuffix(PeriodFormatterBuilder.java:144)
	at org.joda.time.format.TestPeriodFormatterBuilder.testFormatSuffixRegEx3(TestPeriodFormatterBuilder.java:696)

testFormatSuffixRegEx4(org.joda.time.format.TestPeriodFormatterBuilder)  Time elapsed: 0.001 sec  <<< ERROR!
java.lang.IllegalArgumentException
	at org.joda.time.format.PeriodFormatterBuilder.appendSuffix(PeriodFormatterBuilder.java:143)
	at org.joda.time.format.TestPeriodFormatterBuilder.testFormatSuffixRegEx4(TestPeriodFormatterBuilder.java:709)

testFormatSuffixRegEx5IgnoringAffix(org.joda.time.format.TestPeriodFormatterBuilder)  Time elapsed: 0 sec  <<< ERROR!
java.lang.IllegalArgumentException
	at org.joda.time.format.PeriodFormatterBuilder.appendSuffix(PeriodFormatterBuilder.java:143)
	at org.joda.time.format.TestPeriodFormatterBuilder.testFormatSuffixRegEx5IgnoringAffix(TestPeriodFormatterBuilder.java:716)

testFormatSuffixComposite1(org.joda.time.format.TestPeriodFormatterBuilder)  Time elapsed: 0.001 sec  <<< ERROR!
java.lang.IllegalArgumentException
	at org.joda.time.format.PeriodFormatterBuilder.appendSuffix(PeriodFormatterBuilder.java:143)
	at org.joda.time.format.TestPeriodFormatterBuilder.testFormatSuffixComposite1(TestPeriodFormatterBuilder.java:737)


Results :

Tests in error: 
  org.joda.time.format.TestPeriodFormat#test_wordBased_pl_FormatOneField IllegalArgumentException
  org.joda.time.format.TestPeriodFormat#test_wordBased_pl_cached IllegalArgumentException
  org.joda.time.format.TestPeriodFormat#test_wordBased_pl_formatStandard IllegalArgumentException
  org.joda.time.format.TestPeriodFormat#test_wordBased_pl_formatTwoFields IllegalArgumentException
  org.joda.time.format.TestPeriodFormat#test_wordBased_pl_from_fr IllegalArgumentException
  org.joda.time.format.TestPeriodFormat#test_wordBased_pl_parseOneField IllegalArgumentException
  org.joda.time.format.TestPeriodFormat#test_wordBased_pl_parseTwoFields IllegalArgumentException
  org.joda.time.format.TestPeriodFormat#test_wordBased_pl_regEx IllegalArgumentException
  org.joda.time.format.TestPeriodFormatterBuilder#testFormatSuffixComposite1 IllegalArgumentException
  org.joda.time.format.TestPeriodFormatterBuilder#testFormatSuffixRegEx1 IllegalArgumentException
  org.joda.time.format.TestPeriodFormatterBuilder#testFormatSuffixRegEx2 IllegalArgumentException
  org.joda.time.format.TestPeriodFormatterBuilder#testFormatSuffixRegEx3 IllegalStateException
  org.joda.time.format.TestPeriodFormatterBuilder#testFormatSuffixRegEx4 IllegalArgumentException
  org.joda.time.format.TestPeriodFormatterBuilder#testFormatSuffixRegEx5IgnoringAffix IllegalArgumentException
  org.joda.time.format.TestPeriodFormatterBuilder#testRegExAffixParseOrder IllegalArgumentException

Tests run: 4157, Failures: 0, Errors: 15, Skipped: 0

[INFO] ------------------------------------------------------------------------
[INFO] BUILD FAILURE
[INFO] ------------------------------------------------------------------------
[INFO] Total time: 16.539s
[INFO] Finished at: Thu Aug 06 11:22:56 BST 2015
[INFO] Final Memory: 9M/210M
[INFO] ------------------------------------------------------------------------
[ERROR] Failed to execute goal org.apache.maven.plugins:maven-surefire-plugin:2.18.1:test (default-test) on project joda-time: There are test failures.
[ERROR] 
[ERROR] Please refer to /home/perham/Study/LittleDarwin/Cases/joda-time-2.8.1/target/surefire-reports for the individual test results.
[ERROR] -> [Help 1]
[ERROR] 
[ERROR] To see the full stack trace of the errors, re-run Maven with the -e switch.
[ERROR] Re-run Maven using the -X switch to enable full debug logging.
[ERROR] 
[ERROR] For more information about the errors and possible solutions, please read the following articles:
[ERROR] [Help 1] http://cwiki.apache.org/confluence/display/MAVEN/MojoFailureException
