[INFO] Scanning for projects...
[INFO]                                                                         
[INFO] ------------------------------------------------------------------------
[INFO] Building Joda-Time 2.8.1
[INFO] ------------------------------------------------------------------------
[INFO] 
[INFO] --- maven-resources-plugin:2.7:resources (default-resources) @ joda-time ---
[INFO] Using 'UTF-8' encoding to copy filtered resources.
[INFO] Copying 2 resources to META-INF
[INFO] Copying 10 resources
[INFO] 
[INFO] --- maven-compiler-plugin:3.3:compile (default-compile) @ joda-time ---
[INFO] Changes detected - recompiling the module!
[INFO] Compiling 166 source files to /home/perham/Study/LittleDarwin/Cases/joda-time-2.8.1/target/classes
[INFO] 
[INFO] --- exec-maven-plugin:1.4.0:java (compile-tzdb) @ joda-time ---
Writing zoneinfo files
Writing ZoneInfoMap
[INFO] 
[INFO] --- maven-resources-plugin:2.7:testResources (default-testResources) @ joda-time ---
[INFO] Using 'UTF-8' encoding to copy filtered resources.
[INFO] Copying 34 resources
[INFO] 
[INFO] --- maven-compiler-plugin:3.3:testCompile (default-testCompile) @ joda-time ---
[INFO] Nothing to compile - all classes are up to date
[INFO] 
[INFO] --- maven-surefire-plugin:2.18.1:test (default-test) @ joda-time ---
[INFO] Surefire report directory: /home/perham/Study/LittleDarwin/Cases/joda-time-2.8.1/target/surefire-reports

-------------------------------------------------------
 T E S T S
-------------------------------------------------------
Running org.joda.time.TestAllPackages

TestBuddhistChronology.testCalendar

TestCopticChronology.testCalendar

TestEthiopicChronology.testCalendar

TestIslamicChronology.testCalendar

Testing Gregorian chronology over 1000 iterations
100% complete (i=1000)

Testing Julian chronology over 1000 iterations
100% complete (i=1000)
Writing zoneinfo files
Writing ZoneInfoMap
Tests run: 4157, Failures: 3, Errors: 358, Skipped: 0, Time elapsed: 6.014 sec <<< FAILURE! - in org.joda.time.TestAllPackages
testToStandardDays(org.joda.time.TestDuration_Basics)  Time elapsed: 0.009 sec  <<< ERROR!
java.lang.ExceptionInInitializerError
	at org.joda.time.TestDuration_Basics.testToStandardDays(TestDuration_Basics.java:312)
Caused by: java.lang.IllegalStateException: No field to apply suffix to
	at org.joda.time.format.PeriodFormatterBuilder.appendSuffix(PeriodFormatterBuilder.java:151)
	at org.joda.time.format.PeriodFormatterBuilder.appendSuffix(PeriodFormatterBuilder.java:140)
	at org.joda.time.format.ISOPeriodFormat.standard(ISOPeriodFormat.java:66)
	at org.joda.time.Days.<clinit>(Days.java:66)
	... 27 more

testToStandardHours(org.joda.time.TestDuration_Basics)  Time elapsed: 0.001 sec  <<< ERROR!
java.lang.ExceptionInInitializerError
	at org.joda.time.TestDuration_Basics.testToStandardHours(TestDuration_Basics.java:346)
Caused by: java.lang.IllegalStateException: No field to apply suffix to
	at org.joda.time.format.PeriodFormatterBuilder.appendSuffix(PeriodFormatterBuilder.java:151)
	at org.joda.time.format.PeriodFormatterBuilder.appendSuffix(PeriodFormatterBuilder.java:140)
	at org.joda.time.format.ISOPeriodFormat.standard(ISOPeriodFormat.java:66)
	at org.joda.time.Hours.<clinit>(Hours.java:68)
	... 27 more

testToStandardMinutes(org.joda.time.TestDuration_Basics)  Time elapsed: 0.001 sec  <<< ERROR!
java.lang.ExceptionInInitializerError
	at org.joda.time.TestDuration_Basics.testToStandardMinutes(TestDuration_Basics.java:380)
Caused by: java.lang.IllegalStateException: No field to apply suffix to
	at org.joda.time.format.PeriodFormatterBuilder.appendSuffix(PeriodFormatterBuilder.java:151)
	at org.joda.time.format.PeriodFormatterBuilder.appendSuffix(PeriodFormatterBuilder.java:140)
	at org.joda.time.format.ISOPeriodFormat.standard(ISOPeriodFormat.java:66)
	at org.joda.time.Minutes.<clinit>(Minutes.java:58)
	... 27 more

testToStandardSeconds(org.joda.time.TestDuration_Basics)  Time elapsed: 0.001 sec  <<< ERROR!
java.lang.ExceptionInInitializerError
	at org.joda.time.TestDuration_Basics.testToStandardSeconds(TestDuration_Basics.java:414)
Caused by: java.lang.IllegalStateException: No field to apply suffix to
	at org.joda.time.format.PeriodFormatterBuilder.appendSuffix(PeriodFormatterBuilder.java:151)
	at org.joda.time.format.PeriodFormatterBuilder.appendSuffix(PeriodFormatterBuilder.java:140)
	at org.joda.time.format.ISOPeriodFormat.standard(ISOPeriodFormat.java:66)
	at org.joda.time.Seconds.<clinit>(Seconds.java:58)
	... 27 more

testParse_noFormatter(org.joda.time.TestInterval_Constructors)  Time elapsed: 0.002 sec  <<< ERROR!
java.lang.IllegalStateException: No field to apply suffix to
	at org.joda.time.format.PeriodFormatterBuilder.appendSuffix(PeriodFormatterBuilder.java:151)
	at org.joda.time.format.PeriodFormatterBuilder.appendSuffix(PeriodFormatterBuilder.java:140)
	at org.joda.time.format.ISOPeriodFormat.standard(ISOPeriodFormat.java:66)
	at org.joda.time.convert.StringConverter.setInto(StringConverter.java:202)
	at org.joda.time.base.BaseInterval.<init>(BaseInterval.java:200)
	at org.joda.time.Interval.<init>(Interval.java:193)
	at org.joda.time.Interval.parse(Interval.java:69)
	at org.joda.time.TestInterval_Constructors.testParse_noFormatter(TestInterval_Constructors.java:108)

testConstructor_Object1(org.joda.time.TestInterval_Constructors)  Time elapsed: 0.001 sec  <<< ERROR!
java.lang.IllegalStateException: No field to apply suffix to
	at org.joda.time.format.PeriodFormatterBuilder.appendSuffix(PeriodFormatterBuilder.java:151)
	at org.joda.time.format.PeriodFormatterBuilder.appendSuffix(PeriodFormatterBuilder.java:140)
	at org.joda.time.format.ISOPeriodFormat.standard(ISOPeriodFormat.java:66)
	at org.joda.time.convert.StringConverter.setInto(StringConverter.java:202)
	at org.joda.time.base.BaseInterval.<init>(BaseInterval.java:200)
	at org.joda.time.Interval.<init>(Interval.java:193)
	at org.joda.time.TestInterval_Constructors.testConstructor_Object1(TestInterval_Constructors.java:535)

testToString_reparse(org.joda.time.TestInterval_Basics)  Time elapsed: 0 sec  <<< ERROR!
java.lang.IllegalStateException: No field to apply suffix to
	at org.joda.time.format.PeriodFormatterBuilder.appendSuffix(PeriodFormatterBuilder.java:151)
	at org.joda.time.format.PeriodFormatterBuilder.appendSuffix(PeriodFormatterBuilder.java:140)
	at org.joda.time.format.ISOPeriodFormat.standard(ISOPeriodFormat.java:66)
	at org.joda.time.convert.StringConverter.setInto(StringConverter.java:202)
	at org.joda.time.base.BaseInterval.<init>(BaseInterval.java:200)
	at org.joda.time.Interval.<init>(Interval.java:193)
	at org.joda.time.TestInterval_Basics.testToString_reparse(TestInterval_Basics.java:1053)

testParse_noFormatter(org.joda.time.TestMutableInterval_Constructors)  Time elapsed: 0 sec  <<< ERROR!
java.lang.IllegalStateException: No field to apply suffix to
	at org.joda.time.format.PeriodFormatterBuilder.appendSuffix(PeriodFormatterBuilder.java:151)
	at org.joda.time.format.PeriodFormatterBuilder.appendSuffix(PeriodFormatterBuilder.java:140)
	at org.joda.time.format.ISOPeriodFormat.standard(ISOPeriodFormat.java:66)
	at org.joda.time.convert.StringConverter.setInto(StringConverter.java:202)
	at org.joda.time.base.BaseInterval.<init>(BaseInterval.java:197)
	at org.joda.time.MutableInterval.<init>(MutableInterval.java:186)
	at org.joda.time.MutableInterval.parse(MutableInterval.java:71)
	at org.joda.time.TestMutableInterval_Constructors.testParse_noFormatter(TestMutableInterval_Constructors.java:114)

testConstructor_Object1(org.joda.time.TestMutableInterval_Constructors)  Time elapsed: 0.001 sec  <<< ERROR!
java.lang.IllegalStateException: No field to apply suffix to
	at org.joda.time.format.PeriodFormatterBuilder.appendSuffix(PeriodFormatterBuilder.java:151)
	at org.joda.time.format.PeriodFormatterBuilder.appendSuffix(PeriodFormatterBuilder.java:140)
	at org.joda.time.format.ISOPeriodFormat.standard(ISOPeriodFormat.java:66)
	at org.joda.time.convert.StringConverter.setInto(StringConverter.java:202)
	at org.joda.time.base.BaseInterval.<init>(BaseInterval.java:197)
	at org.joda.time.MutableInterval.<init>(MutableInterval.java:186)
	at org.joda.time.TestMutableInterval_Constructors.testConstructor_Object1(TestMutableInterval_Constructors.java:511)

testParse_noFormatter(org.joda.time.TestPeriod_Constructors)  Time elapsed: 0.001 sec  <<< ERROR!
java.lang.IllegalStateException: No field to apply suffix to
	at org.joda.time.format.PeriodFormatterBuilder.appendSuffix(PeriodFormatterBuilder.java:151)
	at org.joda.time.format.PeriodFormatterBuilder.appendSuffix(PeriodFormatterBuilder.java:140)
	at org.joda.time.format.ISOPeriodFormat.standard(ISOPeriodFormat.java:66)
	at org.joda.time.Period.parse(Period.java:81)
	at org.joda.time.TestPeriod_Constructors.testParse_noFormatter(TestPeriod_Constructors.java:104)

testConstructor_Object_PeriodType1(org.joda.time.TestPeriod_Constructors)  Time elapsed: 0 sec  <<< ERROR!
java.lang.IllegalStateException: No field to apply suffix to
	at org.joda.time.format.PeriodFormatterBuilder.appendSuffix(PeriodFormatterBuilder.java:151)
	at org.joda.time.format.PeriodFormatterBuilder.appendSuffix(PeriodFormatterBuilder.java:140)
	at org.joda.time.format.ISOPeriodFormat.standard(ISOPeriodFormat.java:66)
	at org.joda.time.convert.StringConverter.setInto(StringConverter.java:163)
	at org.joda.time.base.BasePeriod.<init>(BasePeriod.java:279)
	at org.joda.time.MutablePeriod.<init>(MutablePeriod.java:426)
	at org.joda.time.base.BasePeriod.<init>(BasePeriod.java:281)
	at org.joda.time.Period.<init>(Period.java:691)
	at org.joda.time.TestPeriod_Constructors.testConstructor_Object_PeriodType1(TestPeriod_Constructors.java:1202)

testConstructor_Object1(org.joda.time.TestPeriod_Constructors)  Time elapsed: 0.001 sec  <<< ERROR!
java.lang.IllegalStateException: No field to apply suffix to
	at org.joda.time.format.PeriodFormatterBuilder.appendSuffix(PeriodFormatterBuilder.java:151)
	at org.joda.time.format.PeriodFormatterBuilder.appendSuffix(PeriodFormatterBuilder.java:140)
	at org.joda.time.format.ISOPeriodFormat.standard(ISOPeriodFormat.java:66)
	at org.joda.time.convert.StringConverter.setInto(StringConverter.java:163)
	at org.joda.time.base.BasePeriod.<init>(BasePeriod.java:279)
	at org.joda.time.MutablePeriod.<init>(MutablePeriod.java:426)
	at org.joda.time.base.BasePeriod.<init>(BasePeriod.java:281)
	at org.joda.time.Period.<init>(Period.java:674)
	at org.joda.time.TestPeriod_Constructors.testConstructor_Object1(TestPeriod_Constructors.java:1145)

testToString(org.joda.time.TestPeriod_Basics)  Time elapsed: 0.001 sec  <<< ERROR!
java.lang.IllegalStateException: No field to apply suffix to
	at org.joda.time.format.PeriodFormatterBuilder.appendSuffix(PeriodFormatterBuilder.java:151)
	at org.joda.time.format.PeriodFormatterBuilder.appendSuffix(PeriodFormatterBuilder.java:140)
	at org.joda.time.format.ISOPeriodFormat.standard(ISOPeriodFormat.java:66)
	at org.joda.time.base.AbstractPeriod.toString(AbstractPeriod.java:228)
	at org.joda.time.TestPeriod_Basics.testToString(TestPeriod_Basics.java:472)

testToString_PeriodFormatter(org.joda.time.TestPeriod_Basics)  Time elapsed: 0.004 sec  <<< ERROR!
java.lang.IllegalStateException: No field to apply suffix to
	at org.joda.time.format.PeriodFormatterBuilder.appendSuffix(PeriodFormatterBuilder.java:151)
	at org.joda.time.format.PeriodFormatterBuilder.appendSuffix(PeriodFormatterBuilder.java:142)
	at org.joda.time.format.PeriodFormat.buildNonRegExFormatter(PeriodFormat.java:313)
	at org.joda.time.format.PeriodFormat.buildWordBased(PeriodFormat.java:221)
	at org.joda.time.format.PeriodFormat.wordBased(PeriodFormat.java:205)
	at org.joda.time.format.PeriodFormat.getDefault(PeriodFormat.java:73)
	at org.joda.time.TestPeriod_Basics.testToString_PeriodFormatter(TestPeriod_Basics.java:484)

testToString_nullPeriodFormatter(org.joda.time.TestPeriod_Basics)  Time elapsed: 0.001 sec  <<< ERROR!
java.lang.IllegalStateException: No field to apply suffix to
	at org.joda.time.format.PeriodFormatterBuilder.appendSuffix(PeriodFormatterBuilder.java:151)
	at org.joda.time.format.PeriodFormatterBuilder.appendSuffix(PeriodFormatterBuilder.java:140)
	at org.joda.time.format.ISOPeriodFormat.standard(ISOPeriodFormat.java:66)
	at org.joda.time.base.AbstractPeriod.toString(AbstractPeriod.java:228)
	at org.joda.time.base.AbstractPeriod.toString(AbstractPeriod.java:241)
	at org.joda.time.TestPeriod_Basics.testToString_nullPeriodFormatter(TestPeriod_Basics.java:492)

testPlus(org.joda.time.TestPeriod_Basics)  Time elapsed: 0.001 sec  <<< ERROR!
java.lang.ExceptionInInitializerError
	at org.joda.time.TestPeriod_Basics.testPlus(TestPeriod_Basics.java:728)
Caused by: java.lang.IllegalStateException: No field to apply suffix to
	at org.joda.time.format.PeriodFormatterBuilder.appendSuffix(PeriodFormatterBuilder.java:151)
	at org.joda.time.format.PeriodFormatterBuilder.appendSuffix(PeriodFormatterBuilder.java:140)
	at org.joda.time.format.ISOPeriodFormat.standard(ISOPeriodFormat.java:66)
	at org.joda.time.Years.<clinit>(Years.java:58)
	... 27 more

testMinus(org.joda.time.TestPeriod_Basics)  Time elapsed: 0.001 sec  <<< ERROR!
java.lang.NoClassDefFoundError: Could not initialize class org.joda.time.Years
	at org.joda.time.TestPeriod_Basics.testMinus(TestPeriod_Basics.java:802)

testToStandardWeeks(org.joda.time.TestPeriod_Basics)  Time elapsed: 0 sec  <<< ERROR!
java.lang.ExceptionInInitializerError
	at org.joda.time.Period.toStandardWeeks(Period.java:1403)
	at org.joda.time.TestPeriod_Basics.testToStandardWeeks(TestPeriod_Basics.java:1019)
Caused by: java.lang.IllegalStateException: No field to apply suffix to
	at org.joda.time.format.PeriodFormatterBuilder.appendSuffix(PeriodFormatterBuilder.java:151)
	at org.joda.time.format.PeriodFormatterBuilder.appendSuffix(PeriodFormatterBuilder.java:140)
	at org.joda.time.format.ISOPeriodFormat.standard(ISOPeriodFormat.java:66)
	at org.joda.time.Weeks.<clinit>(Weeks.java:58)
	... 28 more

testToStandardWeeks_years(org.joda.time.TestPeriod_Basics)  Time elapsed: 0 sec  <<< ERROR!
java.lang.NoClassDefFoundError: Could not initialize class org.joda.time.Weeks
	at org.joda.time.Period.toStandardWeeks(Period.java:1403)
	at org.joda.time.TestPeriod_Basics.testToStandardWeeks_years(TestPeriod_Basics.java:1062)

testToStandardWeeks_months(org.joda.time.TestPeriod_Basics)  Time elapsed: 0 sec  <<< ERROR!
java.lang.NoClassDefFoundError: Could not initialize class org.joda.time.Weeks
	at org.joda.time.Period.toStandardWeeks(Period.java:1403)
	at org.joda.time.TestPeriod_Basics.testToStandardWeeks_months(TestPeriod_Basics.java:1079)

testToStandardDays_years(org.joda.time.TestPeriod_Basics)  Time elapsed: 0 sec  <<< ERROR!
java.lang.NoClassDefFoundError: Could not initialize class org.joda.time.Days
	at org.joda.time.Period.toStandardDays(Period.java:1434)
	at org.joda.time.TestPeriod_Basics.testToStandardDays_years(TestPeriod_Basics.java:1127)

testToStandardDays_months(org.joda.time.TestPeriod_Basics)  Time elapsed: 0 sec  <<< ERROR!
java.lang.NoClassDefFoundError: Could not initialize class org.joda.time.Days
	at org.joda.time.Period.toStandardDays(Period.java:1434)
	at org.joda.time.TestPeriod_Basics.testToStandardDays_months(TestPeriod_Basics.java:1144)

testToStandardHours_years(org.joda.time.TestPeriod_Basics)  Time elapsed: 0.001 sec  <<< ERROR!
java.lang.NoClassDefFoundError: Could not initialize class org.joda.time.Hours
	at org.joda.time.Period.toStandardHours(Period.java:1465)
	at org.joda.time.TestPeriod_Basics.testToStandardHours_years(TestPeriod_Basics.java:1191)

testToStandardHours_months(org.joda.time.TestPeriod_Basics)  Time elapsed: 0 sec  <<< ERROR!
java.lang.NoClassDefFoundError: Could not initialize class org.joda.time.Hours
	at org.joda.time.Period.toStandardHours(Period.java:1465)
	at org.joda.time.TestPeriod_Basics.testToStandardHours_months(TestPeriod_Basics.java:1208)

testToStandardMinutes_years(org.joda.time.TestPeriod_Basics)  Time elapsed: 0.001 sec  <<< ERROR!
java.lang.NoClassDefFoundError: Could not initialize class org.joda.time.Minutes
	at org.joda.time.Period.toStandardMinutes(Period.java:1496)
	at org.joda.time.TestPeriod_Basics.testToStandardMinutes_years(TestPeriod_Basics.java:1254)

testToStandardMinutes_months(org.joda.time.TestPeriod_Basics)  Time elapsed: 0.001 sec  <<< ERROR!
java.lang.NoClassDefFoundError: Could not initialize class org.joda.time.Minutes
	at org.joda.time.Period.toStandardMinutes(Period.java:1496)
	at org.joda.time.TestPeriod_Basics.testToStandardMinutes_months(TestPeriod_Basics.java:1271)

testToStandardSeconds_years(org.joda.time.TestPeriod_Basics)  Time elapsed: 0 sec  <<< ERROR!
java.lang.NoClassDefFoundError: Could not initialize class org.joda.time.Seconds
	at org.joda.time.Period.toStandardSeconds(Period.java:1526)
	at org.joda.time.TestPeriod_Basics.testToStandardSeconds_years(TestPeriod_Basics.java:1314)

testToStandardSeconds_months(org.joda.time.TestPeriod_Basics)  Time elapsed: 0 sec  <<< ERROR!
java.lang.NoClassDefFoundError: Could not initialize class org.joda.time.Seconds
	at org.joda.time.Period.toStandardSeconds(Period.java:1526)
	at org.joda.time.TestPeriod_Basics.testToStandardSeconds_months(TestPeriod_Basics.java:1331)

testNormalizedStandard_periodType_yearMonth3(org.joda.time.TestPeriod_Basics)  Time elapsed: 0 sec  <<< ERROR!
java.lang.IllegalStateException: No field to apply suffix to
	at org.joda.time.format.PeriodFormatterBuilder.appendSuffix(PeriodFormatterBuilder.java:151)
	at org.joda.time.format.PeriodFormatterBuilder.appendSuffix(PeriodFormatterBuilder.java:140)
	at org.joda.time.format.ISOPeriodFormat.standard(ISOPeriodFormat.java:66)
	at org.joda.time.base.AbstractPeriod.toString(AbstractPeriod.java:228)
	at org.joda.time.Period.normalizedStandard(Period.java:1660)
	at org.joda.time.TestPeriod_Basics.testNormalizedStandard_periodType_yearMonth3(TestPeriod_Basics.java:1479)

testNormalizedStandard_periodType_years(org.joda.time.TestPeriod_Basics)  Time elapsed: 0 sec  <<< ERROR!
java.lang.IllegalStateException: No field to apply suffix to
	at org.joda.time.format.PeriodFormatterBuilder.appendSuffix(PeriodFormatterBuilder.java:151)
	at org.joda.time.format.PeriodFormatterBuilder.appendSuffix(PeriodFormatterBuilder.java:140)
	at org.joda.time.format.ISOPeriodFormat.standard(ISOPeriodFormat.java:66)
	at org.joda.time.base.AbstractPeriod.toString(AbstractPeriod.java:228)
	at org.joda.time.Period.normalizedStandard(Period.java:1660)
	at org.joda.time.TestPeriod_Basics.testNormalizedStandard_periodType_years(TestPeriod_Basics.java:1544)

testToStandardDays(org.joda.time.TestPeriod_Basics)  Time elapsed: 0 sec  <<< ERROR!
java.lang.NoClassDefFoundError: Could not initialize class org.joda.time.Days
	at org.joda.time.Period.toStandardDays(Period.java:1434)
	at org.joda.time.TestPeriod_Basics.testToStandardDays(TestPeriod_Basics.java:1085)

testToStandardHours(org.joda.time.TestPeriod_Basics)  Time elapsed: 0.001 sec  <<< ERROR!
java.lang.NoClassDefFoundError: Could not initialize class org.joda.time.Hours
	at org.joda.time.Period.toStandardHours(Period.java:1465)
	at org.joda.time.TestPeriod_Basics.testToStandardHours(TestPeriod_Basics.java:1150)

testToStandardMinutes(org.joda.time.TestPeriod_Basics)  Time elapsed: 0 sec  <<< ERROR!
java.lang.NoClassDefFoundError: Could not initialize class org.joda.time.Minutes
	at org.joda.time.Period.toStandardMinutes(Period.java:1496)
	at org.joda.time.TestPeriod_Basics.testToStandardMinutes(TestPeriod_Basics.java:1214)

testToStandardSeconds(org.joda.time.TestPeriod_Basics)  Time elapsed: 0 sec  <<< ERROR!
java.lang.NoClassDefFoundError: Could not initialize class org.joda.time.Seconds
	at org.joda.time.Period.toStandardSeconds(Period.java:1526)
	at org.joda.time.TestPeriod_Basics.testToStandardSeconds(TestPeriod_Basics.java:1277)

testParse_noFormatter(org.joda.time.TestMutablePeriod_Constructors)  Time elapsed: 0.001 sec  <<< ERROR!
java.lang.IllegalStateException: No field to apply suffix to
	at org.joda.time.format.PeriodFormatterBuilder.appendSuffix(PeriodFormatterBuilder.java:151)
	at org.joda.time.format.PeriodFormatterBuilder.appendSuffix(PeriodFormatterBuilder.java:140)
	at org.joda.time.format.ISOPeriodFormat.standard(ISOPeriodFormat.java:66)
	at org.joda.time.MutablePeriod.parse(MutablePeriod.java:74)
	at org.joda.time.TestMutablePeriod_Constructors.testParse_noFormatter(TestMutablePeriod_Constructors.java:102)

testConstructor_Object_PeriodType1(org.joda.time.TestMutablePeriod_Constructors)  Time elapsed: 0 sec  <<< ERROR!
java.lang.IllegalStateException: No field to apply suffix to
	at org.joda.time.format.PeriodFormatterBuilder.appendSuffix(PeriodFormatterBuilder.java:151)
	at org.joda.time.format.PeriodFormatterBuilder.appendSuffix(PeriodFormatterBuilder.java:140)
	at org.joda.time.format.ISOPeriodFormat.standard(ISOPeriodFormat.java:66)
	at org.joda.time.convert.StringConverter.setInto(StringConverter.java:163)
	at org.joda.time.base.BasePeriod.<init>(BasePeriod.java:279)
	at org.joda.time.MutablePeriod.<init>(MutablePeriod.java:391)
	at org.joda.time.TestMutablePeriod_Constructors.testConstructor_Object_PeriodType1(TestMutablePeriod_Constructors.java:884)

testConstructor_Object1(org.joda.time.TestMutablePeriod_Constructors)  Time elapsed: 0.001 sec  <<< ERROR!
java.lang.IllegalStateException: No field to apply suffix to
	at org.joda.time.format.PeriodFormatterBuilder.appendSuffix(PeriodFormatterBuilder.java:151)
	at org.joda.time.format.PeriodFormatterBuilder.appendSuffix(PeriodFormatterBuilder.java:140)
	at org.joda.time.format.ISOPeriodFormat.standard(ISOPeriodFormat.java:66)
	at org.joda.time.convert.StringConverter.setInto(StringConverter.java:163)
	at org.joda.time.base.BasePeriod.<init>(BasePeriod.java:279)
	at org.joda.time.MutablePeriod.<init>(MutablePeriod.java:374)
	at org.joda.time.TestMutablePeriod_Constructors.testConstructor_Object1(TestMutablePeriod_Constructors.java:827)

testToString(org.joda.time.TestMutablePeriod_Basics)  Time elapsed: 0.001 sec  <<< ERROR!
java.lang.IllegalStateException: No field to apply suffix to
	at org.joda.time.format.PeriodFormatterBuilder.appendSuffix(PeriodFormatterBuilder.java:151)
	at org.joda.time.format.PeriodFormatterBuilder.appendSuffix(PeriodFormatterBuilder.java:140)
	at org.joda.time.format.ISOPeriodFormat.standard(ISOPeriodFormat.java:66)
	at org.joda.time.base.AbstractPeriod.toString(AbstractPeriod.java:228)
	at org.joda.time.TestMutablePeriod_Basics.testToString(TestMutablePeriod_Basics.java:405)

testEqualsHashCode(org.joda.time.TestBaseSingleFieldPeriod)  Time elapsed: 0 sec  <<< ERROR!
java.lang.NoClassDefFoundError: Could not initialize class org.joda.time.Days
	at org.joda.time.TestBaseSingleFieldPeriod.testEqualsHashCode(TestBaseSingleFieldPeriod.java:223)

testFactory_standardPeriodIn_RPeriod(org.joda.time.TestBaseSingleFieldPeriod)  Time elapsed: 0.001 sec  <<< ERROR!
java.lang.IllegalStateException: No field to apply suffix to
	at org.joda.time.format.PeriodFormatterBuilder.appendSuffix(PeriodFormatterBuilder.java:151)
	at org.joda.time.format.PeriodFormatterBuilder.appendSuffix(PeriodFormatterBuilder.java:140)
	at org.joda.time.format.ISOPeriodFormat.standard(ISOPeriodFormat.java:66)
	at org.joda.time.base.AbstractPeriod.toString(AbstractPeriod.java:228)
	at java.lang.String.valueOf(String.java:2847)
	at java.lang.StringBuilder.append(StringBuilder.java:128)
	at org.joda.time.base.BaseSingleFieldPeriod.standardPeriodIn(BaseSingleFieldPeriod.java:140)
	at org.joda.time.TestBaseSingleFieldPeriod$Single.standardPeriodIn(TestBaseSingleFieldPeriod.java:314)
	at org.joda.time.TestBaseSingleFieldPeriod.testFactory_standardPeriodIn_RPeriod(TestBaseSingleFieldPeriod.java:147)

testToString(org.joda.time.TestYears)  Time elapsed: 0 sec  <<< ERROR!
java.lang.NoClassDefFoundError: Could not initialize class org.joda.time.Years
	at org.joda.time.TestYears.testToString(TestYears.java:170)

testSerialization(org.joda.time.TestYears)  Time elapsed: 0.001 sec  <<< ERROR!
java.lang.NoClassDefFoundError: Could not initialize class org.joda.time.Years
	at org.joda.time.TestYears.testSerialization(TestYears.java:179)

testGetMethods(org.joda.time.TestYears)  Time elapsed: 0 sec  <<< ERROR!
java.lang.NoClassDefFoundError: Could not initialize class org.joda.time.Years
	at org.joda.time.TestYears.testGetMethods(TestYears.java:137)

testConstants(org.joda.time.TestYears)  Time elapsed: 0.001 sec  <<< ERROR!
java.lang.NoClassDefFoundError: Could not initialize class org.joda.time.Years
	at org.joda.time.TestYears.testConstants(TestYears.java:56)

testFactory_yearsBetween_RPartial(org.joda.time.TestYears)  Time elapsed: 0 sec  <<< ERROR!
java.lang.NoClassDefFoundError: Could not initialize class org.joda.time.Years
	at org.joda.time.TestYears.testFactory_yearsBetween_RPartial(TestYears.java:95)

testFactory_yearsIn_RInterval(org.joda.time.TestYears)  Time elapsed: 0.001 sec  <<< ERROR!
java.lang.NoClassDefFoundError: Could not initialize class org.joda.time.Years
	at org.joda.time.TestYears.testFactory_yearsIn_RInterval(TestYears.java:107)

testFactory_parseYears_String(org.joda.time.TestYears)  Time elapsed: 0 sec  <<< ERROR!
java.lang.NoClassDefFoundError: Could not initialize class org.joda.time.Years
	at org.joda.time.TestYears.testFactory_parseYears_String(TestYears.java:115)

testGetFieldType(org.joda.time.TestYears)  Time elapsed: 0.001 sec  <<< ERROR!
java.lang.NoClassDefFoundError: Could not initialize class org.joda.time.Years
	at org.joda.time.TestYears.testGetFieldType(TestYears.java:142)

testIsGreaterThan(org.joda.time.TestYears)  Time elapsed: 0 sec  <<< ERROR!
java.lang.NoClassDefFoundError: Could not initialize class org.joda.time.Years
	at org.joda.time.TestYears.testIsGreaterThan(TestYears.java:153)

testIsLessThan(org.joda.time.TestYears)  Time elapsed: 0 sec  <<< ERROR!
java.lang.NoClassDefFoundError: Could not initialize class org.joda.time.Years
	at org.joda.time.TestYears.testIsLessThan(TestYears.java:161)

testPlus_Years(org.joda.time.TestYears)  Time elapsed: 0.001 sec  <<< ERROR!
java.lang.NoClassDefFoundError: Could not initialize class org.joda.time.Years
	at org.joda.time.TestYears.testPlus_Years(TestYears.java:213)

testMinus_int(org.joda.time.TestYears)  Time elapsed: 0 sec  <<< ERROR!
java.lang.NoClassDefFoundError: Could not initialize class org.joda.time.Years
	at org.joda.time.TestYears.testMinus_int(TestYears.java:232)

testMinus_Years(org.joda.time.TestYears)  Time elapsed: 0.001 sec  <<< ERROR!
java.lang.NoClassDefFoundError: Could not initialize class org.joda.time.Years
	at org.joda.time.TestYears.testMinus_Years(TestYears.java:248)

testFactory_years_int(org.joda.time.TestYears)  Time elapsed: 0 sec  <<< ERROR!
java.lang.NoClassDefFoundError: Could not initialize class org.joda.time.Years
	at org.joda.time.TestYears.testFactory_years_int(TestYears.java:66)

testFactory_yearsBetween_RInstant(org.joda.time.TestYears)  Time elapsed: 0.001 sec  <<< ERROR!
java.lang.NoClassDefFoundError: Could not initialize class org.joda.time.Years
	at org.joda.time.TestYears.testFactory_yearsBetween_RInstant(TestYears.java:82)

testNegated(org.joda.time.TestYears)  Time elapsed: 0 sec  <<< ERROR!
java.lang.NoClassDefFoundError: Could not initialize class org.joda.time.Years
	at org.joda.time.TestYears.testNegated(TestYears.java:301)

testGetPeriodType(org.joda.time.TestYears)  Time elapsed: 0 sec  <<< ERROR!
java.lang.NoClassDefFoundError: Could not initialize class org.joda.time.Years
	at org.joda.time.TestYears.testGetPeriodType(TestYears.java:147)

testPlus_int(org.joda.time.TestYears)  Time elapsed: 0.001 sec  <<< ERROR!
java.lang.NoClassDefFoundError: Could not initialize class org.joda.time.Years
	at org.joda.time.TestYears.testPlus_int(TestYears.java:197)

testMultipliedBy_int(org.joda.time.TestYears)  Time elapsed: 0 sec  <<< ERROR!
java.lang.NoClassDefFoundError: Could not initialize class org.joda.time.Years
	at org.joda.time.TestYears.testMultipliedBy_int(TestYears.java:267)

testDividedBy_int(org.joda.time.TestYears)  Time elapsed: 0.001 sec  <<< ERROR!
java.lang.NoClassDefFoundError: Could not initialize class org.joda.time.Years
	at org.joda.time.TestYears.testDividedBy_int(TestYears.java:283)

testAddToLocalDate(org.joda.time.TestYears)  Time elapsed: 0 sec  <<< ERROR!
java.lang.NoClassDefFoundError: Could not initialize class org.joda.time.Years
	at org.joda.time.TestYears.testAddToLocalDate(TestYears.java:315)

testToString(org.joda.time.TestMonths)  Time elapsed: 0.003 sec  <<< ERROR!
java.lang.ExceptionInInitializerError
	at org.joda.time.TestMonths.testToString(TestMonths.java:215)
Caused by: java.lang.IllegalStateException: No field to apply suffix to
	at org.joda.time.format.PeriodFormatterBuilder.appendSuffix(PeriodFormatterBuilder.java:151)
	at org.joda.time.format.PeriodFormatterBuilder.appendSuffix(PeriodFormatterBuilder.java:140)
	at org.joda.time.format.ISOPeriodFormat.standard(ISOPeriodFormat.java:66)
	at org.joda.time.Months.<clinit>(Months.java:76)
	... 27 more

testSerialization(org.joda.time.TestMonths)  Time elapsed: 0.001 sec  <<< ERROR!
java.lang.NoClassDefFoundError: Could not initialize class org.joda.time.Months
	at org.joda.time.TestMonths.testSerialization(TestMonths.java:224)

testGetMethods(org.joda.time.TestMonths)  Time elapsed: 0 sec  <<< ERROR!
java.lang.NoClassDefFoundError: Could not initialize class org.joda.time.Months
	at org.joda.time.TestMonths.testGetMethods(TestMonths.java:182)

testConstants(org.joda.time.TestMonths)  Time elapsed: 0.001 sec  <<< ERROR!
java.lang.NoClassDefFoundError: Could not initialize class org.joda.time.Months
	at org.joda.time.TestMonths.testConstants(TestMonths.java:56)

testFactory_monthsBetween_RPartial_LocalDate(org.joda.time.TestMonths)  Time elapsed: 0.001 sec  <<< ERROR!
java.lang.NoClassDefFoundError: Could not initialize class org.joda.time.Months
	at org.joda.time.TestMonths.testFactory_monthsBetween_RPartial_LocalDate(TestMonths.java:114)

testFactory_monthsBetween_RPartial_YearMonth(org.joda.time.TestMonths)  Time elapsed: 0.001 sec  <<< ERROR!
java.lang.NoClassDefFoundError: Could not initialize class org.joda.time.Months
	at org.joda.time.TestMonths.testFactory_monthsBetween_RPartial_YearMonth(TestMonths.java:126)

testFactory_monthsBetween_RPartial_MonthDay(org.joda.time.TestMonths)  Time elapsed: 0.001 sec  <<< ERROR!
java.lang.NoClassDefFoundError: Could not initialize class org.joda.time.Months
	at org.joda.time.TestMonths.testFactory_monthsBetween_RPartial_MonthDay(TestMonths.java:137)

testFactory_monthsIn_RInterval(org.joda.time.TestMonths)  Time elapsed: 0.001 sec  <<< ERROR!
java.lang.NoClassDefFoundError: Could not initialize class org.joda.time.Months
	at org.joda.time.TestMonths.testFactory_monthsIn_RInterval(TestMonths.java:152)

testGetFieldType(org.joda.time.TestMonths)  Time elapsed: 0 sec  <<< ERROR!
java.lang.NoClassDefFoundError: Could not initialize class org.joda.time.Months
	at org.joda.time.TestMonths.testGetFieldType(TestMonths.java:187)

testIsGreaterThan(org.joda.time.TestMonths)  Time elapsed: 0.001 sec  <<< ERROR!
java.lang.NoClassDefFoundError: Could not initialize class org.joda.time.Months
	at org.joda.time.TestMonths.testIsGreaterThan(TestMonths.java:198)

testIsLessThan(org.joda.time.TestMonths)  Time elapsed: 0 sec  <<< ERROR!
java.lang.NoClassDefFoundError: Could not initialize class org.joda.time.Months
	at org.joda.time.TestMonths.testIsLessThan(TestMonths.java:206)

testMinus_int(org.joda.time.TestMonths)  Time elapsed: 0.001 sec  <<< ERROR!
java.lang.NoClassDefFoundError: Could not initialize class org.joda.time.Months
	at org.joda.time.TestMonths.testMinus_int(TestMonths.java:277)

testNegated(org.joda.time.TestMonths)  Time elapsed: 0 sec  <<< ERROR!
java.lang.NoClassDefFoundError: Could not initialize class org.joda.time.Months
	at org.joda.time.TestMonths.testNegated(TestMonths.java:346)

testGetPeriodType(org.joda.time.TestMonths)  Time elapsed: 0.001 sec  <<< ERROR!
java.lang.NoClassDefFoundError: Could not initialize class org.joda.time.Months
	at org.joda.time.TestMonths.testGetPeriodType(TestMonths.java:192)

testFactory_parseMonths_String(org.joda.time.TestMonths)  Time elapsed: 0 sec  <<< ERROR!
java.lang.NoClassDefFoundError: Could not initialize class org.joda.time.Months
	at org.joda.time.TestMonths.testFactory_parseMonths_String(TestMonths.java:160)

testMinus_Months(org.joda.time.TestMonths)  Time elapsed: 0 sec  <<< ERROR!
java.lang.NoClassDefFoundError: Could not initialize class org.joda.time.Months
	at org.joda.time.TestMonths.testMinus_Months(TestMonths.java:293)

testPlus_int(org.joda.time.TestMonths)  Time elapsed: 0.001 sec  <<< ERROR!
java.lang.NoClassDefFoundError: Could not initialize class org.joda.time.Months
	at org.joda.time.TestMonths.testPlus_int(TestMonths.java:242)

testMultipliedBy_int(org.joda.time.TestMonths)  Time elapsed: 0 sec  <<< ERROR!
java.lang.NoClassDefFoundError: Could not initialize class org.joda.time.Months
	at org.joda.time.TestMonths.testMultipliedBy_int(TestMonths.java:312)

testDividedBy_int(org.joda.time.TestMonths)  Time elapsed: 0.001 sec  <<< ERROR!
java.lang.NoClassDefFoundError: Could not initialize class org.joda.time.Months
	at org.joda.time.TestMonths.testDividedBy_int(TestMonths.java:328)

testAddToLocalDate(org.joda.time.TestMonths)  Time elapsed: 0 sec  <<< ERROR!
java.lang.NoClassDefFoundError: Could not initialize class org.joda.time.Months
	at org.joda.time.TestMonths.testAddToLocalDate(TestMonths.java:360)

testFactory_months_int(org.joda.time.TestMonths)  Time elapsed: 0 sec  <<< ERROR!
java.lang.NoClassDefFoundError: Could not initialize class org.joda.time.Months
	at org.joda.time.TestMonths.testFactory_months_int(TestMonths.java:75)

testFactory_monthsBetween_RInstant(org.joda.time.TestMonths)  Time elapsed: 0.001 sec  <<< ERROR!
java.lang.NoClassDefFoundError: Could not initialize class org.joda.time.Months
	at org.joda.time.TestMonths.testFactory_monthsBetween_RInstant(TestMonths.java:100)

testPlus_Months(org.joda.time.TestMonths)  Time elapsed: 0.001 sec  <<< ERROR!
java.lang.NoClassDefFoundError: Could not initialize class org.joda.time.Months
	at org.joda.time.TestMonths.testPlus_Months(TestMonths.java:258)

testToString(org.joda.time.TestWeeks)  Time elapsed: 0.001 sec  <<< ERROR!
java.lang.NoClassDefFoundError: Could not initialize class org.joda.time.Weeks
	at org.joda.time.TestWeeks.testToString(TestWeeks.java:187)

testSerialization(org.joda.time.TestWeeks)  Time elapsed: 0 sec  <<< ERROR!
java.lang.NoClassDefFoundError: Could not initialize class org.joda.time.Weeks
	at org.joda.time.TestWeeks.testSerialization(TestWeeks.java:196)

testGetMethods(org.joda.time.TestWeeks)  Time elapsed: 0.001 sec  <<< ERROR!
java.lang.NoClassDefFoundError: Could not initialize class org.joda.time.Weeks
	at org.joda.time.TestWeeks.testGetMethods(TestWeeks.java:154)

testConstants(org.joda.time.TestWeeks)  Time elapsed: 0.001 sec  <<< ERROR!
java.lang.NoClassDefFoundError: Could not initialize class org.joda.time.Weeks
	at org.joda.time.TestWeeks.testConstants(TestWeeks.java:56)

testGetFieldType(org.joda.time.TestWeeks)  Time elapsed: 0 sec  <<< ERROR!
java.lang.NoClassDefFoundError: Could not initialize class org.joda.time.Weeks
	at org.joda.time.TestWeeks.testGetFieldType(TestWeeks.java:159)

testIsGreaterThan(org.joda.time.TestWeeks)  Time elapsed: 0.001 sec  <<< ERROR!
java.lang.NoClassDefFoundError: Could not initialize class org.joda.time.Weeks
	at org.joda.time.TestWeeks.testIsGreaterThan(TestWeeks.java:170)

testIsLessThan(org.joda.time.TestWeeks)  Time elapsed: 0 sec  <<< ERROR!
java.lang.NoClassDefFoundError: Could not initialize class org.joda.time.Weeks
	at org.joda.time.TestWeeks.testIsLessThan(TestWeeks.java:178)

testMinus_int(org.joda.time.TestWeeks)  Time elapsed: 0.001 sec  <<< ERROR!
java.lang.NoClassDefFoundError: Could not initialize class org.joda.time.Weeks
	at org.joda.time.TestWeeks.testMinus_int(TestWeeks.java:311)

testFactory_parseWeeks_String(org.joda.time.TestWeeks)  Time elapsed: 0 sec  <<< ERROR!
java.lang.NoClassDefFoundError: Could not initialize class org.joda.time.Weeks
	at org.joda.time.TestWeeks.testFactory_parseWeeks_String(TestWeeks.java:132)

testPlus_Weeks(org.joda.time.TestWeeks)  Time elapsed: 0.001 sec  <<< ERROR!
java.lang.NoClassDefFoundError: Could not initialize class org.joda.time.Weeks
	at org.joda.time.TestWeeks.testPlus_Weeks(TestWeeks.java:292)

testMinus_Weeks(org.joda.time.TestWeeks)  Time elapsed: 0 sec  <<< ERROR!
java.lang.NoClassDefFoundError: Could not initialize class org.joda.time.Weeks
	at org.joda.time.TestWeeks.testMinus_Weeks(TestWeeks.java:327)

testNegated(org.joda.time.TestWeeks)  Time elapsed: 0 sec  <<< ERROR!
java.lang.NoClassDefFoundError: Could not initialize class org.joda.time.Weeks
	at org.joda.time.TestWeeks.testNegated(TestWeeks.java:380)

testGetPeriodType(org.joda.time.TestWeeks)  Time elapsed: 0.001 sec  <<< ERROR!
java.lang.NoClassDefFoundError: Could not initialize class org.joda.time.Weeks
	at org.joda.time.TestWeeks.testGetPeriodType(TestWeeks.java:164)

testToStandardDuration(org.joda.time.TestWeeks)  Time elapsed: 0 sec  <<< ERROR!
java.lang.NoClassDefFoundError: Could not initialize class org.joda.time.Weeks
	at org.joda.time.TestWeeks.testToStandardDuration(TestWeeks.java:266)

testPlus_int(org.joda.time.TestWeeks)  Time elapsed: 0 sec  <<< ERROR!
java.lang.NoClassDefFoundError: Could not initialize class org.joda.time.Weeks
	at org.joda.time.TestWeeks.testPlus_int(TestWeeks.java:276)

testToStandardDays(org.joda.time.TestWeeks)  Time elapsed: 0.001 sec  <<< ERROR!
java.lang.NoClassDefFoundError: Could not initialize class org.joda.time.Weeks
	at org.joda.time.TestWeeks.testToStandardDays(TestWeeks.java:214)

testToStandardHours(org.joda.time.TestWeeks)  Time elapsed: 0 sec  <<< ERROR!
java.lang.NoClassDefFoundError: Could not initialize class org.joda.time.Weeks
	at org.joda.time.TestWeeks.testToStandardHours(TestWeeks.java:227)

testToStandardMinutes(org.joda.time.TestWeeks)  Time elapsed: 0 sec  <<< ERROR!
java.lang.NoClassDefFoundError: Could not initialize class org.joda.time.Weeks
	at org.joda.time.TestWeeks.testToStandardMinutes(TestWeeks.java:240)

testToStandardSeconds(org.joda.time.TestWeeks)  Time elapsed: 0 sec  <<< ERROR!
java.lang.NoClassDefFoundError: Could not initialize class org.joda.time.Weeks
	at org.joda.time.TestWeeks.testToStandardSeconds(TestWeeks.java:253)

testMultipliedBy_int(org.joda.time.TestWeeks)  Time elapsed: 0.001 sec  <<< ERROR!
java.lang.NoClassDefFoundError: Could not initialize class org.joda.time.Weeks
	at org.joda.time.TestWeeks.testMultipliedBy_int(TestWeeks.java:346)

testDividedBy_int(org.joda.time.TestWeeks)  Time elapsed: 0 sec  <<< ERROR!
java.lang.NoClassDefFoundError: Could not initialize class org.joda.time.Weeks
	at org.joda.time.TestWeeks.testDividedBy_int(TestWeeks.java:362)

testAddToLocalDate(org.joda.time.TestWeeks)  Time elapsed: 0 sec  <<< ERROR!
java.lang.NoClassDefFoundError: Could not initialize class org.joda.time.Weeks
	at org.joda.time.TestWeeks.testAddToLocalDate(TestWeeks.java:394)

testFactory_weeks_int(org.joda.time.TestWeeks)  Time elapsed: 0.001 sec  <<< ERROR!
java.lang.NoClassDefFoundError: Could not initialize class org.joda.time.Weeks
	at org.joda.time.TestWeeks.testFactory_weeks_int(TestWeeks.java:66)

testFactory_weeksBetween_RInstant(org.joda.time.TestWeeks)  Time elapsed: 0 sec  <<< ERROR!
java.lang.NoClassDefFoundError: Could not initialize class org.joda.time.Weeks
	at org.joda.time.TestWeeks.testFactory_weeksBetween_RInstant(TestWeeks.java:82)

testFactory_weeksBetween_RPartial(org.joda.time.TestWeeks)  Time elapsed: 0.001 sec  <<< ERROR!
java.lang.NoClassDefFoundError: Could not initialize class org.joda.time.Weeks
	at org.joda.time.TestWeeks.testFactory_weeksBetween_RPartial(TestWeeks.java:95)

testFactory_weeksIn_RInterval(org.joda.time.TestWeeks)  Time elapsed: 0 sec  <<< ERROR!
java.lang.NoClassDefFoundError: Could not initialize class org.joda.time.Weeks
	at org.joda.time.TestWeeks.testFactory_weeksIn_RInterval(TestWeeks.java:107)

testFactory_standardWeeksIn_RPeriod(org.joda.time.TestWeeks)  Time elapsed: 0 sec  <<< ERROR!
java.lang.NoClassDefFoundError: Could not initialize class org.joda.time.Weeks
	at org.joda.time.TestWeeks.testFactory_standardWeeksIn_RPeriod(TestWeeks.java:115)

testToString(org.joda.time.TestDays)  Time elapsed: 0.001 sec  <<< ERROR!
java.lang.NoClassDefFoundError: Could not initialize class org.joda.time.Days
	at org.joda.time.TestDays.testToString(TestDays.java:229)

testSerialization(org.joda.time.TestDays)  Time elapsed: 0 sec  <<< ERROR!
java.lang.NoClassDefFoundError: Could not initialize class org.joda.time.Days
	at org.joda.time.TestDays.testSerialization(TestDays.java:238)

testGetMethods(org.joda.time.TestDays)  Time elapsed: 0 sec  <<< ERROR!
java.lang.NoClassDefFoundError: Could not initialize class org.joda.time.Days
	at org.joda.time.TestDays.testGetMethods(TestDays.java:196)

testConstants(org.joda.time.TestDays)  Time elapsed: 0 sec  <<< ERROR!
java.lang.NoClassDefFoundError: Could not initialize class org.joda.time.Days
	at org.joda.time.TestDays.testConstants(TestDays.java:56)

testGetFieldType(org.joda.time.TestDays)  Time elapsed: 0 sec  <<< ERROR!
java.lang.NoClassDefFoundError: Could not initialize class org.joda.time.Days
	at org.joda.time.TestDays.testGetFieldType(TestDays.java:201)

testIsGreaterThan(org.joda.time.TestDays)  Time elapsed: 0.001 sec  <<< ERROR!
java.lang.NoClassDefFoundError: Could not initialize class org.joda.time.Days
	at org.joda.time.TestDays.testIsGreaterThan(TestDays.java:212)

testIsLessThan(org.joda.time.TestDays)  Time elapsed: 0 sec  <<< ERROR!
java.lang.NoClassDefFoundError: Could not initialize class org.joda.time.Days
	at org.joda.time.TestDays.testIsLessThan(TestDays.java:220)

testMinus_int(org.joda.time.TestDays)  Time elapsed: 0 sec  <<< ERROR!
java.lang.NoClassDefFoundError: Could not initialize class org.joda.time.Days
	at org.joda.time.TestDays.testMinus_int(TestDays.java:346)

testFactory_daysBetween_RPartial_MonthDay(org.joda.time.TestDays)  Time elapsed: 0.001 sec  <<< ERROR!
java.lang.NoClassDefFoundError: Could not initialize class org.joda.time.Days
	at org.joda.time.TestDays.testFactory_daysBetween_RPartial_MonthDay(TestDays.java:130)

testFactory_daysIn_RInterval(org.joda.time.TestDays)  Time elapsed: 0 sec  <<< ERROR!
java.lang.NoClassDefFoundError: Could not initialize class org.joda.time.Days
	at org.joda.time.TestDays.testFactory_daysIn_RInterval(TestDays.java:147)

testFactory_standardDaysIn_RPeriod(org.joda.time.TestDays)  Time elapsed: 0.001 sec  <<< ERROR!
java.lang.NoClassDefFoundError: Could not initialize class org.joda.time.Days
	at org.joda.time.TestDays.testFactory_standardDaysIn_RPeriod(TestDays.java:156)

testFactory_parseDays_String(org.joda.time.TestDays)  Time elapsed: 0 sec  <<< ERROR!
java.lang.NoClassDefFoundError: Could not initialize class org.joda.time.Days
	at org.joda.time.TestDays.testFactory_parseDays_String(TestDays.java:174)

testMinus_Days(org.joda.time.TestDays)  Time elapsed: 0 sec  <<< ERROR!
java.lang.NoClassDefFoundError: Could not initialize class org.joda.time.Days
	at org.joda.time.TestDays.testMinus_Days(TestDays.java:362)

testFactory_days_int(org.joda.time.TestDays)  Time elapsed: 0.001 sec  <<< ERROR!
java.lang.NoClassDefFoundError: Could not initialize class org.joda.time.Days
	at org.joda.time.TestDays.testFactory_days_int(TestDays.java:70)

testFactory_daysBetween_RInstant(org.joda.time.TestDays)  Time elapsed: 0 sec  <<< ERROR!
java.lang.NoClassDefFoundError: Could not initialize class org.joda.time.Days
	at org.joda.time.TestDays.testFactory_daysBetween_RInstant(TestDays.java:90)

testFactory_daysBetween_RPartial_LocalDate(org.joda.time.TestDays)  Time elapsed: 0 sec  <<< ERROR!
java.lang.NoClassDefFoundError: Could not initialize class org.joda.time.Days
	at org.joda.time.TestDays.testFactory_daysBetween_RPartial_LocalDate(TestDays.java:104)

testFactory_daysBetween_RPartial_YearMonth(org.joda.time.TestDays)  Time elapsed: 0.001 sec  <<< ERROR!
java.lang.NoClassDefFoundError: Could not initialize class org.joda.time.Days
	at org.joda.time.TestDays.testFactory_daysBetween_RPartial_YearMonth(TestDays.java:117)

testPlus_Days(org.joda.time.TestDays)  Time elapsed: 0 sec  <<< ERROR!
java.lang.NoClassDefFoundError: Could not initialize class org.joda.time.Days
	at org.joda.time.TestDays.testPlus_Days(TestDays.java:327)

testNegated(org.joda.time.TestDays)  Time elapsed: 0 sec  <<< ERROR!
java.lang.NoClassDefFoundError: Could not initialize class org.joda.time.Days
	at org.joda.time.TestDays.testNegated(TestDays.java:415)

testToStandardWeeks(org.joda.time.TestDays)  Time elapsed: 0.001 sec  <<< ERROR!
java.lang.NoClassDefFoundError: Could not initialize class org.joda.time.Days
	at org.joda.time.TestDays.testToStandardWeeks(TestDays.java:256)

testGetPeriodType(org.joda.time.TestDays)  Time elapsed: 0 sec  <<< ERROR!
java.lang.NoClassDefFoundError: Could not initialize class org.joda.time.Days
	at org.joda.time.TestDays.testGetPeriodType(TestDays.java:206)

testToStandardDuration(org.joda.time.TestDays)  Time elapsed: 0 sec  <<< ERROR!
java.lang.NoClassDefFoundError: Could not initialize class org.joda.time.Days
	at org.joda.time.TestDays.testToStandardDuration(TestDays.java:301)

testPlus_int(org.joda.time.TestDays)  Time elapsed: 0 sec  <<< ERROR!
java.lang.NoClassDefFoundError: Could not initialize class org.joda.time.Days
	at org.joda.time.TestDays.testPlus_int(TestDays.java:311)

testToStandardHours(org.joda.time.TestDays)  Time elapsed: 0 sec  <<< ERROR!
java.lang.NoClassDefFoundError: Could not initialize class org.joda.time.Days
	at org.joda.time.TestDays.testToStandardHours(TestDays.java:262)

testToStandardMinutes(org.joda.time.TestDays)  Time elapsed: 0.001 sec  <<< ERROR!
java.lang.NoClassDefFoundError: Could not initialize class org.joda.time.Days
	at org.joda.time.TestDays.testToStandardMinutes(TestDays.java:275)

testToStandardSeconds(org.joda.time.TestDays)  Time elapsed: 0 sec  <<< ERROR!
java.lang.NoClassDefFoundError: Could not initialize class org.joda.time.Days
	at org.joda.time.TestDays.testToStandardSeconds(TestDays.java:288)

testMultipliedBy_int(org.joda.time.TestDays)  Time elapsed: 0 sec  <<< ERROR!
java.lang.NoClassDefFoundError: Could not initialize class org.joda.time.Days
	at org.joda.time.TestDays.testMultipliedBy_int(TestDays.java:381)

testDividedBy_int(org.joda.time.TestDays)  Time elapsed: 0.001 sec  <<< ERROR!
java.lang.NoClassDefFoundError: Could not initialize class org.joda.time.Days
	at org.joda.time.TestDays.testDividedBy_int(TestDays.java:397)

testAddToLocalDate(org.joda.time.TestDays)  Time elapsed: 0 sec  <<< ERROR!
java.lang.NoClassDefFoundError: Could not initialize class org.joda.time.Days
	at org.joda.time.TestDays.testAddToLocalDate(TestDays.java:429)

testToString(org.joda.time.TestHours)  Time elapsed: 0 sec  <<< ERROR!
java.lang.NoClassDefFoundError: Could not initialize class org.joda.time.Hours
	at org.joda.time.TestHours.testToString(TestHours.java:198)

testSerialization(org.joda.time.TestHours)  Time elapsed: 0.001 sec  <<< ERROR!
java.lang.NoClassDefFoundError: Could not initialize class org.joda.time.Hours
	at org.joda.time.TestHours.testSerialization(TestHours.java:207)

testGetMethods(org.joda.time.TestHours)  Time elapsed: 0 sec  <<< ERROR!
java.lang.NoClassDefFoundError: Could not initialize class org.joda.time.Hours
	at org.joda.time.TestHours.testGetMethods(TestHours.java:165)

testConstants(org.joda.time.TestHours)  Time elapsed: 0 sec  <<< ERROR!
java.lang.NoClassDefFoundError: Could not initialize class org.joda.time.Hours
	at org.joda.time.TestHours.testConstants(TestHours.java:56)

testGetFieldType(org.joda.time.TestHours)  Time elapsed: 0.001 sec  <<< ERROR!
java.lang.NoClassDefFoundError: Could not initialize class org.joda.time.Hours
	at org.joda.time.TestHours.testGetFieldType(TestHours.java:170)

testIsGreaterThan(org.joda.time.TestHours)  Time elapsed: 0 sec  <<< ERROR!
java.lang.NoClassDefFoundError: Could not initialize class org.joda.time.Hours
	at org.joda.time.TestHours.testIsGreaterThan(TestHours.java:181)

testIsLessThan(org.joda.time.TestHours)  Time elapsed: 0 sec  <<< ERROR!
java.lang.NoClassDefFoundError: Could not initialize class org.joda.time.Hours
	at org.joda.time.TestHours.testIsLessThan(TestHours.java:189)

testMinus_int(org.joda.time.TestHours)  Time elapsed: 0 sec  <<< ERROR!
java.lang.NoClassDefFoundError: Could not initialize class org.joda.time.Hours
	at org.joda.time.TestHours.testMinus_int(TestHours.java:308)

testFactory_standardHoursIn_RPeriod(org.joda.time.TestHours)  Time elapsed: 0 sec  <<< ERROR!
java.lang.NoClassDefFoundError: Could not initialize class org.joda.time.Hours
	at org.joda.time.TestHours.testFactory_standardHoursIn_RPeriod(TestHours.java:125)

testFactory_parseHours_String(org.joda.time.TestHours)  Time elapsed: 0.001 sec  <<< ERROR!
java.lang.NoClassDefFoundError: Could not initialize class org.joda.time.Hours
	at org.joda.time.TestHours.testFactory_parseHours_String(TestHours.java:143)

testPlus_Hours(org.joda.time.TestHours)  Time elapsed: 0 sec  <<< ERROR!
java.lang.NoClassDefFoundError: Could not initialize class org.joda.time.Hours
	at org.joda.time.TestHours.testPlus_Hours(TestHours.java:289)

testMinus_Hours(org.joda.time.TestHours)  Time elapsed: 0 sec  <<< ERROR!
java.lang.NoClassDefFoundError: Could not initialize class org.joda.time.Hours
	at org.joda.time.TestHours.testMinus_Hours(TestHours.java:324)

testFactory_hours_int(org.joda.time.TestHours)  Time elapsed: 0.001 sec  <<< ERROR!
java.lang.NoClassDefFoundError: Could not initialize class org.joda.time.Hours
	at org.joda.time.TestHours.testFactory_hours_int(TestHours.java:71)

testFactory_hoursBetween_RInstant(org.joda.time.TestHours)  Time elapsed: 0 sec  <<< ERROR!
java.lang.NoClassDefFoundError: Could not initialize class org.joda.time.Hours
	at org.joda.time.TestHours.testFactory_hoursBetween_RInstant(TestHours.java:92)

testFactory_hoursBetween_RPartial(org.joda.time.TestHours)  Time elapsed: 0.001 sec  <<< ERROR!
java.lang.NoClassDefFoundError: Could not initialize class org.joda.time.Hours
	at org.joda.time.TestHours.testFactory_hoursBetween_RPartial(TestHours.java:105)

testFactory_hoursIn_RInterval(org.joda.time.TestHours)  Time elapsed: 0 sec  <<< ERROR!
java.lang.NoClassDefFoundError: Could not initialize class org.joda.time.Hours
	at org.joda.time.TestHours.testFactory_hoursIn_RInterval(TestHours.java:117)

testNegated(org.joda.time.TestHours)  Time elapsed: 0 sec  <<< ERROR!
java.lang.NoClassDefFoundError: Could not initialize class org.joda.time.Hours
	at org.joda.time.TestHours.testNegated(TestHours.java:377)

testToStandardWeeks(org.joda.time.TestHours)  Time elapsed: 0.001 sec  <<< ERROR!
java.lang.NoClassDefFoundError: Could not initialize class org.joda.time.Hours
	at org.joda.time.TestHours.testToStandardWeeks(TestHours.java:225)

testGetPeriodType(org.joda.time.TestHours)  Time elapsed: 0 sec  <<< ERROR!
java.lang.NoClassDefFoundError: Could not initialize class org.joda.time.Hours
	at org.joda.time.TestHours.testGetPeriodType(TestHours.java:175)

testToStandardDuration(org.joda.time.TestHours)  Time elapsed: 0 sec  <<< ERROR!
java.lang.NoClassDefFoundError: Could not initialize class org.joda.time.Hours
	at org.joda.time.TestHours.testToStandardDuration(TestHours.java:263)

testPlus_int(org.joda.time.TestHours)  Time elapsed: 0.001 sec  <<< ERROR!
java.lang.NoClassDefFoundError: Could not initialize class org.joda.time.Hours
	at org.joda.time.TestHours.testPlus_int(TestHours.java:273)

testToStandardDays(org.joda.time.TestHours)  Time elapsed: 0 sec  <<< ERROR!
java.lang.NoClassDefFoundError: Could not initialize class org.joda.time.Hours
	at org.joda.time.TestHours.testToStandardDays(TestHours.java:231)

testToStandardMinutes(org.joda.time.TestHours)  Time elapsed: 0 sec  <<< ERROR!
java.lang.NoClassDefFoundError: Could not initialize class org.joda.time.Hours
	at org.joda.time.TestHours.testToStandardMinutes(TestHours.java:237)

testToStandardSeconds(org.joda.time.TestHours)  Time elapsed: 0 sec  <<< ERROR!
java.lang.NoClassDefFoundError: Could not initialize class org.joda.time.Hours
	at org.joda.time.TestHours.testToStandardSeconds(TestHours.java:250)

testMultipliedBy_int(org.joda.time.TestHours)  Time elapsed: 0.004 sec  <<< ERROR!
java.lang.NoClassDefFoundError: Could not initialize class org.joda.time.Hours
	at org.joda.time.TestHours.testMultipliedBy_int(TestHours.java:343)

testDividedBy_int(org.joda.time.TestHours)  Time elapsed: 0 sec  <<< ERROR!
java.lang.NoClassDefFoundError: Could not initialize class org.joda.time.Hours
	at org.joda.time.TestHours.testDividedBy_int(TestHours.java:359)

testAddToLocalDate(org.joda.time.TestHours)  Time elapsed: 0 sec  <<< ERROR!
java.lang.NoClassDefFoundError: Could not initialize class org.joda.time.Hours
	at org.joda.time.TestHours.testAddToLocalDate(TestHours.java:391)

testToString(org.joda.time.TestMinutes)  Time elapsed: 0 sec  <<< ERROR!
java.lang.NoClassDefFoundError: Could not initialize class org.joda.time.Minutes
	at org.joda.time.TestMinutes.testToString(TestMinutes.java:188)

testSerialization(org.joda.time.TestMinutes)  Time elapsed: 0.011 sec  <<< ERROR!
java.lang.NoClassDefFoundError: Could not initialize class org.joda.time.Minutes
	at org.joda.time.TestMinutes.testSerialization(TestMinutes.java:197)

testGetMethods(org.joda.time.TestMinutes)  Time elapsed: 0 sec  <<< ERROR!
java.lang.NoClassDefFoundError: Could not initialize class org.joda.time.Minutes
	at org.joda.time.TestMinutes.testGetMethods(TestMinutes.java:155)

testConstants(org.joda.time.TestMinutes)  Time elapsed: 0 sec  <<< ERROR!
java.lang.NoClassDefFoundError: Could not initialize class org.joda.time.Minutes
	at org.joda.time.TestMinutes.testConstants(TestMinutes.java:56)

testGetFieldType(org.joda.time.TestMinutes)  Time elapsed: 0 sec  <<< ERROR!
java.lang.NoClassDefFoundError: Could not initialize class org.joda.time.Minutes
	at org.joda.time.TestMinutes.testGetFieldType(TestMinutes.java:160)

testIsGreaterThan(org.joda.time.TestMinutes)  Time elapsed: 0 sec  <<< ERROR!
java.lang.NoClassDefFoundError: Could not initialize class org.joda.time.Minutes
	at org.joda.time.TestMinutes.testIsGreaterThan(TestMinutes.java:171)

testIsLessThan(org.joda.time.TestMinutes)  Time elapsed: 0 sec  <<< ERROR!
java.lang.NoClassDefFoundError: Could not initialize class org.joda.time.Minutes
	at org.joda.time.TestMinutes.testIsLessThan(TestMinutes.java:179)

testMinus_int(org.joda.time.TestMinutes)  Time elapsed: 0 sec  <<< ERROR!
java.lang.NoClassDefFoundError: Could not initialize class org.joda.time.Minutes
	at org.joda.time.TestMinutes.testMinus_int(TestMinutes.java:291)

testFactory_minutesIn_RInterval(org.joda.time.TestMinutes)  Time elapsed: 0 sec  <<< ERROR!
java.lang.NoClassDefFoundError: Could not initialize class org.joda.time.Minutes
	at org.joda.time.TestMinutes.testFactory_minutesIn_RInterval(TestMinutes.java:107)

testFactory_standardMinutesIn_RPeriod(org.joda.time.TestMinutes)  Time elapsed: 0 sec  <<< ERROR!
java.lang.NoClassDefFoundError: Could not initialize class org.joda.time.Minutes
	at org.joda.time.TestMinutes.testFactory_standardMinutesIn_RPeriod(TestMinutes.java:115)

testFactory_parseMinutes_String(org.joda.time.TestMinutes)  Time elapsed: 0 sec  <<< ERROR!
java.lang.NoClassDefFoundError: Could not initialize class org.joda.time.Minutes
	at org.joda.time.TestMinutes.testFactory_parseMinutes_String(TestMinutes.java:133)

testMinus_Minutes(org.joda.time.TestMinutes)  Time elapsed: 0 sec  <<< ERROR!
java.lang.NoClassDefFoundError: Could not initialize class org.joda.time.Minutes
	at org.joda.time.TestMinutes.testMinus_Minutes(TestMinutes.java:307)

testNegated(org.joda.time.TestMinutes)  Time elapsed: 0 sec  <<< ERROR!
java.lang.NoClassDefFoundError: Could not initialize class org.joda.time.Minutes
	at org.joda.time.TestMinutes.testNegated(TestMinutes.java:360)

testToStandardWeeks(org.joda.time.TestMinutes)  Time elapsed: 0 sec  <<< ERROR!
java.lang.NoClassDefFoundError: Could not initialize class org.joda.time.Minutes
	at org.joda.time.TestMinutes.testToStandardWeeks(TestMinutes.java:215)

testGetPeriodType(org.joda.time.TestMinutes)  Time elapsed: 0 sec  <<< ERROR!
java.lang.NoClassDefFoundError: Could not initialize class org.joda.time.Minutes
	at org.joda.time.TestMinutes.testGetPeriodType(TestMinutes.java:165)

testToStandardDuration(org.joda.time.TestMinutes)  Time elapsed: 0 sec  <<< ERROR!
java.lang.NoClassDefFoundError: Could not initialize class org.joda.time.Minutes
	at org.joda.time.TestMinutes.testToStandardDuration(TestMinutes.java:246)

testPlus_int(org.joda.time.TestMinutes)  Time elapsed: 0 sec  <<< ERROR!
java.lang.NoClassDefFoundError: Could not initialize class org.joda.time.Minutes
	at org.joda.time.TestMinutes.testPlus_int(TestMinutes.java:256)

testToStandardDays(org.joda.time.TestMinutes)  Time elapsed: 0 sec  <<< ERROR!
java.lang.NoClassDefFoundError: Could not initialize class org.joda.time.Minutes
	at org.joda.time.TestMinutes.testToStandardDays(TestMinutes.java:221)

testToStandardHours(org.joda.time.TestMinutes)  Time elapsed: 0 sec  <<< ERROR!
java.lang.NoClassDefFoundError: Could not initialize class org.joda.time.Minutes
	at org.joda.time.TestMinutes.testToStandardHours(TestMinutes.java:227)

testToStandardSeconds(org.joda.time.TestMinutes)  Time elapsed: 0 sec  <<< ERROR!
java.lang.NoClassDefFoundError: Could not initialize class org.joda.time.Minutes
	at org.joda.time.TestMinutes.testToStandardSeconds(TestMinutes.java:233)

testFactory_minutes_int(org.joda.time.TestMinutes)  Time elapsed: 0 sec  <<< ERROR!
java.lang.NoClassDefFoundError: Could not initialize class org.joda.time.Minutes
	at org.joda.time.TestMinutes.testFactory_minutes_int(TestMinutes.java:66)

testFactory_minutesBetween_RInstant(org.joda.time.TestMinutes)  Time elapsed: 0 sec  <<< ERROR!
java.lang.NoClassDefFoundError: Could not initialize class org.joda.time.Minutes
	at org.joda.time.TestMinutes.testFactory_minutesBetween_RInstant(TestMinutes.java:82)

testFactory_minutesBetween_RPartial(org.joda.time.TestMinutes)  Time elapsed: 0 sec  <<< ERROR!
java.lang.NoClassDefFoundError: Could not initialize class org.joda.time.Minutes
	at org.joda.time.TestMinutes.testFactory_minutesBetween_RPartial(TestMinutes.java:95)

testPlus_Minutes(org.joda.time.TestMinutes)  Time elapsed: 0 sec  <<< ERROR!
java.lang.NoClassDefFoundError: Could not initialize class org.joda.time.Minutes
	at org.joda.time.TestMinutes.testPlus_Minutes(TestMinutes.java:272)

testMultipliedBy_int(org.joda.time.TestMinutes)  Time elapsed: 0 sec  <<< ERROR!
java.lang.NoClassDefFoundError: Could not initialize class org.joda.time.Minutes
	at org.joda.time.TestMinutes.testMultipliedBy_int(TestMinutes.java:326)

testDividedBy_int(org.joda.time.TestMinutes)  Time elapsed: 0 sec  <<< ERROR!
java.lang.NoClassDefFoundError: Could not initialize class org.joda.time.Minutes
	at org.joda.time.TestMinutes.testDividedBy_int(TestMinutes.java:342)

testAddToLocalDate(org.joda.time.TestMinutes)  Time elapsed: 0 sec  <<< ERROR!
java.lang.NoClassDefFoundError: Could not initialize class org.joda.time.Minutes
	at org.joda.time.TestMinutes.testAddToLocalDate(TestMinutes.java:374)

testToString(org.joda.time.TestSeconds)  Time elapsed: 0.001 sec  <<< ERROR!
java.lang.NoClassDefFoundError: Could not initialize class org.joda.time.Seconds
	at org.joda.time.TestSeconds.testToString(TestSeconds.java:185)

testSerialization(org.joda.time.TestSeconds)  Time elapsed: 0 sec  <<< ERROR!
java.lang.NoClassDefFoundError: Could not initialize class org.joda.time.Seconds
	at org.joda.time.TestSeconds.testSerialization(TestSeconds.java:194)

testGetMethods(org.joda.time.TestSeconds)  Time elapsed: 0 sec  <<< ERROR!
java.lang.NoClassDefFoundError: Could not initialize class org.joda.time.Seconds
	at org.joda.time.TestSeconds.testGetMethods(TestSeconds.java:152)

testConstants(org.joda.time.TestSeconds)  Time elapsed: 0.001 sec  <<< ERROR!
java.lang.NoClassDefFoundError: Could not initialize class org.joda.time.Seconds
	at org.joda.time.TestSeconds.testConstants(TestSeconds.java:56)

testGetFieldType(org.joda.time.TestSeconds)  Time elapsed: 0.001 sec  <<< ERROR!
java.lang.NoClassDefFoundError: Could not initialize class org.joda.time.Seconds
	at org.joda.time.TestSeconds.testGetFieldType(TestSeconds.java:157)

testIsGreaterThan(org.joda.time.TestSeconds)  Time elapsed: 0 sec  <<< ERROR!
java.lang.NoClassDefFoundError: Could not initialize class org.joda.time.Seconds
	at org.joda.time.TestSeconds.testIsGreaterThan(TestSeconds.java:168)

testIsLessThan(org.joda.time.TestSeconds)  Time elapsed: 0.002 sec  <<< ERROR!
java.lang.NoClassDefFoundError: Could not initialize class org.joda.time.Seconds
	at org.joda.time.TestSeconds.testIsLessThan(TestSeconds.java:176)

testMinus_int(org.joda.time.TestSeconds)  Time elapsed: 0 sec  <<< ERROR!
java.lang.NoClassDefFoundError: Could not initialize class org.joda.time.Seconds
	at org.joda.time.TestSeconds.testMinus_int(TestSeconds.java:281)

testNegated(org.joda.time.TestSeconds)  Time elapsed: 0 sec  <<< ERROR!
java.lang.NoClassDefFoundError: Could not initialize class org.joda.time.Seconds
	at org.joda.time.TestSeconds.testNegated(TestSeconds.java:350)

testToStandardWeeks(org.joda.time.TestSeconds)  Time elapsed: 0 sec  <<< ERROR!
java.lang.NoClassDefFoundError: Could not initialize class org.joda.time.Seconds
	at org.joda.time.TestSeconds.testToStandardWeeks(TestSeconds.java:212)

testGetPeriodType(org.joda.time.TestSeconds)  Time elapsed: 0 sec  <<< ERROR!
java.lang.NoClassDefFoundError: Could not initialize class org.joda.time.Seconds
	at org.joda.time.TestSeconds.testGetPeriodType(TestSeconds.java:162)

testToStandardDuration(org.joda.time.TestSeconds)  Time elapsed: 0 sec  <<< ERROR!
java.lang.NoClassDefFoundError: Could not initialize class org.joda.time.Seconds
	at org.joda.time.TestSeconds.testToStandardDuration(TestSeconds.java:236)

testPlus_int(org.joda.time.TestSeconds)  Time elapsed: 0.001 sec  <<< ERROR!
java.lang.NoClassDefFoundError: Could not initialize class org.joda.time.Seconds
	at org.joda.time.TestSeconds.testPlus_int(TestSeconds.java:246)

testToStandardDays(org.joda.time.TestSeconds)  Time elapsed: 0 sec  <<< ERROR!
java.lang.NoClassDefFoundError: Could not initialize class org.joda.time.Seconds
	at org.joda.time.TestSeconds.testToStandardDays(TestSeconds.java:218)

testToStandardHours(org.joda.time.TestSeconds)  Time elapsed: 0.001 sec  <<< ERROR!
java.lang.NoClassDefFoundError: Could not initialize class org.joda.time.Seconds
	at org.joda.time.TestSeconds.testToStandardHours(TestSeconds.java:224)

testToStandardMinutes(org.joda.time.TestSeconds)  Time elapsed: 0.001 sec  <<< ERROR!
java.lang.NoClassDefFoundError: Could not initialize class org.joda.time.Seconds
	at org.joda.time.TestSeconds.testToStandardMinutes(TestSeconds.java:230)

testFactory_seconds_int(org.joda.time.TestSeconds)  Time elapsed: 0 sec  <<< ERROR!
java.lang.NoClassDefFoundError: Could not initialize class org.joda.time.Seconds
	at org.joda.time.TestSeconds.testFactory_seconds_int(TestSeconds.java:66)

testFactory_secondsBetween_RInstant(org.joda.time.TestSeconds)  Time elapsed: 0.001 sec  <<< ERROR!
java.lang.NoClassDefFoundError: Could not initialize class org.joda.time.Seconds
	at org.joda.time.TestSeconds.testFactory_secondsBetween_RInstant(TestSeconds.java:82)

testFactory_secondsBetween_RPartial(org.joda.time.TestSeconds)  Time elapsed: 0 sec  <<< ERROR!
java.lang.NoClassDefFoundError: Could not initialize class org.joda.time.Seconds
	at org.joda.time.TestSeconds.testFactory_secondsBetween_RPartial(TestSeconds.java:95)

testFactory_secondsIn_RInterval(org.joda.time.TestSeconds)  Time elapsed: 0.001 sec  <<< ERROR!
java.lang.NoClassDefFoundError: Could not initialize class org.joda.time.Seconds
	at org.joda.time.TestSeconds.testFactory_secondsIn_RInterval(TestSeconds.java:107)

testFactory_standardSecondsIn_RPeriod(org.joda.time.TestSeconds)  Time elapsed: 0 sec  <<< ERROR!
java.lang.NoClassDefFoundError: Could not initialize class org.joda.time.Seconds
	at org.joda.time.TestSeconds.testFactory_standardSecondsIn_RPeriod(TestSeconds.java:115)

testFactory_parseSeconds_String(org.joda.time.TestSeconds)  Time elapsed: 0 sec  <<< ERROR!
java.lang.NoClassDefFoundError: Could not initialize class org.joda.time.Seconds
	at org.joda.time.TestSeconds.testFactory_parseSeconds_String(TestSeconds.java:130)

testPlus_Seconds(org.joda.time.TestSeconds)  Time elapsed: 0.001 sec  <<< ERROR!
java.lang.NoClassDefFoundError: Could not initialize class org.joda.time.Seconds
	at org.joda.time.TestSeconds.testPlus_Seconds(TestSeconds.java:262)

testMinus_Seconds(org.joda.time.TestSeconds)  Time elapsed: 0 sec  <<< ERROR!
java.lang.NoClassDefFoundError: Could not initialize class org.joda.time.Seconds
	at org.joda.time.TestSeconds.testMinus_Seconds(TestSeconds.java:297)

testMultipliedBy_int(org.joda.time.TestSeconds)  Time elapsed: 0 sec  <<< ERROR!
java.lang.NoClassDefFoundError: Could not initialize class org.joda.time.Seconds
	at org.joda.time.TestSeconds.testMultipliedBy_int(TestSeconds.java:316)

testDividedBy_int(org.joda.time.TestSeconds)  Time elapsed: 0.001 sec  <<< ERROR!
java.lang.NoClassDefFoundError: Could not initialize class org.joda.time.Seconds
	at org.joda.time.TestSeconds.testDividedBy_int(TestSeconds.java:332)

testAddToLocalDate(org.joda.time.TestSeconds)  Time elapsed: 0 sec  <<< ERROR!
java.lang.NoClassDefFoundError: Could not initialize class org.joda.time.Seconds
	at org.joda.time.TestSeconds.testAddToLocalDate(TestSeconds.java:364)

testPeriod(org.joda.time.TestDateTimeZoneCutover)  Time elapsed: 0.001 sec  <<< ERROR!
java.lang.IllegalStateException: No field to apply suffix to
	at org.joda.time.format.PeriodFormatterBuilder.appendSuffix(PeriodFormatterBuilder.java:151)
	at org.joda.time.format.PeriodFormatterBuilder.appendSuffix(PeriodFormatterBuilder.java:140)
	at org.joda.time.format.ISOPeriodFormat.standard(ISOPeriodFormat.java:66)
	at org.joda.time.base.AbstractPeriod.toString(AbstractPeriod.java:228)
	at org.joda.time.TestDateTimeZoneCutover.testPeriod(TestDateTimeZoneCutover.java:1250)

testPeriod(org.joda.time.TestStringConvert)  Time elapsed: 0.032 sec  <<< ERROR!
java.lang.IllegalStateException: No field to apply suffix to
	at org.joda.time.format.PeriodFormatterBuilder.appendSuffix(PeriodFormatterBuilder.java:151)
	at org.joda.time.format.PeriodFormatterBuilder.appendSuffix(PeriodFormatterBuilder.java:140)
	at org.joda.time.format.ISOPeriodFormat.standard(ISOPeriodFormat.java:66)
	at org.joda.time.base.AbstractPeriod.toString(AbstractPeriod.java:228)
	at sun.reflect.NativeMethodAccessorImpl.invoke0(Native Method)
	at sun.reflect.NativeMethodAccessorImpl.invoke(NativeMethodAccessorImpl.java:57)
	at sun.reflect.DelegatingMethodAccessorImpl.invoke(DelegatingMethodAccessorImpl.java:43)
	at java.lang.reflect.Method.invoke(Method.java:606)
	at org.joda.convert.ReflectionStringConverter.convertToString(ReflectionStringConverter.java:63)
	at org.joda.convert.StringConvert.convertToString(StringConvert.java:124)
	at org.joda.time.TestStringConvert.testPeriod(TestStringConvert.java:142)

testYears(org.joda.time.TestStringConvert)  Time elapsed: 0 sec  <<< ERROR!
java.lang.NoClassDefFoundError: Could not initialize class org.joda.time.Years
	at org.joda.time.TestStringConvert.testYears(TestStringConvert.java:155)

testMonths(org.joda.time.TestStringConvert)  Time elapsed: 0 sec  <<< ERROR!
java.lang.NoClassDefFoundError: Could not initialize class org.joda.time.Months
	at org.joda.time.TestStringConvert.testMonths(TestStringConvert.java:162)

testWeeks(org.joda.time.TestStringConvert)  Time elapsed: 0 sec  <<< ERROR!
java.lang.NoClassDefFoundError: Could not initialize class org.joda.time.Weeks
	at org.joda.time.TestStringConvert.testWeeks(TestStringConvert.java:169)

testDays(org.joda.time.TestStringConvert)  Time elapsed: 0 sec  <<< ERROR!
java.lang.NoClassDefFoundError: Could not initialize class org.joda.time.Days
	at org.joda.time.TestStringConvert.testDays(TestStringConvert.java:176)

testHours(org.joda.time.TestStringConvert)  Time elapsed: 0 sec  <<< ERROR!
java.lang.NoClassDefFoundError: Could not initialize class org.joda.time.Hours
	at org.joda.time.TestStringConvert.testHours(TestStringConvert.java:183)

testMinutes(org.joda.time.TestStringConvert)  Time elapsed: 0 sec  <<< ERROR!
java.lang.NoClassDefFoundError: Could not initialize class org.joda.time.Minutes
	at org.joda.time.TestStringConvert.testMinutes(TestStringConvert.java:190)

testSeconds(org.joda.time.TestStringConvert)  Time elapsed: 0.001 sec  <<< ERROR!
java.lang.NoClassDefFoundError: Could not initialize class org.joda.time.Seconds
	at org.joda.time.TestStringConvert.testSeconds(TestStringConvert.java:197)

testMutablePeriod(org.joda.time.TestStringConvert)  Time elapsed: 0.002 sec  <<< ERROR!
java.lang.IllegalStateException: No field to apply suffix to
	at org.joda.time.format.PeriodFormatterBuilder.appendSuffix(PeriodFormatterBuilder.java:151)
	at org.joda.time.format.PeriodFormatterBuilder.appendSuffix(PeriodFormatterBuilder.java:140)
	at org.joda.time.format.ISOPeriodFormat.standard(ISOPeriodFormat.java:66)
	at org.joda.time.base.AbstractPeriod.toString(AbstractPeriod.java:228)
	at sun.reflect.NativeMethodAccessorImpl.invoke0(Native Method)
	at sun.reflect.NativeMethodAccessorImpl.invoke(NativeMethodAccessorImpl.java:57)
	at sun.reflect.DelegatingMethodAccessorImpl.invoke(DelegatingMethodAccessorImpl.java:43)
	at java.lang.reflect.Method.invoke(Method.java:606)
	at org.joda.convert.ReflectionStringConverter.convertToString(ReflectionStringConverter.java:63)
	at org.joda.convert.StringConvert.convertToString(StringConvert.java:124)
	at org.joda.time.TestStringConvert.testMutablePeriod(TestStringConvert.java:149)

testSetIntoPeriod_Object1(org.joda.time.convert.TestStringConverter)  Time elapsed: 0 sec  <<< ERROR!
java.lang.IllegalStateException: No field to apply suffix to
	at org.joda.time.format.PeriodFormatterBuilder.appendSuffix(PeriodFormatterBuilder.java:151)
	at org.joda.time.format.PeriodFormatterBuilder.appendSuffix(PeriodFormatterBuilder.java:140)
	at org.joda.time.format.ISOPeriodFormat.standard(ISOPeriodFormat.java:66)
	at org.joda.time.convert.StringConverter.setInto(StringConverter.java:163)
	at org.joda.time.convert.TestStringConverter.testSetIntoPeriod_Object1(TestStringConverter.java:365)

testSetIntoPeriod_Object2(org.joda.time.convert.TestStringConverter)  Time elapsed: 0.001 sec  <<< ERROR!
java.lang.IllegalStateException: No field to apply suffix to
	at org.joda.time.format.PeriodFormatterBuilder.appendSuffix(PeriodFormatterBuilder.java:151)
	at org.joda.time.format.PeriodFormatterBuilder.appendSuffix(PeriodFormatterBuilder.java:140)
	at org.joda.time.format.ISOPeriodFormat.standard(ISOPeriodFormat.java:66)
	at org.joda.time.convert.StringConverter.setInto(StringConverter.java:163)
	at org.joda.time.convert.TestStringConverter.testSetIntoPeriod_Object2(TestStringConverter.java:377)

testSetIntoInterval_Object_Chronology4(org.joda.time.convert.TestStringConverter)  Time elapsed: 0.001 sec  <<< ERROR!
java.lang.IllegalStateException: No field to apply suffix to
	at org.joda.time.format.PeriodFormatterBuilder.appendSuffix(PeriodFormatterBuilder.java:151)
	at org.joda.time.format.PeriodFormatterBuilder.appendSuffix(PeriodFormatterBuilder.java:140)
	at org.joda.time.format.ISOPeriodFormat.standard(ISOPeriodFormat.java:66)
	at org.joda.time.convert.StringConverter.setInto(StringConverter.java:202)
	at org.joda.time.convert.TestStringConverter.testSetIntoInterval_Object_Chronology4(TestStringConverter.java:500)

testSetIntoInterval_Object_Chronology5(org.joda.time.convert.TestStringConverter)  Time elapsed: 0 sec  <<< ERROR!
java.lang.IllegalStateException: No field to apply suffix to
	at org.joda.time.format.PeriodFormatterBuilder.appendSuffix(PeriodFormatterBuilder.java:151)
	at org.joda.time.format.PeriodFormatterBuilder.appendSuffix(PeriodFormatterBuilder.java:140)
	at org.joda.time.format.ISOPeriodFormat.standard(ISOPeriodFormat.java:66)
	at org.joda.time.convert.StringConverter.setInto(StringConverter.java:202)
	at org.joda.time.convert.TestStringConverter.testSetIntoInterval_Object_Chronology5(TestStringConverter.java:508)

testSetIntoInterval_Object_Chronology6(org.joda.time.convert.TestStringConverter)  Time elapsed: 0 sec  <<< ERROR!
java.lang.IllegalStateException: No field to apply suffix to
	at org.joda.time.format.PeriodFormatterBuilder.appendSuffix(PeriodFormatterBuilder.java:151)
	at org.joda.time.format.PeriodFormatterBuilder.appendSuffix(PeriodFormatterBuilder.java:140)
	at org.joda.time.format.ISOPeriodFormat.standard(ISOPeriodFormat.java:66)
	at org.joda.time.convert.StringConverter.setInto(StringConverter.java:202)
	at org.joda.time.convert.TestStringConverter.testSetIntoInterval_Object_Chronology6(TestStringConverter.java:516)

testSetIntoInterval_Object_Chronology7(org.joda.time.convert.TestStringConverter)  Time elapsed: 0 sec  <<< ERROR!
java.lang.IllegalStateException: No field to apply suffix to
	at org.joda.time.format.PeriodFormatterBuilder.appendSuffix(PeriodFormatterBuilder.java:151)
	at org.joda.time.format.PeriodFormatterBuilder.appendSuffix(PeriodFormatterBuilder.java:140)
	at org.joda.time.format.ISOPeriodFormat.standard(ISOPeriodFormat.java:66)
	at org.joda.time.convert.StringConverter.setInto(StringConverter.java:202)
	at org.joda.time.convert.TestStringConverter.testSetIntoInterval_Object_Chronology7(TestStringConverter.java:524)

testSetIntoInterval_Object_Chronology8(org.joda.time.convert.TestStringConverter)  Time elapsed: 0.001 sec  <<< ERROR!
java.lang.IllegalStateException: No field to apply suffix to
	at org.joda.time.format.PeriodFormatterBuilder.appendSuffix(PeriodFormatterBuilder.java:151)
	at org.joda.time.format.PeriodFormatterBuilder.appendSuffix(PeriodFormatterBuilder.java:140)
	at org.joda.time.format.ISOPeriodFormat.standard(ISOPeriodFormat.java:66)
	at org.joda.time.convert.StringConverter.setInto(StringConverter.java:202)
	at org.joda.time.convert.TestStringConverter.testSetIntoInterval_Object_Chronology8(TestStringConverter.java:532)

testSetIntoIntervalEx_Object_Chronology5(org.joda.time.convert.TestStringConverter)  Time elapsed: 0.001 sec  <<< ERROR!
java.lang.IllegalStateException: No field to apply suffix to
	at org.joda.time.format.PeriodFormatterBuilder.appendSuffix(PeriodFormatterBuilder.java:151)
	at org.joda.time.format.PeriodFormatterBuilder.appendSuffix(PeriodFormatterBuilder.java:140)
	at org.joda.time.format.ISOPeriodFormat.standard(ISOPeriodFormat.java:66)
	at org.joda.time.convert.StringConverter.setInto(StringConverter.java:202)
	at org.joda.time.convert.TestStringConverter.testSetIntoIntervalEx_Object_Chronology5(TestStringConverter.java:573)

testSetIntoPeriod_Object3(org.joda.time.convert.TestStringConverter)  Time elapsed: 0 sec  <<< ERROR!
java.lang.IllegalStateException: No field to apply suffix to
	at org.joda.time.format.PeriodFormatterBuilder.appendSuffix(PeriodFormatterBuilder.java:151)
	at org.joda.time.format.PeriodFormatterBuilder.appendSuffix(PeriodFormatterBuilder.java:140)
	at org.joda.time.format.ISOPeriodFormat.standard(ISOPeriodFormat.java:66)
	at org.joda.time.convert.StringConverter.setInto(StringConverter.java:163)
	at org.joda.time.convert.TestStringConverter.testSetIntoPeriod_Object3(TestStringConverter.java:389)

testSetIntoPeriod_Object4(org.joda.time.convert.TestStringConverter)  Time elapsed: 0 sec  <<< ERROR!
java.lang.IllegalStateException: No field to apply suffix to
	at org.joda.time.format.PeriodFormatterBuilder.appendSuffix(PeriodFormatterBuilder.java:151)
	at org.joda.time.format.PeriodFormatterBuilder.appendSuffix(PeriodFormatterBuilder.java:140)
	at org.joda.time.format.ISOPeriodFormat.standard(ISOPeriodFormat.java:66)
	at org.joda.time.convert.StringConverter.setInto(StringConverter.java:163)
	at org.joda.time.convert.TestStringConverter.testSetIntoPeriod_Object4(TestStringConverter.java:401)

testSetIntoPeriod_Object5(org.joda.time.convert.TestStringConverter)  Time elapsed: 0.001 sec  <<< ERROR!
java.lang.IllegalStateException: No field to apply suffix to
	at org.joda.time.format.PeriodFormatterBuilder.appendSuffix(PeriodFormatterBuilder.java:151)
	at org.joda.time.format.PeriodFormatterBuilder.appendSuffix(PeriodFormatterBuilder.java:140)
	at org.joda.time.format.ISOPeriodFormat.standard(ISOPeriodFormat.java:66)
	at org.joda.time.convert.StringConverter.setInto(StringConverter.java:163)
	at org.joda.time.convert.TestStringConverter.testSetIntoPeriod_Object5(TestStringConverter.java:413)

testSetIntoPeriod_Object6(org.joda.time.convert.TestStringConverter)  Time elapsed: 0 sec  <<< ERROR!
java.lang.IllegalStateException: No field to apply suffix to
	at org.joda.time.format.PeriodFormatterBuilder.appendSuffix(PeriodFormatterBuilder.java:151)
	at org.joda.time.format.PeriodFormatterBuilder.appendSuffix(PeriodFormatterBuilder.java:140)
	at org.joda.time.format.ISOPeriodFormat.standard(ISOPeriodFormat.java:66)
	at org.joda.time.convert.StringConverter.setInto(StringConverter.java:163)
	at org.joda.time.convert.TestStringConverter.testSetIntoPeriod_Object6(TestStringConverter.java:425)

testSetIntoPeriod_Object7(org.joda.time.convert.TestStringConverter)  Time elapsed: 0.001 sec  <<< ERROR!
java.lang.IllegalStateException: No field to apply suffix to
	at org.joda.time.format.PeriodFormatterBuilder.appendSuffix(PeriodFormatterBuilder.java:151)
	at org.joda.time.format.PeriodFormatterBuilder.appendSuffix(PeriodFormatterBuilder.java:140)
	at org.joda.time.format.ISOPeriodFormat.standard(ISOPeriodFormat.java:66)
	at org.joda.time.convert.StringConverter.setInto(StringConverter.java:163)
	at org.joda.time.convert.TestStringConverter.testSetIntoPeriod_Object7(TestStringConverter.java:437)

testSetIntoPeriod_Object8(org.joda.time.convert.TestStringConverter)  Time elapsed: 0 sec  <<< ERROR!
java.lang.IllegalStateException: No field to apply suffix to
	at org.joda.time.format.PeriodFormatterBuilder.appendSuffix(PeriodFormatterBuilder.java:151)
	at org.joda.time.format.PeriodFormatterBuilder.appendSuffix(PeriodFormatterBuilder.java:140)
	at org.joda.time.format.ISOPeriodFormat.standard(ISOPeriodFormat.java:66)
	at org.joda.time.convert.StringConverter.setInto(StringConverter.java:163)
	at org.joda.time.convert.TestStringConverter.testSetIntoPeriod_Object8(TestStringConverter.java:450)

testSetIntoInterval_Object_Chronology1(org.joda.time.convert.TestStringConverter)  Time elapsed: 0.001 sec  <<< ERROR!
java.lang.IllegalStateException: No field to apply suffix to
	at org.joda.time.format.PeriodFormatterBuilder.appendSuffix(PeriodFormatterBuilder.java:151)
	at org.joda.time.format.PeriodFormatterBuilder.appendSuffix(PeriodFormatterBuilder.java:140)
	at org.joda.time.format.ISOPeriodFormat.standard(ISOPeriodFormat.java:66)
	at org.joda.time.convert.StringConverter.setInto(StringConverter.java:202)
	at org.joda.time.convert.TestStringConverter.testSetIntoInterval_Object_Chronology1(TestStringConverter.java:476)

testSetIntoInterval_Object_Chronology2(org.joda.time.convert.TestStringConverter)  Time elapsed: 0 sec  <<< ERROR!
java.lang.IllegalStateException: No field to apply suffix to
	at org.joda.time.format.PeriodFormatterBuilder.appendSuffix(PeriodFormatterBuilder.java:151)
	at org.joda.time.format.PeriodFormatterBuilder.appendSuffix(PeriodFormatterBuilder.java:140)
	at org.joda.time.format.ISOPeriodFormat.standard(ISOPeriodFormat.java:66)
	at org.joda.time.convert.StringConverter.setInto(StringConverter.java:202)
	at org.joda.time.convert.TestStringConverter.testSetIntoInterval_Object_Chronology2(TestStringConverter.java:484)

testSetIntoInterval_Object_Chronology3(org.joda.time.convert.TestStringConverter)  Time elapsed: 0 sec  <<< ERROR!
java.lang.IllegalStateException: No field to apply suffix to
	at org.joda.time.format.PeriodFormatterBuilder.appendSuffix(PeriodFormatterBuilder.java:151)
	at org.joda.time.format.PeriodFormatterBuilder.appendSuffix(PeriodFormatterBuilder.java:140)
	at org.joda.time.format.ISOPeriodFormat.standard(ISOPeriodFormat.java:66)
	at org.joda.time.convert.StringConverter.setInto(StringConverter.java:202)
	at org.joda.time.convert.TestStringConverter.testSetIntoInterval_Object_Chronology3(TestStringConverter.java:492)

testParseInto_simple(org.joda.time.format.TestPeriodFormatter)  Time elapsed: 0 sec  <<< ERROR!
java.lang.IllegalStateException: No field to apply suffix to
	at org.joda.time.format.PeriodFormatterBuilder.appendSuffix(PeriodFormatterBuilder.java:151)
	at org.joda.time.format.PeriodFormatterBuilder.appendSuffix(PeriodFormatterBuilder.java:140)
	at org.joda.time.format.ISOPeriodFormat.standard(ISOPeriodFormat.java:66)
	at org.joda.time.format.TestPeriodFormatter.setUp(TestPeriodFormatter.java:84)
	at junit.framework.TestCase.runBare(TestCase.java:128)
	at junit.framework.TestResult$1.protect(TestResult.java:106)
	at junit.framework.TestResult.runProtected(TestResult.java:124)
	at junit.framework.TestResult.run(TestResult.java:109)
	at junit.framework.TestCase.run(TestCase.java:120)
	at junit.framework.TestSuite.runTest(TestSuite.java:230)
	at junit.framework.TestSuite.run(TestSuite.java:225)
	at junit.framework.TestSuite.runTest(TestSuite.java:230)
	at junit.framework.TestSuite.run(TestSuite.java:225)
	at junit.framework.TestSuite.runTest(TestSuite.java:230)
	at junit.framework.TestSuite.run(TestSuite.java:225)
	at sun.reflect.NativeMethodAccessorImpl.invoke0(Native Method)
	at sun.reflect.NativeMethodAccessorImpl.invoke(NativeMethodAccessorImpl.java:57)
	at sun.reflect.DelegatingMethodAccessorImpl.invoke(DelegatingMethodAccessorImpl.java:43)
	at java.lang.reflect.Method.invoke(Method.java:606)
	at org.apache.maven.surefire.junit.JUnitTestSet.execute(JUnitTestSet.java:99)
	at org.apache.maven.surefire.junit.JUnit3Provider.executeTestSet(JUnit3Provider.java:130)
	at org.apache.maven.surefire.junit.JUnit3Provider.invoke(JUnit3Provider.java:107)
	at org.apache.maven.surefire.booter.ForkedBooter.invokeProviderInSameClassLoader(ForkedBooter.java:203)
	at org.apache.maven.surefire.booter.ForkedBooter.runSuitesInProcess(ForkedBooter.java:155)
	at org.apache.maven.surefire.booter.ForkedBooter.main(ForkedBooter.java:103)

testPrinterParserMethods(org.joda.time.format.TestPeriodFormatter)  Time elapsed: 0.001 sec  <<< ERROR!
java.lang.IllegalStateException: No field to apply suffix to
	at org.joda.time.format.PeriodFormatterBuilder.appendSuffix(PeriodFormatterBuilder.java:151)
	at org.joda.time.format.PeriodFormatterBuilder.appendSuffix(PeriodFormatterBuilder.java:140)
	at org.joda.time.format.ISOPeriodFormat.standard(ISOPeriodFormat.java:66)
	at org.joda.time.format.TestPeriodFormatter.setUp(TestPeriodFormatter.java:84)
	at junit.framework.TestCase.runBare(TestCase.java:128)
	at junit.framework.TestResult$1.protect(TestResult.java:106)
	at junit.framework.TestResult.runProtected(TestResult.java:124)
	at junit.framework.TestResult.run(TestResult.java:109)
	at junit.framework.TestCase.run(TestCase.java:120)
	at junit.framework.TestSuite.runTest(TestSuite.java:230)
	at junit.framework.TestSuite.run(TestSuite.java:225)
	at junit.framework.TestSuite.runTest(TestSuite.java:230)
	at junit.framework.TestSuite.run(TestSuite.java:225)
	at junit.framework.TestSuite.runTest(TestSuite.java:230)
	at junit.framework.TestSuite.run(TestSuite.java:225)
	at sun.reflect.NativeMethodAccessorImpl.invoke0(Native Method)
	at sun.reflect.NativeMethodAccessorImpl.invoke(NativeMethodAccessorImpl.java:57)
	at sun.reflect.DelegatingMethodAccessorImpl.invoke(DelegatingMethodAccessorImpl.java:43)
	at java.lang.reflect.Method.invoke(Method.java:606)
	at org.apache.maven.surefire.junit.JUnitTestSet.execute(JUnitTestSet.java:99)
	at org.apache.maven.surefire.junit.JUnit3Provider.executeTestSet(JUnit3Provider.java:130)
	at org.apache.maven.surefire.junit.JUnit3Provider.invoke(JUnit3Provider.java:107)
	at org.apache.maven.surefire.booter.ForkedBooter.invokeProviderInSameClassLoader(ForkedBooter.java:203)
	at org.apache.maven.surefire.booter.ForkedBooter.runSuitesInProcess(ForkedBooter.java:155)
	at org.apache.maven.surefire.booter.ForkedBooter.main(ForkedBooter.java:103)

testPrint_simple(org.joda.time.format.TestPeriodFormatter)  Time elapsed: 0 sec  <<< ERROR!
java.lang.IllegalStateException: No field to apply suffix to
	at org.joda.time.format.PeriodFormatterBuilder.appendSuffix(PeriodFormatterBuilder.java:151)
	at org.joda.time.format.PeriodFormatterBuilder.appendSuffix(PeriodFormatterBuilder.java:140)
	at org.joda.time.format.ISOPeriodFormat.standard(ISOPeriodFormat.java:66)
	at org.joda.time.format.TestPeriodFormatter.setUp(TestPeriodFormatter.java:84)
	at junit.framework.TestCase.runBare(TestCase.java:128)
	at junit.framework.TestResult$1.protect(TestResult.java:106)
	at junit.framework.TestResult.runProtected(TestResult.java:124)
	at junit.framework.TestResult.run(TestResult.java:109)
	at junit.framework.TestCase.run(TestCase.java:120)
	at junit.framework.TestSuite.runTest(TestSuite.java:230)
	at junit.framework.TestSuite.run(TestSuite.java:225)
	at junit.framework.TestSuite.runTest(TestSuite.java:230)
	at junit.framework.TestSuite.run(TestSuite.java:225)
	at junit.framework.TestSuite.runTest(TestSuite.java:230)
	at junit.framework.TestSuite.run(TestSuite.java:225)
	at sun.reflect.NativeMethodAccessorImpl.invoke0(Native Method)
	at sun.reflect.NativeMethodAccessorImpl.invoke(NativeMethodAccessorImpl.java:57)
	at sun.reflect.DelegatingMethodAccessorImpl.invoke(DelegatingMethodAccessorImpl.java:43)
	at java.lang.reflect.Method.invoke(Method.java:606)
	at org.apache.maven.surefire.junit.JUnitTestSet.execute(JUnitTestSet.java:99)
	at org.apache.maven.surefire.junit.JUnit3Provider.executeTestSet(JUnit3Provider.java:130)
	at org.apache.maven.surefire.junit.JUnit3Provider.invoke(JUnit3Provider.java:107)
	at org.apache.maven.surefire.booter.ForkedBooter.invokeProviderInSameClassLoader(ForkedBooter.java:203)
	at org.apache.maven.surefire.booter.ForkedBooter.runSuitesInProcess(ForkedBooter.java:155)
	at org.apache.maven.surefire.booter.ForkedBooter.main(ForkedBooter.java:103)

testPrint_bufferMethods(org.joda.time.format.TestPeriodFormatter)  Time elapsed: 0.001 sec  <<< ERROR!
java.lang.IllegalStateException: No field to apply suffix to
	at org.joda.time.format.PeriodFormatterBuilder.appendSuffix(PeriodFormatterBuilder.java:151)
	at org.joda.time.format.PeriodFormatterBuilder.appendSuffix(PeriodFormatterBuilder.java:140)
	at org.joda.time.format.ISOPeriodFormat.standard(ISOPeriodFormat.java:66)
	at org.joda.time.format.TestPeriodFormatter.setUp(TestPeriodFormatter.java:84)
	at junit.framework.TestCase.runBare(TestCase.java:128)
	at junit.framework.TestResult$1.protect(TestResult.java:106)
	at junit.framework.TestResult.runProtected(TestResult.java:124)
	at junit.framework.TestResult.run(TestResult.java:109)
	at junit.framework.TestCase.run(TestCase.java:120)
	at junit.framework.TestSuite.runTest(TestSuite.java:230)
	at junit.framework.TestSuite.run(TestSuite.java:225)
	at junit.framework.TestSuite.runTest(TestSuite.java:230)
	at junit.framework.TestSuite.run(TestSuite.java:225)
	at junit.framework.TestSuite.runTest(TestSuite.java:230)
	at junit.framework.TestSuite.run(TestSuite.java:225)
	at sun.reflect.NativeMethodAccessorImpl.invoke0(Native Method)
	at sun.reflect.NativeMethodAccessorImpl.invoke(NativeMethodAccessorImpl.java:57)
	at sun.reflect.DelegatingMethodAccessorImpl.invoke(DelegatingMethodAccessorImpl.java:43)
	at java.lang.reflect.Method.invoke(Method.java:606)
	at org.apache.maven.surefire.junit.JUnitTestSet.execute(JUnitTestSet.java:99)
	at org.apache.maven.surefire.junit.JUnit3Provider.executeTestSet(JUnit3Provider.java:130)
	at org.apache.maven.surefire.junit.JUnit3Provider.invoke(JUnit3Provider.java:107)
	at org.apache.maven.surefire.booter.ForkedBooter.invokeProviderInSameClassLoader(ForkedBooter.java:203)
	at org.apache.maven.surefire.booter.ForkedBooter.runSuitesInProcess(ForkedBooter.java:155)
	at org.apache.maven.surefire.booter.ForkedBooter.main(ForkedBooter.java:103)

testPrint_writerMethods(org.joda.time.format.TestPeriodFormatter)  Time elapsed: 0.001 sec  <<< ERROR!
java.lang.IllegalStateException: No field to apply suffix to
	at org.joda.time.format.PeriodFormatterBuilder.appendSuffix(PeriodFormatterBuilder.java:151)
	at org.joda.time.format.PeriodFormatterBuilder.appendSuffix(PeriodFormatterBuilder.java:140)
	at org.joda.time.format.ISOPeriodFormat.standard(ISOPeriodFormat.java:66)
	at org.joda.time.format.TestPeriodFormatter.setUp(TestPeriodFormatter.java:84)
	at junit.framework.TestCase.runBare(TestCase.java:128)
	at junit.framework.TestResult$1.protect(TestResult.java:106)
	at junit.framework.TestResult.runProtected(TestResult.java:124)
	at junit.framework.TestResult.run(TestResult.java:109)
	at junit.framework.TestCase.run(TestCase.java:120)
	at junit.framework.TestSuite.runTest(TestSuite.java:230)
	at junit.framework.TestSuite.run(TestSuite.java:225)
	at junit.framework.TestSuite.runTest(TestSuite.java:230)
	at junit.framework.TestSuite.run(TestSuite.java:225)
	at junit.framework.TestSuite.runTest(TestSuite.java:230)
	at junit.framework.TestSuite.run(TestSuite.java:225)
	at sun.reflect.NativeMethodAccessorImpl.invoke0(Native Method)
	at sun.reflect.NativeMethodAccessorImpl.invoke(NativeMethodAccessorImpl.java:57)
	at sun.reflect.DelegatingMethodAccessorImpl.invoke(DelegatingMethodAccessorImpl.java:43)
	at java.lang.reflect.Method.invoke(Method.java:606)
	at org.apache.maven.surefire.junit.JUnitTestSet.execute(JUnitTestSet.java:99)
	at org.apache.maven.surefire.junit.JUnit3Provider.executeTestSet(JUnit3Provider.java:130)
	at org.apache.maven.surefire.junit.JUnit3Provider.invoke(JUnit3Provider.java:107)
	at org.apache.maven.surefire.booter.ForkedBooter.invokeProviderInSameClassLoader(ForkedBooter.java:203)
	at org.apache.maven.surefire.booter.ForkedBooter.runSuitesInProcess(ForkedBooter.java:155)
	at org.apache.maven.surefire.booter.ForkedBooter.main(ForkedBooter.java:103)

testWithGetParseTypeMethods(org.joda.time.format.TestPeriodFormatter)  Time elapsed: 0 sec  <<< ERROR!
java.lang.IllegalStateException: No field to apply suffix to
	at org.joda.time.format.PeriodFormatterBuilder.appendSuffix(PeriodFormatterBuilder.java:151)
	at org.joda.time.format.PeriodFormatterBuilder.appendSuffix(PeriodFormatterBuilder.java:140)
	at org.joda.time.format.ISOPeriodFormat.standard(ISOPeriodFormat.java:66)
	at org.joda.time.format.TestPeriodFormatter.setUp(TestPeriodFormatter.java:84)
	at junit.framework.TestCase.runBare(TestCase.java:128)
	at junit.framework.TestResult$1.protect(TestResult.java:106)
	at junit.framework.TestResult.runProtected(TestResult.java:124)
	at junit.framework.TestResult.run(TestResult.java:109)
	at junit.framework.TestCase.run(TestCase.java:120)
	at junit.framework.TestSuite.runTest(TestSuite.java:230)
	at junit.framework.TestSuite.run(TestSuite.java:225)
	at junit.framework.TestSuite.runTest(TestSuite.java:230)
	at junit.framework.TestSuite.run(TestSuite.java:225)
	at junit.framework.TestSuite.runTest(TestSuite.java:230)
	at junit.framework.TestSuite.run(TestSuite.java:225)
	at sun.reflect.NativeMethodAccessorImpl.invoke0(Native Method)
	at sun.reflect.NativeMethodAccessorImpl.invoke(NativeMethodAccessorImpl.java:57)
	at sun.reflect.DelegatingMethodAccessorImpl.invoke(DelegatingMethodAccessorImpl.java:43)
	at java.lang.reflect.Method.invoke(Method.java:606)
	at org.apache.maven.surefire.junit.JUnitTestSet.execute(JUnitTestSet.java:99)
	at org.apache.maven.surefire.junit.JUnit3Provider.executeTestSet(JUnit3Provider.java:130)
	at org.apache.maven.surefire.junit.JUnit3Provider.invoke(JUnit3Provider.java:107)
	at org.apache.maven.surefire.booter.ForkedBooter.invokeProviderInSameClassLoader(ForkedBooter.java:203)
	at org.apache.maven.surefire.booter.ForkedBooter.runSuitesInProcess(ForkedBooter.java:155)
	at org.apache.maven.surefire.booter.ForkedBooter.main(ForkedBooter.java:103)

testParsePeriod_simple(org.joda.time.format.TestPeriodFormatter)  Time elapsed: 0.001 sec  <<< ERROR!
java.lang.IllegalStateException: No field to apply suffix to
	at org.joda.time.format.PeriodFormatterBuilder.appendSuffix(PeriodFormatterBuilder.java:151)
	at org.joda.time.format.PeriodFormatterBuilder.appendSuffix(PeriodFormatterBuilder.java:140)
	at org.joda.time.format.ISOPeriodFormat.standard(ISOPeriodFormat.java:66)
	at org.joda.time.format.TestPeriodFormatter.setUp(TestPeriodFormatter.java:84)
	at junit.framework.TestCase.runBare(TestCase.java:128)
	at junit.framework.TestResult$1.protect(TestResult.java:106)
	at junit.framework.TestResult.runProtected(TestResult.java:124)
	at junit.framework.TestResult.run(TestResult.java:109)
	at junit.framework.TestCase.run(TestCase.java:120)
	at junit.framework.TestSuite.runTest(TestSuite.java:230)
	at junit.framework.TestSuite.run(TestSuite.java:225)
	at junit.framework.TestSuite.runTest(TestSuite.java:230)
	at junit.framework.TestSuite.run(TestSuite.java:225)
	at junit.framework.TestSuite.runTest(TestSuite.java:230)
	at junit.framework.TestSuite.run(TestSuite.java:225)
	at sun.reflect.NativeMethodAccessorImpl.invoke0(Native Method)
	at sun.reflect.NativeMethodAccessorImpl.invoke(NativeMethodAccessorImpl.java:57)
	at sun.reflect.DelegatingMethodAccessorImpl.invoke(DelegatingMethodAccessorImpl.java:43)
	at java.lang.reflect.Method.invoke(Method.java:606)
	at org.apache.maven.surefire.junit.JUnitTestSet.execute(JUnitTestSet.java:99)
	at org.apache.maven.surefire.junit.JUnit3Provider.executeTestSet(JUnit3Provider.java:130)
	at org.apache.maven.surefire.junit.JUnit3Provider.invoke(JUnit3Provider.java:107)
	at org.apache.maven.surefire.booter.ForkedBooter.invokeProviderInSameClassLoader(ForkedBooter.java:203)
	at org.apache.maven.surefire.booter.ForkedBooter.runSuitesInProcess(ForkedBooter.java:155)
	at org.apache.maven.surefire.booter.ForkedBooter.main(ForkedBooter.java:103)

testParsePeriod_parseType(org.joda.time.format.TestPeriodFormatter)  Time elapsed: 0.001 sec  <<< ERROR!
java.lang.IllegalStateException: No field to apply suffix to
	at org.joda.time.format.PeriodFormatterBuilder.appendSuffix(PeriodFormatterBuilder.java:151)
	at org.joda.time.format.PeriodFormatterBuilder.appendSuffix(PeriodFormatterBuilder.java:140)
	at org.joda.time.format.ISOPeriodFormat.standard(ISOPeriodFormat.java:66)
	at org.joda.time.format.TestPeriodFormatter.setUp(TestPeriodFormatter.java:84)
	at junit.framework.TestCase.runBare(TestCase.java:128)
	at junit.framework.TestResult$1.protect(TestResult.java:106)
	at junit.framework.TestResult.runProtected(TestResult.java:124)
	at junit.framework.TestResult.run(TestResult.java:109)
	at junit.framework.TestCase.run(TestCase.java:120)
	at junit.framework.TestSuite.runTest(TestSuite.java:230)
	at junit.framework.TestSuite.run(TestSuite.java:225)
	at junit.framework.TestSuite.runTest(TestSuite.java:230)
	at junit.framework.TestSuite.run(TestSuite.java:225)
	at junit.framework.TestSuite.runTest(TestSuite.java:230)
	at junit.framework.TestSuite.run(TestSuite.java:225)
	at sun.reflect.NativeMethodAccessorImpl.invoke0(Native Method)
	at sun.reflect.NativeMethodAccessorImpl.invoke(NativeMethodAccessorImpl.java:57)
	at sun.reflect.DelegatingMethodAccessorImpl.invoke(DelegatingMethodAccessorImpl.java:43)
	at java.lang.reflect.Method.invoke(Method.java:606)
	at org.apache.maven.surefire.junit.JUnitTestSet.execute(JUnitTestSet.java:99)
	at org.apache.maven.surefire.junit.JUnit3Provider.executeTestSet(JUnit3Provider.java:130)
	at org.apache.maven.surefire.junit.JUnit3Provider.invoke(JUnit3Provider.java:107)
	at org.apache.maven.surefire.booter.ForkedBooter.invokeProviderInSameClassLoader(ForkedBooter.java:203)
	at org.apache.maven.surefire.booter.ForkedBooter.runSuitesInProcess(ForkedBooter.java:155)
	at org.apache.maven.surefire.booter.ForkedBooter.main(ForkedBooter.java:103)

testParseMutablePeriod_simple(org.joda.time.format.TestPeriodFormatter)  Time elapsed: 0.001 sec  <<< ERROR!
java.lang.IllegalStateException: No field to apply suffix to
	at org.joda.time.format.PeriodFormatterBuilder.appendSuffix(PeriodFormatterBuilder.java:151)
	at org.joda.time.format.PeriodFormatterBuilder.appendSuffix(PeriodFormatterBuilder.java:140)
	at org.joda.time.format.ISOPeriodFormat.standard(ISOPeriodFormat.java:66)
	at org.joda.time.format.TestPeriodFormatter.setUp(TestPeriodFormatter.java:84)
	at junit.framework.TestCase.runBare(TestCase.java:128)
	at junit.framework.TestResult$1.protect(TestResult.java:106)
	at junit.framework.TestResult.runProtected(TestResult.java:124)
	at junit.framework.TestResult.run(TestResult.java:109)
	at junit.framework.TestCase.run(TestCase.java:120)
	at junit.framework.TestSuite.runTest(TestSuite.java:230)
	at junit.framework.TestSuite.run(TestSuite.java:225)
	at junit.framework.TestSuite.runTest(TestSuite.java:230)
	at junit.framework.TestSuite.run(TestSuite.java:225)
	at junit.framework.TestSuite.runTest(TestSuite.java:230)
	at junit.framework.TestSuite.run(TestSuite.java:225)
	at sun.reflect.NativeMethodAccessorImpl.invoke0(Native Method)
	at sun.reflect.NativeMethodAccessorImpl.invoke(NativeMethodAccessorImpl.java:57)
	at sun.reflect.DelegatingMethodAccessorImpl.invoke(DelegatingMethodAccessorImpl.java:43)
	at java.lang.reflect.Method.invoke(Method.java:606)
	at org.apache.maven.surefire.junit.JUnitTestSet.execute(JUnitTestSet.java:99)
	at org.apache.maven.surefire.junit.JUnit3Provider.executeTestSet(JUnit3Provider.java:130)
	at org.apache.maven.surefire.junit.JUnit3Provider.invoke(JUnit3Provider.java:107)
	at org.apache.maven.surefire.booter.ForkedBooter.invokeProviderInSameClassLoader(ForkedBooter.java:203)
	at org.apache.maven.surefire.booter.ForkedBooter.runSuitesInProcess(ForkedBooter.java:155)
	at org.apache.maven.surefire.booter.ForkedBooter.main(ForkedBooter.java:103)

testWithGetLocaleMethods(org.joda.time.format.TestPeriodFormatter)  Time elapsed: 0 sec  <<< ERROR!
java.lang.IllegalStateException: No field to apply suffix to
	at org.joda.time.format.PeriodFormatterBuilder.appendSuffix(PeriodFormatterBuilder.java:151)
	at org.joda.time.format.PeriodFormatterBuilder.appendSuffix(PeriodFormatterBuilder.java:140)
	at org.joda.time.format.ISOPeriodFormat.standard(ISOPeriodFormat.java:66)
	at org.joda.time.format.TestPeriodFormatter.setUp(TestPeriodFormatter.java:84)
	at junit.framework.TestCase.runBare(TestCase.java:128)
	at junit.framework.TestResult$1.protect(TestResult.java:106)
	at junit.framework.TestResult.runProtected(TestResult.java:124)
	at junit.framework.TestResult.run(TestResult.java:109)
	at junit.framework.TestCase.run(TestCase.java:120)
	at junit.framework.TestSuite.runTest(TestSuite.java:230)
	at junit.framework.TestSuite.run(TestSuite.java:225)
	at junit.framework.TestSuite.runTest(TestSuite.java:230)
	at junit.framework.TestSuite.run(TestSuite.java:225)
	at junit.framework.TestSuite.runTest(TestSuite.java:230)
	at junit.framework.TestSuite.run(TestSuite.java:225)
	at sun.reflect.NativeMethodAccessorImpl.invoke0(Native Method)
	at sun.reflect.NativeMethodAccessorImpl.invoke(NativeMethodAccessorImpl.java:57)
	at sun.reflect.DelegatingMethodAccessorImpl.invoke(DelegatingMethodAccessorImpl.java:43)
	at java.lang.reflect.Method.invoke(Method.java:606)
	at org.apache.maven.surefire.junit.JUnitTestSet.execute(JUnitTestSet.java:99)
	at org.apache.maven.surefire.junit.JUnit3Provider.executeTestSet(JUnit3Provider.java:130)
	at org.apache.maven.surefire.junit.JUnit3Provider.invoke(JUnit3Provider.java:107)
	at org.apache.maven.surefire.booter.ForkedBooter.invokeProviderInSameClassLoader(ForkedBooter.java:203)
	at org.apache.maven.surefire.booter.ForkedBooter.runSuitesInProcess(ForkedBooter.java:155)
	at org.apache.maven.surefire.booter.ForkedBooter.main(ForkedBooter.java:103)

test_wordBased_pl_formatTwoFields(org.joda.time.format.TestPeriodFormat)  Time elapsed: 0.008 sec  <<< ERROR!
java.lang.IllegalStateException: No field to apply suffix to
	at org.joda.time.format.PeriodFormatterBuilder.appendSuffix(PeriodFormatterBuilder.java:151)
	at org.joda.time.format.PeriodFormatterBuilder.appendSuffix(PeriodFormatterBuilder.java:144)
	at org.joda.time.format.PeriodFormat.buildRegExFormatter(PeriodFormat.java:232)
	at org.joda.time.format.PeriodFormat.buildWordBased(PeriodFormat.java:219)
	at org.joda.time.format.PeriodFormat.wordBased(PeriodFormat.java:205)
	at org.joda.time.format.TestPeriodFormat.test_wordBased_pl_formatTwoFields(TestPeriodFormat.java:392)

test_wordBased_pl_parseOneField(org.joda.time.format.TestPeriodFormat)  Time elapsed: 0.001 sec  <<< ERROR!
java.lang.IllegalStateException: No field to apply suffix to
	at org.joda.time.format.PeriodFormatterBuilder.appendSuffix(PeriodFormatterBuilder.java:151)
	at org.joda.time.format.PeriodFormatterBuilder.appendSuffix(PeriodFormatterBuilder.java:144)
	at org.joda.time.format.PeriodFormat.buildRegExFormatter(PeriodFormat.java:232)
	at org.joda.time.format.PeriodFormat.buildWordBased(PeriodFormat.java:219)
	at org.joda.time.format.PeriodFormat.wordBased(PeriodFormat.java:205)
	at org.joda.time.format.TestPeriodFormat.test_wordBased_pl_parseOneField(TestPeriodFormat.java:398)

test_wordBased_pl_parseTwoFields(org.joda.time.format.TestPeriodFormat)  Time elapsed: 0 sec  <<< ERROR!
java.lang.IllegalStateException: No field to apply suffix to
	at org.joda.time.format.PeriodFormatterBuilder.appendSuffix(PeriodFormatterBuilder.java:151)
	at org.joda.time.format.PeriodFormatterBuilder.appendSuffix(PeriodFormatterBuilder.java:144)
	at org.joda.time.format.PeriodFormat.buildRegExFormatter(PeriodFormat.java:232)
	at org.joda.time.format.PeriodFormat.buildWordBased(PeriodFormat.java:219)
	at org.joda.time.format.PeriodFormat.wordBased(PeriodFormat.java:205)
	at org.joda.time.format.TestPeriodFormat.test_wordBased_pl_parseTwoFields(TestPeriodFormat.java:404)

test_wordBased_pl_checkRedundantSeparator(org.joda.time.format.TestPeriodFormat)  Time elapsed: 0.001 sec  <<< FAILURE!
junit.framework.AssertionFailedError: expected:<class java.lang.IllegalArgumentException> but was:<class java.lang.IllegalStateException>
	at junit.framework.Assert.fail(Assert.java:47)
	at junit.framework.Assert.failNotEquals(Assert.java:280)
	at junit.framework.Assert.assertEquals(Assert.java:64)
	at junit.framework.Assert.assertEquals(Assert.java:71)
	at org.joda.time.format.TestPeriodFormat.test_wordBased_pl_checkRedundantSeparator(TestPeriodFormat.java:413)

test_wordBased_pl_cached(org.joda.time.format.TestPeriodFormat)  Time elapsed: 0.001 sec  <<< ERROR!
java.lang.IllegalStateException: No field to apply suffix to
	at org.joda.time.format.PeriodFormatterBuilder.appendSuffix(PeriodFormatterBuilder.java:151)
	at org.joda.time.format.PeriodFormatterBuilder.appendSuffix(PeriodFormatterBuilder.java:144)
	at org.joda.time.format.PeriodFormat.buildRegExFormatter(PeriodFormat.java:232)
	at org.joda.time.format.PeriodFormat.buildWordBased(PeriodFormat.java:219)
	at org.joda.time.format.PeriodFormat.wordBased(PeriodFormat.java:205)
	at org.joda.time.format.TestPeriodFormat.test_wordBased_pl_cached(TestPeriodFormat.java:419)

test_wordBased_pl_regEx(org.joda.time.format.TestPeriodFormat)  Time elapsed: 0 sec  <<< ERROR!
java.lang.IllegalStateException: No field to apply suffix to
	at org.joda.time.format.PeriodFormatterBuilder.appendSuffix(PeriodFormatterBuilder.java:151)
	at org.joda.time.format.PeriodFormatterBuilder.appendSuffix(PeriodFormatterBuilder.java:144)
	at org.joda.time.format.PeriodFormat.buildRegExFormatter(PeriodFormat.java:232)
	at org.joda.time.format.PeriodFormat.buildWordBased(PeriodFormat.java:219)
	at org.joda.time.format.PeriodFormat.wordBased(PeriodFormat.java:205)
	at org.joda.time.format.TestPeriodFormat.test_wordBased_pl_regEx(TestPeriodFormat.java:424)

test_wordBased_fr_from_de(org.joda.time.format.TestPeriodFormat)  Time elapsed: 0.001 sec  <<< ERROR!
java.lang.IllegalStateException: No field to apply suffix to
	at org.joda.time.format.PeriodFormatterBuilder.appendSuffix(PeriodFormatterBuilder.java:151)
	at org.joda.time.format.PeriodFormatterBuilder.appendSuffix(PeriodFormatterBuilder.java:142)
	at org.joda.time.format.PeriodFormat.buildNonRegExFormatter(PeriodFormat.java:313)
	at org.joda.time.format.PeriodFormat.buildWordBased(PeriodFormat.java:221)
	at org.joda.time.format.PeriodFormat.wordBased(PeriodFormat.java:205)
	at org.joda.time.format.TestPeriodFormat.test_wordBased_fr_from_de(TestPeriodFormat.java:580)

test_wordBased_fr_from_nl(org.joda.time.format.TestPeriodFormat)  Time elapsed: 0.001 sec  <<< ERROR!
java.lang.IllegalStateException: No field to apply suffix to
	at org.joda.time.format.PeriodFormatterBuilder.appendSuffix(PeriodFormatterBuilder.java:151)
	at org.joda.time.format.PeriodFormatterBuilder.appendSuffix(PeriodFormatterBuilder.java:142)
	at org.joda.time.format.PeriodFormat.buildNonRegExFormatter(PeriodFormat.java:313)
	at org.joda.time.format.PeriodFormat.buildWordBased(PeriodFormat.java:221)
	at org.joda.time.format.PeriodFormat.wordBased(PeriodFormat.java:205)
	at org.joda.time.format.TestPeriodFormat.test_wordBased_fr_from_nl(TestPeriodFormat.java:586)

test_wordBased_en_from_de(org.joda.time.format.TestPeriodFormat)  Time elapsed: 0 sec  <<< ERROR!
java.lang.IllegalStateException: No field to apply suffix to
	at org.joda.time.format.PeriodFormatterBuilder.appendSuffix(PeriodFormatterBuilder.java:151)
	at org.joda.time.format.PeriodFormatterBuilder.appendSuffix(PeriodFormatterBuilder.java:142)
	at org.joda.time.format.PeriodFormat.buildNonRegExFormatter(PeriodFormat.java:313)
	at org.joda.time.format.PeriodFormat.buildWordBased(PeriodFormat.java:221)
	at org.joda.time.format.PeriodFormat.wordBased(PeriodFormat.java:205)
	at org.joda.time.format.TestPeriodFormat.test_wordBased_en_from_de(TestPeriodFormat.java:592)

test_wordBased_en_from_nl(org.joda.time.format.TestPeriodFormat)  Time elapsed: 0.001 sec  <<< ERROR!
java.lang.IllegalStateException: No field to apply suffix to
	at org.joda.time.format.PeriodFormatterBuilder.appendSuffix(PeriodFormatterBuilder.java:151)
	at org.joda.time.format.PeriodFormatterBuilder.appendSuffix(PeriodFormatterBuilder.java:142)
	at org.joda.time.format.PeriodFormat.buildNonRegExFormatter(PeriodFormat.java:313)
	at org.joda.time.format.PeriodFormat.buildWordBased(PeriodFormat.java:221)
	at org.joda.time.format.PeriodFormat.wordBased(PeriodFormat.java:205)
	at org.joda.time.format.TestPeriodFormat.test_wordBased_en_from_nl(TestPeriodFormat.java:598)

test_wordBased_en_from_pl(org.joda.time.format.TestPeriodFormat)  Time elapsed: 0.001 sec  <<< ERROR!
java.lang.IllegalStateException: No field to apply suffix to
	at org.joda.time.format.PeriodFormatterBuilder.appendSuffix(PeriodFormatterBuilder.java:151)
	at org.joda.time.format.PeriodFormatterBuilder.appendSuffix(PeriodFormatterBuilder.java:142)
	at org.joda.time.format.PeriodFormat.buildNonRegExFormatter(PeriodFormat.java:313)
	at org.joda.time.format.PeriodFormat.buildWordBased(PeriodFormat.java:221)
	at org.joda.time.format.PeriodFormat.wordBased(PeriodFormat.java:205)
	at org.joda.time.format.TestPeriodFormat.test_wordBased_en_from_pl(TestPeriodFormat.java:604)

test_wordBased_pl_from_fr(org.joda.time.format.TestPeriodFormat)  Time elapsed: 0.003 sec  <<< ERROR!
java.lang.IllegalStateException: No field to apply suffix to
	at org.joda.time.format.PeriodFormatterBuilder.appendSuffix(PeriodFormatterBuilder.java:151)
	at org.joda.time.format.PeriodFormatterBuilder.appendSuffix(PeriodFormatterBuilder.java:144)
	at org.joda.time.format.PeriodFormat.buildRegExFormatter(PeriodFormat.java:232)
	at org.joda.time.format.PeriodFormat.buildWordBased(PeriodFormat.java:219)
	at org.joda.time.format.PeriodFormat.wordBased(PeriodFormat.java:205)
	at org.joda.time.format.TestPeriodFormat.test_wordBased_pl_from_fr(TestPeriodFormat.java:610)

test_getDefault_localeValue(org.joda.time.format.TestPeriodFormat)  Time elapsed: 0 sec  <<< ERROR!
java.lang.IllegalStateException: No field to apply suffix to
	at org.joda.time.format.PeriodFormatterBuilder.appendSuffix(PeriodFormatterBuilder.java:151)
	at org.joda.time.format.PeriodFormatterBuilder.appendSuffix(PeriodFormatterBuilder.java:142)
	at org.joda.time.format.PeriodFormat.buildNonRegExFormatter(PeriodFormat.java:313)
	at org.joda.time.format.PeriodFormat.buildWordBased(PeriodFormat.java:221)
	at org.joda.time.format.PeriodFormat.wordBased(PeriodFormat.java:205)
	at org.joda.time.format.PeriodFormat.getDefault(PeriodFormat.java:73)
	at org.joda.time.format.TestPeriodFormat.test_getDefault_localeValue(TestPeriodFormat.java:615)

test_wordBased_localeValue(org.joda.time.format.TestPeriodFormat)  Time elapsed: 0 sec  <<< ERROR!
java.lang.IllegalStateException: No field to apply suffix to
	at org.joda.time.format.PeriodFormatterBuilder.appendSuffix(PeriodFormatterBuilder.java:151)
	at org.joda.time.format.PeriodFormatterBuilder.appendSuffix(PeriodFormatterBuilder.java:142)
	at org.joda.time.format.PeriodFormat.buildNonRegExFormatter(PeriodFormat.java:313)
	at org.joda.time.format.PeriodFormat.buildWordBased(PeriodFormat.java:221)
	at org.joda.time.format.PeriodFormat.wordBased(PeriodFormat.java:205)
	at org.joda.time.format.PeriodFormat.wordBased(PeriodFormat.java:85)
	at org.joda.time.format.TestPeriodFormat.test_wordBased_localeValue(TestPeriodFormat.java:620)

test_wordBasedWithLocale_localeValue(org.joda.time.format.TestPeriodFormat)  Time elapsed: 0.001 sec  <<< ERROR!
java.lang.IllegalStateException: No field to apply suffix to
	at org.joda.time.format.PeriodFormatterBuilder.appendSuffix(PeriodFormatterBuilder.java:151)
	at org.joda.time.format.PeriodFormatterBuilder.appendSuffix(PeriodFormatterBuilder.java:142)
	at org.joda.time.format.PeriodFormat.buildNonRegExFormatter(PeriodFormat.java:313)
	at org.joda.time.format.PeriodFormat.buildWordBased(PeriodFormat.java:221)
	at org.joda.time.format.PeriodFormat.wordBased(PeriodFormat.java:205)
	at org.joda.time.format.TestPeriodFormat.test_wordBasedWithLocale_localeValue(TestPeriodFormat.java:625)

test_wordBased_en_withLocale_pt(org.joda.time.format.TestPeriodFormat)  Time elapsed: 0 sec  <<< ERROR!
java.lang.IllegalStateException: No field to apply suffix to
	at org.joda.time.format.PeriodFormatterBuilder.appendSuffix(PeriodFormatterBuilder.java:151)
	at org.joda.time.format.PeriodFormatterBuilder.appendSuffix(PeriodFormatterBuilder.java:142)
	at org.joda.time.format.PeriodFormat.buildNonRegExFormatter(PeriodFormat.java:313)
	at org.joda.time.format.PeriodFormat.buildWordBased(PeriodFormat.java:221)
	at org.joda.time.format.PeriodFormat.wordBased(PeriodFormat.java:205)
	at org.joda.time.format.TestPeriodFormat.test_wordBased_en_withLocale_pt(TestPeriodFormat.java:632)

test_getDefault_formatStandard(org.joda.time.format.TestPeriodFormat)  Time elapsed: 0.001 sec  <<< ERROR!
java.lang.IllegalStateException: No field to apply suffix to
	at org.joda.time.format.PeriodFormatterBuilder.appendSuffix(PeriodFormatterBuilder.java:151)
	at org.joda.time.format.PeriodFormatterBuilder.appendSuffix(PeriodFormatterBuilder.java:142)
	at org.joda.time.format.PeriodFormat.buildNonRegExFormatter(PeriodFormat.java:313)
	at org.joda.time.format.PeriodFormat.buildWordBased(PeriodFormat.java:221)
	at org.joda.time.format.PeriodFormat.wordBased(PeriodFormat.java:205)
	at org.joda.time.format.PeriodFormat.getDefault(PeriodFormat.java:73)
	at org.joda.time.format.TestPeriodFormat.test_getDefault_formatStandard(TestPeriodFormat.java:79)

test_getDefault_FormatOneField(org.joda.time.format.TestPeriodFormat)  Time elapsed: 0 sec  <<< ERROR!
java.lang.IllegalStateException: No field to apply suffix to
	at org.joda.time.format.PeriodFormatterBuilder.appendSuffix(PeriodFormatterBuilder.java:151)
	at org.joda.time.format.PeriodFormatterBuilder.appendSuffix(PeriodFormatterBuilder.java:142)
	at org.joda.time.format.PeriodFormat.buildNonRegExFormatter(PeriodFormat.java:313)
	at org.joda.time.format.PeriodFormat.buildWordBased(PeriodFormat.java:221)
	at org.joda.time.format.PeriodFormat.wordBased(PeriodFormat.java:205)
	at org.joda.time.format.PeriodFormat.getDefault(PeriodFormat.java:73)
	at org.joda.time.format.TestPeriodFormat.test_getDefault_FormatOneField(TestPeriodFormat.java:85)

test_getDefault_formatTwoFields(org.joda.time.format.TestPeriodFormat)  Time elapsed: 0 sec  <<< ERROR!
java.lang.IllegalStateException: No field to apply suffix to
	at org.joda.time.format.PeriodFormatterBuilder.appendSuffix(PeriodFormatterBuilder.java:151)
	at org.joda.time.format.PeriodFormatterBuilder.appendSuffix(PeriodFormatterBuilder.java:142)
	at org.joda.time.format.PeriodFormat.buildNonRegExFormatter(PeriodFormat.java:313)
	at org.joda.time.format.PeriodFormat.buildWordBased(PeriodFormat.java:221)
	at org.joda.time.format.PeriodFormat.wordBased(PeriodFormat.java:205)
	at org.joda.time.format.PeriodFormat.getDefault(PeriodFormat.java:73)
	at org.joda.time.format.TestPeriodFormat.test_getDefault_formatTwoFields(TestPeriodFormat.java:91)

test_getDefault_parseOneField(org.joda.time.format.TestPeriodFormat)  Time elapsed: 0.001 sec  <<< ERROR!
java.lang.IllegalStateException: No field to apply suffix to
	at org.joda.time.format.PeriodFormatterBuilder.appendSuffix(PeriodFormatterBuilder.java:151)
	at org.joda.time.format.PeriodFormatterBuilder.appendSuffix(PeriodFormatterBuilder.java:142)
	at org.joda.time.format.PeriodFormat.buildNonRegExFormatter(PeriodFormat.java:313)
	at org.joda.time.format.PeriodFormat.buildWordBased(PeriodFormat.java:221)
	at org.joda.time.format.PeriodFormat.wordBased(PeriodFormat.java:205)
	at org.joda.time.format.PeriodFormat.getDefault(PeriodFormat.java:73)
	at org.joda.time.format.TestPeriodFormat.test_getDefault_parseOneField(TestPeriodFormat.java:97)

test_getDefault_parseTwoFields(org.joda.time.format.TestPeriodFormat)  Time elapsed: 0 sec  <<< ERROR!
java.lang.IllegalStateException: No field to apply suffix to
	at org.joda.time.format.PeriodFormatterBuilder.appendSuffix(PeriodFormatterBuilder.java:151)
	at org.joda.time.format.PeriodFormatterBuilder.appendSuffix(PeriodFormatterBuilder.java:142)
	at org.joda.time.format.PeriodFormat.buildNonRegExFormatter(PeriodFormat.java:313)
	at org.joda.time.format.PeriodFormat.buildWordBased(PeriodFormat.java:221)
	at org.joda.time.format.PeriodFormat.wordBased(PeriodFormat.java:205)
	at org.joda.time.format.PeriodFormat.getDefault(PeriodFormat.java:73)
	at org.joda.time.format.TestPeriodFormat.test_getDefault_parseTwoFields(TestPeriodFormat.java:103)

test_getDefault_checkRedundantSeparator(org.joda.time.format.TestPeriodFormat)  Time elapsed: 0.001 sec  <<< FAILURE!
junit.framework.AssertionFailedError: expected:<class java.lang.IllegalArgumentException> but was:<class java.lang.IllegalStateException>
	at junit.framework.Assert.fail(Assert.java:47)
	at junit.framework.Assert.failNotEquals(Assert.java:280)
	at junit.framework.Assert.assertEquals(Assert.java:64)
	at junit.framework.Assert.assertEquals(Assert.java:71)
	at org.joda.time.format.TestPeriodFormat.test_getDefault_checkRedundantSeparator(TestPeriodFormat.java:112)

test_getDefault_cached(org.joda.time.format.TestPeriodFormat)  Time elapsed: 0 sec  <<< ERROR!
java.lang.IllegalStateException: No field to apply suffix to
	at org.joda.time.format.PeriodFormatterBuilder.appendSuffix(PeriodFormatterBuilder.java:151)
	at org.joda.time.format.PeriodFormatterBuilder.appendSuffix(PeriodFormatterBuilder.java:142)
	at org.joda.time.format.PeriodFormat.buildNonRegExFormatter(PeriodFormat.java:313)
	at org.joda.time.format.PeriodFormat.buildWordBased(PeriodFormat.java:221)
	at org.joda.time.format.PeriodFormat.wordBased(PeriodFormat.java:205)
	at org.joda.time.format.PeriodFormat.getDefault(PeriodFormat.java:73)
	at org.joda.time.format.TestPeriodFormat.test_getDefault_cached(TestPeriodFormat.java:118)

test_wordBased_default(org.joda.time.format.TestPeriodFormat)  Time elapsed: 0.001 sec  <<< ERROR!
java.lang.IllegalStateException: No field to apply suffix to
	at org.joda.time.format.PeriodFormatterBuilder.appendSuffix(PeriodFormatterBuilder.java:151)
	at org.joda.time.format.PeriodFormatterBuilder.appendSuffix(PeriodFormatterBuilder.java:142)
	at org.joda.time.format.PeriodFormat.buildNonRegExFormatter(PeriodFormat.java:313)
	at org.joda.time.format.PeriodFormat.buildWordBased(PeriodFormat.java:221)
	at org.joda.time.format.PeriodFormat.wordBased(PeriodFormat.java:205)
	at org.joda.time.format.PeriodFormat.wordBased(PeriodFormat.java:85)
	at org.joda.time.format.TestPeriodFormat.test_wordBased_default(TestPeriodFormat.java:126)

test_wordBased_fr_formatStandard(org.joda.time.format.TestPeriodFormat)  Time elapsed: 0 sec  <<< ERROR!
java.lang.IllegalStateException: No field to apply suffix to
	at org.joda.time.format.PeriodFormatterBuilder.appendSuffix(PeriodFormatterBuilder.java:151)
	at org.joda.time.format.PeriodFormatterBuilder.appendSuffix(PeriodFormatterBuilder.java:142)
	at org.joda.time.format.PeriodFormat.buildNonRegExFormatter(PeriodFormat.java:313)
	at org.joda.time.format.PeriodFormat.buildWordBased(PeriodFormat.java:221)
	at org.joda.time.format.PeriodFormat.wordBased(PeriodFormat.java:205)
	at org.joda.time.format.TestPeriodFormat.test_wordBased_fr_formatStandard(TestPeriodFormat.java:134)

test_wordBased_fr_FormatOneField(org.joda.time.format.TestPeriodFormat)  Time elapsed: 0.001 sec  <<< ERROR!
java.lang.IllegalStateException: No field to apply suffix to
	at org.joda.time.format.PeriodFormatterBuilder.appendSuffix(PeriodFormatterBuilder.java:151)
	at org.joda.time.format.PeriodFormatterBuilder.appendSuffix(PeriodFormatterBuilder.java:142)
	at org.joda.time.format.PeriodFormat.buildNonRegExFormatter(PeriodFormat.java:313)
	at org.joda.time.format.PeriodFormat.buildWordBased(PeriodFormat.java:221)
	at org.joda.time.format.PeriodFormat.wordBased(PeriodFormat.java:205)
	at org.joda.time.format.TestPeriodFormat.test_wordBased_fr_FormatOneField(TestPeriodFormat.java:140)

test_wordBased_fr_formatTwoFields(org.joda.time.format.TestPeriodFormat)  Time elapsed: 0 sec  <<< ERROR!
java.lang.IllegalStateException: No field to apply suffix to
	at org.joda.time.format.PeriodFormatterBuilder.appendSuffix(PeriodFormatterBuilder.java:151)
	at org.joda.time.format.PeriodFormatterBuilder.appendSuffix(PeriodFormatterBuilder.java:142)
	at org.joda.time.format.PeriodFormat.buildNonRegExFormatter(PeriodFormat.java:313)
	at org.joda.time.format.PeriodFormat.buildWordBased(PeriodFormat.java:221)
	at org.joda.time.format.PeriodFormat.wordBased(PeriodFormat.java:205)
	at org.joda.time.format.TestPeriodFormat.test_wordBased_fr_formatTwoFields(TestPeriodFormat.java:146)

test_wordBased_fr_parseOneField(org.joda.time.format.TestPeriodFormat)  Time elapsed: 0.001 sec  <<< ERROR!
java.lang.IllegalStateException: No field to apply suffix to
	at org.joda.time.format.PeriodFormatterBuilder.appendSuffix(PeriodFormatterBuilder.java:151)
	at org.joda.time.format.PeriodFormatterBuilder.appendSuffix(PeriodFormatterBuilder.java:142)
	at org.joda.time.format.PeriodFormat.buildNonRegExFormatter(PeriodFormat.java:313)
	at org.joda.time.format.PeriodFormat.buildWordBased(PeriodFormat.java:221)
	at org.joda.time.format.PeriodFormat.wordBased(PeriodFormat.java:205)
	at org.joda.time.format.TestPeriodFormat.test_wordBased_fr_parseOneField(TestPeriodFormat.java:152)

test_wordBased_fr_parseTwoFields(org.joda.time.format.TestPeriodFormat)  Time elapsed: 0 sec  <<< ERROR!
java.lang.IllegalStateException: No field to apply suffix to
	at org.joda.time.format.PeriodFormatterBuilder.appendSuffix(PeriodFormatterBuilder.java:151)
	at org.joda.time.format.PeriodFormatterBuilder.appendSuffix(PeriodFormatterBuilder.java:142)
	at org.joda.time.format.PeriodFormat.buildNonRegExFormatter(PeriodFormat.java:313)
	at org.joda.time.format.PeriodFormat.buildWordBased(PeriodFormat.java:221)
	at org.joda.time.format.PeriodFormat.wordBased(PeriodFormat.java:205)
	at org.joda.time.format.TestPeriodFormat.test_wordBased_fr_parseTwoFields(TestPeriodFormat.java:158)

test_wordBased_fr_cached(org.joda.time.format.TestPeriodFormat)  Time elapsed: 0.001 sec  <<< ERROR!
java.lang.IllegalStateException: No field to apply suffix to
	at org.joda.time.format.PeriodFormatterBuilder.appendSuffix(PeriodFormatterBuilder.java:151)
	at org.joda.time.format.PeriodFormatterBuilder.appendSuffix(PeriodFormatterBuilder.java:142)
	at org.joda.time.format.PeriodFormat.buildNonRegExFormatter(PeriodFormat.java:313)
	at org.joda.time.format.PeriodFormat.buildWordBased(PeriodFormat.java:221)
	at org.joda.time.format.PeriodFormat.wordBased(PeriodFormat.java:205)
	at org.joda.time.format.TestPeriodFormat.test_wordBased_fr_cached(TestPeriodFormat.java:163)

test_wordBased_pt_formatStandard(org.joda.time.format.TestPeriodFormat)  Time elapsed: 0.001 sec  <<< ERROR!
java.lang.IllegalStateException: No field to apply suffix to
	at org.joda.time.format.PeriodFormatterBuilder.appendSuffix(PeriodFormatterBuilder.java:151)
	at org.joda.time.format.PeriodFormatterBuilder.appendSuffix(PeriodFormatterBuilder.java:142)
	at org.joda.time.format.PeriodFormat.buildNonRegExFormatter(PeriodFormat.java:313)
	at org.joda.time.format.PeriodFormat.buildWordBased(PeriodFormat.java:221)
	at org.joda.time.format.PeriodFormat.wordBased(PeriodFormat.java:205)
	at org.joda.time.format.TestPeriodFormat.test_wordBased_pt_formatStandard(TestPeriodFormat.java:171)

test_wordBased_pt_FormatOneField(org.joda.time.format.TestPeriodFormat)  Time elapsed: 0.001 sec  <<< ERROR!
java.lang.IllegalStateException: No field to apply suffix to
	at org.joda.time.format.PeriodFormatterBuilder.appendSuffix(PeriodFormatterBuilder.java:151)
	at org.joda.time.format.PeriodFormatterBuilder.appendSuffix(PeriodFormatterBuilder.java:142)
	at org.joda.time.format.PeriodFormat.buildNonRegExFormatter(PeriodFormat.java:313)
	at org.joda.time.format.PeriodFormat.buildWordBased(PeriodFormat.java:221)
	at org.joda.time.format.PeriodFormat.wordBased(PeriodFormat.java:205)
	at org.joda.time.format.TestPeriodFormat.test_wordBased_pt_FormatOneField(TestPeriodFormat.java:177)

test_wordBased_pt_formatTwoFields(org.joda.time.format.TestPeriodFormat)  Time elapsed: 0.001 sec  <<< ERROR!
java.lang.IllegalStateException: No field to apply suffix to
	at org.joda.time.format.PeriodFormatterBuilder.appendSuffix(PeriodFormatterBuilder.java:151)
	at org.joda.time.format.PeriodFormatterBuilder.appendSuffix(PeriodFormatterBuilder.java:142)
	at org.joda.time.format.PeriodFormat.buildNonRegExFormatter(PeriodFormat.java:313)
	at org.joda.time.format.PeriodFormat.buildWordBased(PeriodFormat.java:221)
	at org.joda.time.format.PeriodFormat.wordBased(PeriodFormat.java:205)
	at org.joda.time.format.TestPeriodFormat.test_wordBased_pt_formatTwoFields(TestPeriodFormat.java:183)

test_wordBased_pt_parseOneField(org.joda.time.format.TestPeriodFormat)  Time elapsed: 0 sec  <<< ERROR!
java.lang.IllegalStateException: No field to apply suffix to
	at org.joda.time.format.PeriodFormatterBuilder.appendSuffix(PeriodFormatterBuilder.java:151)
	at org.joda.time.format.PeriodFormatterBuilder.appendSuffix(PeriodFormatterBuilder.java:142)
	at org.joda.time.format.PeriodFormat.buildNonRegExFormatter(PeriodFormat.java:313)
	at org.joda.time.format.PeriodFormat.buildWordBased(PeriodFormat.java:221)
	at org.joda.time.format.PeriodFormat.wordBased(PeriodFormat.java:205)
	at org.joda.time.format.TestPeriodFormat.test_wordBased_pt_parseOneField(TestPeriodFormat.java:189)

test_wordBased_pt_parseTwoFields(org.joda.time.format.TestPeriodFormat)  Time elapsed: 0 sec  <<< ERROR!
java.lang.IllegalStateException: No field to apply suffix to
	at org.joda.time.format.PeriodFormatterBuilder.appendSuffix(PeriodFormatterBuilder.java:151)
	at org.joda.time.format.PeriodFormatterBuilder.appendSuffix(PeriodFormatterBuilder.java:142)
	at org.joda.time.format.PeriodFormat.buildNonRegExFormatter(PeriodFormat.java:313)
	at org.joda.time.format.PeriodFormat.buildWordBased(PeriodFormat.java:221)
	at org.joda.time.format.PeriodFormat.wordBased(PeriodFormat.java:205)
	at org.joda.time.format.TestPeriodFormat.test_wordBased_pt_parseTwoFields(TestPeriodFormat.java:195)

test_wordBased_pt_cached(org.joda.time.format.TestPeriodFormat)  Time elapsed: 0.001 sec  <<< ERROR!
java.lang.IllegalStateException: No field to apply suffix to
	at org.joda.time.format.PeriodFormatterBuilder.appendSuffix(PeriodFormatterBuilder.java:151)
	at org.joda.time.format.PeriodFormatterBuilder.appendSuffix(PeriodFormatterBuilder.java:142)
	at org.joda.time.format.PeriodFormat.buildNonRegExFormatter(PeriodFormat.java:313)
	at org.joda.time.format.PeriodFormat.buildWordBased(PeriodFormat.java:221)
	at org.joda.time.format.PeriodFormat.wordBased(PeriodFormat.java:205)
	at org.joda.time.format.TestPeriodFormat.test_wordBased_pt_cached(TestPeriodFormat.java:200)

test_wordBased_es_formatStandard(org.joda.time.format.TestPeriodFormat)  Time elapsed: 0.001 sec  <<< ERROR!
java.lang.IllegalStateException: No field to apply suffix to
	at org.joda.time.format.PeriodFormatterBuilder.appendSuffix(PeriodFormatterBuilder.java:151)
	at org.joda.time.format.PeriodFormatterBuilder.appendSuffix(PeriodFormatterBuilder.java:142)
	at org.joda.time.format.PeriodFormat.buildNonRegExFormatter(PeriodFormat.java:313)
	at org.joda.time.format.PeriodFormat.buildWordBased(PeriodFormat.java:221)
	at org.joda.time.format.PeriodFormat.wordBased(PeriodFormat.java:205)
	at org.joda.time.format.TestPeriodFormat.test_wordBased_es_formatStandard(TestPeriodFormat.java:208)

test_wordBased_es_FormatOneField(org.joda.time.format.TestPeriodFormat)  Time elapsed: 0.001 sec  <<< ERROR!
java.lang.IllegalStateException: No field to apply suffix to
	at org.joda.time.format.PeriodFormatterBuilder.appendSuffix(PeriodFormatterBuilder.java:151)
	at org.joda.time.format.PeriodFormatterBuilder.appendSuffix(PeriodFormatterBuilder.java:142)
	at org.joda.time.format.PeriodFormat.buildNonRegExFormatter(PeriodFormat.java:313)
	at org.joda.time.format.PeriodFormat.buildWordBased(PeriodFormat.java:221)
	at org.joda.time.format.PeriodFormat.wordBased(PeriodFormat.java:205)
	at org.joda.time.format.TestPeriodFormat.test_wordBased_es_FormatOneField(TestPeriodFormat.java:214)

test_wordBased_es_formatTwoFields(org.joda.time.format.TestPeriodFormat)  Time elapsed: 0 sec  <<< ERROR!
java.lang.IllegalStateException: No field to apply suffix to
	at org.joda.time.format.PeriodFormatterBuilder.appendSuffix(PeriodFormatterBuilder.java:151)
	at org.joda.time.format.PeriodFormatterBuilder.appendSuffix(PeriodFormatterBuilder.java:142)
	at org.joda.time.format.PeriodFormat.buildNonRegExFormatter(PeriodFormat.java:313)
	at org.joda.time.format.PeriodFormat.buildWordBased(PeriodFormat.java:221)
	at org.joda.time.format.PeriodFormat.wordBased(PeriodFormat.java:205)
	at org.joda.time.format.TestPeriodFormat.test_wordBased_es_formatTwoFields(TestPeriodFormat.java:220)

test_wordBased_es_parseOneField(org.joda.time.format.TestPeriodFormat)  Time elapsed: 0.001 sec  <<< ERROR!
java.lang.IllegalStateException: No field to apply suffix to
	at org.joda.time.format.PeriodFormatterBuilder.appendSuffix(PeriodFormatterBuilder.java:151)
	at org.joda.time.format.PeriodFormatterBuilder.appendSuffix(PeriodFormatterBuilder.java:142)
	at org.joda.time.format.PeriodFormat.buildNonRegExFormatter(PeriodFormat.java:313)
	at org.joda.time.format.PeriodFormat.buildWordBased(PeriodFormat.java:221)
	at org.joda.time.format.PeriodFormat.wordBased(PeriodFormat.java:205)
	at org.joda.time.format.TestPeriodFormat.test_wordBased_es_parseOneField(TestPeriodFormat.java:226)

test_wordBased_es_parseTwoFields(org.joda.time.format.TestPeriodFormat)  Time elapsed: 0 sec  <<< ERROR!
java.lang.IllegalStateException: No field to apply suffix to
	at org.joda.time.format.PeriodFormatterBuilder.appendSuffix(PeriodFormatterBuilder.java:151)
	at org.joda.time.format.PeriodFormatterBuilder.appendSuffix(PeriodFormatterBuilder.java:142)
	at org.joda.time.format.PeriodFormat.buildNonRegExFormatter(PeriodFormat.java:313)
	at org.joda.time.format.PeriodFormat.buildWordBased(PeriodFormat.java:221)
	at org.joda.time.format.PeriodFormat.wordBased(PeriodFormat.java:205)
	at org.joda.time.format.TestPeriodFormat.test_wordBased_es_parseTwoFields(TestPeriodFormat.java:232)

test_wordBased_es_cached(org.joda.time.format.TestPeriodFormat)  Time elapsed: 0.001 sec  <<< ERROR!
java.lang.IllegalStateException: No field to apply suffix to
	at org.joda.time.format.PeriodFormatterBuilder.appendSuffix(PeriodFormatterBuilder.java:151)
	at org.joda.time.format.PeriodFormatterBuilder.appendSuffix(PeriodFormatterBuilder.java:142)
	at org.joda.time.format.PeriodFormat.buildNonRegExFormatter(PeriodFormat.java:313)
	at org.joda.time.format.PeriodFormat.buildWordBased(PeriodFormat.java:221)
	at org.joda.time.format.PeriodFormat.wordBased(PeriodFormat.java:205)
	at org.joda.time.format.TestPeriodFormat.test_wordBased_es_cached(TestPeriodFormat.java:237)

test_wordBased_de_formatStandard(org.joda.time.format.TestPeriodFormat)  Time elapsed: 0 sec  <<< ERROR!
java.lang.IllegalStateException: No field to apply suffix to
	at org.joda.time.format.PeriodFormatterBuilder.appendSuffix(PeriodFormatterBuilder.java:151)
	at org.joda.time.format.PeriodFormatterBuilder.appendSuffix(PeriodFormatterBuilder.java:142)
	at org.joda.time.format.PeriodFormat.buildNonRegExFormatter(PeriodFormat.java:313)
	at org.joda.time.format.PeriodFormat.buildWordBased(PeriodFormat.java:221)
	at org.joda.time.format.PeriodFormat.wordBased(PeriodFormat.java:205)
	at org.joda.time.format.TestPeriodFormat.test_wordBased_de_formatStandard(TestPeriodFormat.java:245)

test_wordBased_de_FormatOneField(org.joda.time.format.TestPeriodFormat)  Time elapsed: 0.001 sec  <<< ERROR!
java.lang.IllegalStateException: No field to apply suffix to
	at org.joda.time.format.PeriodFormatterBuilder.appendSuffix(PeriodFormatterBuilder.java:151)
	at org.joda.time.format.PeriodFormatterBuilder.appendSuffix(PeriodFormatterBuilder.java:142)
	at org.joda.time.format.PeriodFormat.buildNonRegExFormatter(PeriodFormat.java:313)
	at org.joda.time.format.PeriodFormat.buildWordBased(PeriodFormat.java:221)
	at org.joda.time.format.PeriodFormat.wordBased(PeriodFormat.java:205)
	at org.joda.time.format.TestPeriodFormat.test_wordBased_de_FormatOneField(TestPeriodFormat.java:251)

test_wordBased_de_formatTwoFields(org.joda.time.format.TestPeriodFormat)  Time elapsed: 0 sec  <<< ERROR!
java.lang.IllegalStateException: No field to apply suffix to
	at org.joda.time.format.PeriodFormatterBuilder.appendSuffix(PeriodFormatterBuilder.java:151)
	at org.joda.time.format.PeriodFormatterBuilder.appendSuffix(PeriodFormatterBuilder.java:142)
	at org.joda.time.format.PeriodFormat.buildNonRegExFormatter(PeriodFormat.java:313)
	at org.joda.time.format.PeriodFormat.buildWordBased(PeriodFormat.java:221)
	at org.joda.time.format.PeriodFormat.wordBased(PeriodFormat.java:205)
	at org.joda.time.format.TestPeriodFormat.test_wordBased_de_formatTwoFields(TestPeriodFormat.java:257)

test_wordBased_de_parseOneField(org.joda.time.format.TestPeriodFormat)  Time elapsed: 0.001 sec  <<< ERROR!
java.lang.IllegalStateException: No field to apply suffix to
	at org.joda.time.format.PeriodFormatterBuilder.appendSuffix(PeriodFormatterBuilder.java:151)
	at org.joda.time.format.PeriodFormatterBuilder.appendSuffix(PeriodFormatterBuilder.java:142)
	at org.joda.time.format.PeriodFormat.buildNonRegExFormatter(PeriodFormat.java:313)
	at org.joda.time.format.PeriodFormat.buildWordBased(PeriodFormat.java:221)
	at org.joda.time.format.PeriodFormat.wordBased(PeriodFormat.java:205)
	at org.joda.time.format.TestPeriodFormat.test_wordBased_de_parseOneField(TestPeriodFormat.java:263)

test_wordBased_de_parseTwoFields(org.joda.time.format.TestPeriodFormat)  Time elapsed: 0 sec  <<< ERROR!
java.lang.IllegalStateException: No field to apply suffix to
	at org.joda.time.format.PeriodFormatterBuilder.appendSuffix(PeriodFormatterBuilder.java:151)
	at org.joda.time.format.PeriodFormatterBuilder.appendSuffix(PeriodFormatterBuilder.java:142)
	at org.joda.time.format.PeriodFormat.buildNonRegExFormatter(PeriodFormat.java:313)
	at org.joda.time.format.PeriodFormat.buildWordBased(PeriodFormat.java:221)
	at org.joda.time.format.PeriodFormat.wordBased(PeriodFormat.java:205)
	at org.joda.time.format.TestPeriodFormat.test_wordBased_de_parseTwoFields(TestPeriodFormat.java:269)

test_wordBased_de_cached(org.joda.time.format.TestPeriodFormat)  Time elapsed: 0.001 sec  <<< ERROR!
java.lang.IllegalStateException: No field to apply suffix to
	at org.joda.time.format.PeriodFormatterBuilder.appendSuffix(PeriodFormatterBuilder.java:151)
	at org.joda.time.format.PeriodFormatterBuilder.appendSuffix(PeriodFormatterBuilder.java:142)
	at org.joda.time.format.PeriodFormat.buildNonRegExFormatter(PeriodFormat.java:313)
	at org.joda.time.format.PeriodFormat.buildWordBased(PeriodFormat.java:221)
	at org.joda.time.format.PeriodFormat.wordBased(PeriodFormat.java:205)
	at org.joda.time.format.TestPeriodFormat.test_wordBased_de_cached(TestPeriodFormat.java:274)

test_wordBased_nl_formatStandard(org.joda.time.format.TestPeriodFormat)  Time elapsed: 0.008 sec  <<< ERROR!
java.lang.IllegalStateException: No field to apply suffix to
	at org.joda.time.format.PeriodFormatterBuilder.appendSuffix(PeriodFormatterBuilder.java:151)
	at org.joda.time.format.PeriodFormatterBuilder.appendSuffix(PeriodFormatterBuilder.java:142)
	at org.joda.time.format.PeriodFormat.buildNonRegExFormatter(PeriodFormat.java:313)
	at org.joda.time.format.PeriodFormat.buildWordBased(PeriodFormat.java:221)
	at org.joda.time.format.PeriodFormat.wordBased(PeriodFormat.java:205)
	at org.joda.time.format.TestPeriodFormat.test_wordBased_nl_formatStandard(TestPeriodFormat.java:282)

test_wordBased_nl_FormatOneField(org.joda.time.format.TestPeriodFormat)  Time elapsed: 0 sec  <<< ERROR!
java.lang.IllegalStateException: No field to apply suffix to
	at org.joda.time.format.PeriodFormatterBuilder.appendSuffix(PeriodFormatterBuilder.java:151)
	at org.joda.time.format.PeriodFormatterBuilder.appendSuffix(PeriodFormatterBuilder.java:142)
	at org.joda.time.format.PeriodFormat.buildNonRegExFormatter(PeriodFormat.java:313)
	at org.joda.time.format.PeriodFormat.buildWordBased(PeriodFormat.java:221)
	at org.joda.time.format.PeriodFormat.wordBased(PeriodFormat.java:205)
	at org.joda.time.format.TestPeriodFormat.test_wordBased_nl_FormatOneField(TestPeriodFormat.java:288)

test_wordBased_nl_formatTwoFields(org.joda.time.format.TestPeriodFormat)  Time elapsed: 0 sec  <<< ERROR!
java.lang.IllegalStateException: No field to apply suffix to
	at org.joda.time.format.PeriodFormatterBuilder.appendSuffix(PeriodFormatterBuilder.java:151)
	at org.joda.time.format.PeriodFormatterBuilder.appendSuffix(PeriodFormatterBuilder.java:142)
	at org.joda.time.format.PeriodFormat.buildNonRegExFormatter(PeriodFormat.java:313)
	at org.joda.time.format.PeriodFormat.buildWordBased(PeriodFormat.java:221)
	at org.joda.time.format.PeriodFormat.wordBased(PeriodFormat.java:205)
	at org.joda.time.format.TestPeriodFormat.test_wordBased_nl_formatTwoFields(TestPeriodFormat.java:294)

test_wordBased_nl_cached(org.joda.time.format.TestPeriodFormat)  Time elapsed: 0 sec  <<< ERROR!
java.lang.IllegalStateException: No field to apply suffix to
	at org.joda.time.format.PeriodFormatterBuilder.appendSuffix(PeriodFormatterBuilder.java:151)
	at org.joda.time.format.PeriodFormatterBuilder.appendSuffix(PeriodFormatterBuilder.java:142)
	at org.joda.time.format.PeriodFormat.buildNonRegExFormatter(PeriodFormat.java:313)
	at org.joda.time.format.PeriodFormat.buildWordBased(PeriodFormat.java:221)
	at org.joda.time.format.PeriodFormat.wordBased(PeriodFormat.java:205)
	at org.joda.time.format.TestPeriodFormat.test_wordBased_nl_cached(TestPeriodFormat.java:311)

test_wordBased_nl_parseOneField(org.joda.time.format.TestPeriodFormat)  Time elapsed: 0 sec  <<< ERROR!
java.lang.IllegalStateException: No field to apply suffix to
	at org.joda.time.format.PeriodFormatterBuilder.appendSuffix(PeriodFormatterBuilder.java:151)
	at org.joda.time.format.PeriodFormatterBuilder.appendSuffix(PeriodFormatterBuilder.java:142)
	at org.joda.time.format.PeriodFormat.buildNonRegExFormatter(PeriodFormat.java:313)
	at org.joda.time.format.PeriodFormat.buildWordBased(PeriodFormat.java:221)
	at org.joda.time.format.PeriodFormat.wordBased(PeriodFormat.java:205)
	at org.joda.time.format.TestPeriodFormat.test_wordBased_nl_parseOneField(TestPeriodFormat.java:300)

test_wordBased_nl_parseTwoFields(org.joda.time.format.TestPeriodFormat)  Time elapsed: 0 sec  <<< ERROR!
java.lang.IllegalStateException: No field to apply suffix to
	at org.joda.time.format.PeriodFormatterBuilder.appendSuffix(PeriodFormatterBuilder.java:151)
	at org.joda.time.format.PeriodFormatterBuilder.appendSuffix(PeriodFormatterBuilder.java:142)
	at org.joda.time.format.PeriodFormat.buildNonRegExFormatter(PeriodFormat.java:313)
	at org.joda.time.format.PeriodFormat.buildWordBased(PeriodFormat.java:221)
	at org.joda.time.format.PeriodFormat.wordBased(PeriodFormat.java:205)
	at org.joda.time.format.TestPeriodFormat.test_wordBased_nl_parseTwoFields(TestPeriodFormat.java:306)

test_wordBased_da_formatMultiple(org.joda.time.format.TestPeriodFormat)  Time elapsed: 0 sec  <<< ERROR!
java.lang.IllegalStateException: No field to apply suffix to
	at org.joda.time.format.PeriodFormatterBuilder.appendSuffix(PeriodFormatterBuilder.java:151)
	at org.joda.time.format.PeriodFormatterBuilder.appendSuffix(PeriodFormatterBuilder.java:142)
	at org.joda.time.format.PeriodFormat.buildNonRegExFormatter(PeriodFormat.java:313)
	at org.joda.time.format.PeriodFormat.buildWordBased(PeriodFormat.java:221)
	at org.joda.time.format.PeriodFormat.wordBased(PeriodFormat.java:205)
	at org.joda.time.format.TestPeriodFormat.test_wordBased_da_formatMultiple(TestPeriodFormat.java:319)

test_wordBased_da_formatSinglular(org.joda.time.format.TestPeriodFormat)  Time elapsed: 0.001 sec  <<< ERROR!
java.lang.IllegalStateException: No field to apply suffix to
	at org.joda.time.format.PeriodFormatterBuilder.appendSuffix(PeriodFormatterBuilder.java:151)
	at org.joda.time.format.PeriodFormatterBuilder.appendSuffix(PeriodFormatterBuilder.java:142)
	at org.joda.time.format.PeriodFormat.buildNonRegExFormatter(PeriodFormat.java:313)
	at org.joda.time.format.PeriodFormat.buildWordBased(PeriodFormat.java:221)
	at org.joda.time.format.PeriodFormat.wordBased(PeriodFormat.java:205)
	at org.joda.time.format.TestPeriodFormat.test_wordBased_da_formatSinglular(TestPeriodFormat.java:325)

test_wordBased_da_cached(org.joda.time.format.TestPeriodFormat)  Time elapsed: 0.001 sec  <<< ERROR!
java.lang.IllegalStateException: No field to apply suffix to
	at org.joda.time.format.PeriodFormatterBuilder.appendSuffix(PeriodFormatterBuilder.java:151)
	at org.joda.time.format.PeriodFormatterBuilder.appendSuffix(PeriodFormatterBuilder.java:142)
	at org.joda.time.format.PeriodFormat.buildNonRegExFormatter(PeriodFormat.java:313)
	at org.joda.time.format.PeriodFormat.buildWordBased(PeriodFormat.java:221)
	at org.joda.time.format.PeriodFormat.wordBased(PeriodFormat.java:205)
	at org.joda.time.format.TestPeriodFormat.test_wordBased_da_cached(TestPeriodFormat.java:330)

test_wordBased_ja_formatMultiple(org.joda.time.format.TestPeriodFormat)  Time elapsed: 0.001 sec  <<< ERROR!
java.lang.IllegalStateException: No field to apply suffix to
	at org.joda.time.format.PeriodFormatterBuilder.appendSuffix(PeriodFormatterBuilder.java:151)
	at org.joda.time.format.PeriodFormatterBuilder.appendSuffix(PeriodFormatterBuilder.java:142)
	at org.joda.time.format.PeriodFormat.buildNonRegExFormatter(PeriodFormat.java:313)
	at org.joda.time.format.PeriodFormat.buildWordBased(PeriodFormat.java:221)
	at org.joda.time.format.PeriodFormat.wordBased(PeriodFormat.java:205)
	at org.joda.time.format.TestPeriodFormat.test_wordBased_ja_formatMultiple(TestPeriodFormat.java:338)

test_wordBased_ja_formatSingular(org.joda.time.format.TestPeriodFormat)  Time elapsed: 0 sec  <<< ERROR!
java.lang.IllegalStateException: No field to apply suffix to
	at org.joda.time.format.PeriodFormatterBuilder.appendSuffix(PeriodFormatterBuilder.java:151)
	at org.joda.time.format.PeriodFormatterBuilder.appendSuffix(PeriodFormatterBuilder.java:142)
	at org.joda.time.format.PeriodFormat.buildNonRegExFormatter(PeriodFormat.java:313)
	at org.joda.time.format.PeriodFormat.buildWordBased(PeriodFormat.java:221)
	at org.joda.time.format.PeriodFormat.wordBased(PeriodFormat.java:205)
	at org.joda.time.format.TestPeriodFormat.test_wordBased_ja_formatSingular(TestPeriodFormat.java:344)

test_wordBased_ja_cached(org.joda.time.format.TestPeriodFormat)  Time elapsed: 0.001 sec  <<< ERROR!
java.lang.IllegalStateException: No field to apply suffix to
	at org.joda.time.format.PeriodFormatterBuilder.appendSuffix(PeriodFormatterBuilder.java:151)
	at org.joda.time.format.PeriodFormatterBuilder.appendSuffix(PeriodFormatterBuilder.java:142)
	at org.joda.time.format.PeriodFormat.buildNonRegExFormatter(PeriodFormat.java:313)
	at org.joda.time.format.PeriodFormat.buildWordBased(PeriodFormat.java:221)
	at org.joda.time.format.PeriodFormat.wordBased(PeriodFormat.java:205)
	at org.joda.time.format.TestPeriodFormat.test_wordBased_ja_cached(TestPeriodFormat.java:349)

test_wordBased_ja_parseOneField(org.joda.time.format.TestPeriodFormat)  Time elapsed: 0.001 sec  <<< ERROR!
java.lang.IllegalStateException: No field to apply suffix to
	at org.joda.time.format.PeriodFormatterBuilder.appendSuffix(PeriodFormatterBuilder.java:151)
	at org.joda.time.format.PeriodFormatterBuilder.appendSuffix(PeriodFormatterBuilder.java:142)
	at org.joda.time.format.PeriodFormat.buildNonRegExFormatter(PeriodFormat.java:313)
	at org.joda.time.format.PeriodFormat.buildWordBased(PeriodFormat.java:221)
	at org.joda.time.format.PeriodFormat.wordBased(PeriodFormat.java:205)
	at org.joda.time.format.TestPeriodFormat.test_wordBased_ja_parseOneField(TestPeriodFormat.java:355)

test_wordBased_ja_parseTwoFields(org.joda.time.format.TestPeriodFormat)  Time elapsed: 0.001 sec  <<< ERROR!
java.lang.IllegalStateException: No field to apply suffix to
	at org.joda.time.format.PeriodFormatterBuilder.appendSuffix(PeriodFormatterBuilder.java:151)
	at org.joda.time.format.PeriodFormatterBuilder.appendSuffix(PeriodFormatterBuilder.java:142)
	at org.joda.time.format.PeriodFormat.buildNonRegExFormatter(PeriodFormat.java:313)
	at org.joda.time.format.PeriodFormat.buildWordBased(PeriodFormat.java:221)
	at org.joda.time.format.PeriodFormat.wordBased(PeriodFormat.java:205)
	at org.joda.time.format.TestPeriodFormat.test_wordBased_ja_parseTwoFields(TestPeriodFormat.java:361)

test_wordBased_ja_checkRedundantSeparator(org.joda.time.format.TestPeriodFormat)  Time elapsed: 0.001 sec  <<< FAILURE!
junit.framework.AssertionFailedError: expected:<class java.lang.IllegalArgumentException> but was:<class java.lang.IllegalStateException>
	at junit.framework.Assert.fail(Assert.java:47)
	at junit.framework.Assert.failNotEquals(Assert.java:280)
	at junit.framework.Assert.assertEquals(Assert.java:64)
	at junit.framework.Assert.assertEquals(Assert.java:71)
	at org.joda.time.format.TestPeriodFormat.test_wordBased_ja_checkRedundantSeparator(TestPeriodFormat.java:371)

test_wordBased_pl_formatStandard(org.joda.time.format.TestPeriodFormat)  Time elapsed: 0.001 sec  <<< ERROR!
java.lang.IllegalStateException: No field to apply suffix to
	at org.joda.time.format.PeriodFormatterBuilder.appendSuffix(PeriodFormatterBuilder.java:151)
	at org.joda.time.format.PeriodFormatterBuilder.appendSuffix(PeriodFormatterBuilder.java:144)
	at org.joda.time.format.PeriodFormat.buildRegExFormatter(PeriodFormat.java:232)
	at org.joda.time.format.PeriodFormat.buildWordBased(PeriodFormat.java:219)
	at org.joda.time.format.PeriodFormat.wordBased(PeriodFormat.java:205)
	at org.joda.time.format.TestPeriodFormat.test_wordBased_pl_formatStandard(TestPeriodFormat.java:380)

test_wordBased_pl_FormatOneField(org.joda.time.format.TestPeriodFormat)  Time elapsed: 0.001 sec  <<< ERROR!
java.lang.IllegalStateException: No field to apply suffix to
	at org.joda.time.format.PeriodFormatterBuilder.appendSuffix(PeriodFormatterBuilder.java:151)
	at org.joda.time.format.PeriodFormatterBuilder.appendSuffix(PeriodFormatterBuilder.java:144)
	at org.joda.time.format.PeriodFormat.buildRegExFormatter(PeriodFormat.java:232)
	at org.joda.time.format.PeriodFormat.buildWordBased(PeriodFormat.java:219)
	at org.joda.time.format.PeriodFormat.wordBased(PeriodFormat.java:205)
	at org.joda.time.format.TestPeriodFormat.test_wordBased_pl_FormatOneField(TestPeriodFormat.java:386)

testFormatStandard(org.joda.time.format.TestISOPeriodFormat)  Time elapsed: 0.001 sec  <<< ERROR!
java.lang.IllegalStateException: No field to apply suffix to
	at org.joda.time.format.PeriodFormatterBuilder.appendSuffix(PeriodFormatterBuilder.java:151)
	at org.joda.time.format.PeriodFormatterBuilder.appendSuffix(PeriodFormatterBuilder.java:140)
	at org.joda.time.format.ISOPeriodFormat.standard(ISOPeriodFormat.java:66)
	at org.joda.time.format.TestISOPeriodFormat.testFormatStandard(TestISOPeriodFormat.java:103)

testFormatStandard_negative(org.joda.time.format.TestISOPeriodFormat)  Time elapsed: 0.001 sec  <<< ERROR!
java.lang.IllegalStateException: No field to apply suffix to
	at org.joda.time.format.PeriodFormatterBuilder.appendSuffix(PeriodFormatterBuilder.java:151)
	at org.joda.time.format.PeriodFormatterBuilder.appendSuffix(PeriodFormatterBuilder.java:140)
	at org.joda.time.format.ISOPeriodFormat.standard(ISOPeriodFormat.java:66)
	at org.joda.time.format.TestISOPeriodFormat.testFormatStandard_negative(TestISOPeriodFormat.java:120)

testParseStandard8(org.joda.time.format.TestISOPeriodFormatParsing)  Time elapsed: 0.001 sec  <<< ERROR!
java.lang.IllegalStateException: No field to apply suffix to
	at org.joda.time.format.PeriodFormatterBuilder.appendSuffix(PeriodFormatterBuilder.java:151)
	at org.joda.time.format.PeriodFormatterBuilder.appendSuffix(PeriodFormatterBuilder.java:140)
	at org.joda.time.format.ISOPeriodFormat.standard(ISOPeriodFormat.java:66)
	at org.joda.time.format.TestISOPeriodFormatParsing.testParseStandard8(TestISOPeriodFormatParsing.java:142)

testParseStandard9(org.joda.time.format.TestISOPeriodFormatParsing)  Time elapsed: 0 sec  <<< ERROR!
java.lang.IllegalStateException: No field to apply suffix to
	at org.joda.time.format.PeriodFormatterBuilder.appendSuffix(PeriodFormatterBuilder.java:151)
	at org.joda.time.format.PeriodFormatterBuilder.appendSuffix(PeriodFormatterBuilder.java:140)
	at org.joda.time.format.ISOPeriodFormat.standard(ISOPeriodFormat.java:66)
	at org.joda.time.format.TestISOPeriodFormatParsing.testParseStandard9(TestISOPeriodFormatParsing.java:149)

testParseStandard10(org.joda.time.format.TestISOPeriodFormatParsing)  Time elapsed: 0 sec  <<< ERROR!
java.lang.IllegalStateException: No field to apply suffix to
	at org.joda.time.format.PeriodFormatterBuilder.appendSuffix(PeriodFormatterBuilder.java:151)
	at org.joda.time.format.PeriodFormatterBuilder.appendSuffix(PeriodFormatterBuilder.java:140)
	at org.joda.time.format.ISOPeriodFormat.standard(ISOPeriodFormat.java:66)
	at org.joda.time.format.TestISOPeriodFormatParsing.testParseStandard10(TestISOPeriodFormatParsing.java:156)

testParseStandard11(org.joda.time.format.TestISOPeriodFormatParsing)  Time elapsed: 0.001 sec  <<< ERROR!
java.lang.IllegalStateException: No field to apply suffix to
	at org.joda.time.format.PeriodFormatterBuilder.appendSuffix(PeriodFormatterBuilder.java:151)
	at org.joda.time.format.PeriodFormatterBuilder.appendSuffix(PeriodFormatterBuilder.java:140)
	at org.joda.time.format.ISOPeriodFormat.standard(ISOPeriodFormat.java:66)
	at org.joda.time.format.TestISOPeriodFormatParsing.testParseStandard11(TestISOPeriodFormatParsing.java:163)

testParseStandardFail1(org.joda.time.format.TestISOPeriodFormatParsing)  Time elapsed: 0.001 sec  <<< ERROR!
java.lang.IllegalStateException: No field to apply suffix to
	at org.joda.time.format.PeriodFormatterBuilder.appendSuffix(PeriodFormatterBuilder.java:151)
	at org.joda.time.format.PeriodFormatterBuilder.appendSuffix(PeriodFormatterBuilder.java:140)
	at org.joda.time.format.ISOPeriodFormat.standard(ISOPeriodFormat.java:66)
	at org.joda.time.format.TestISOPeriodFormatParsing.testParseStandardFail1(TestISOPeriodFormatParsing.java:170)

testParseStandardFail2(org.joda.time.format.TestISOPeriodFormatParsing)  Time elapsed: 0 sec  <<< ERROR!
java.lang.IllegalStateException: No field to apply suffix to
	at org.joda.time.format.PeriodFormatterBuilder.appendSuffix(PeriodFormatterBuilder.java:151)
	at org.joda.time.format.PeriodFormatterBuilder.appendSuffix(PeriodFormatterBuilder.java:140)
	at org.joda.time.format.ISOPeriodFormat.standard(ISOPeriodFormat.java:66)
	at org.joda.time.format.TestISOPeriodFormatParsing.testParseStandardFail2(TestISOPeriodFormatParsing.java:179)

testParseStandardFail3(org.joda.time.format.TestISOPeriodFormatParsing)  Time elapsed: 0 sec  <<< ERROR!
java.lang.IllegalStateException: No field to apply suffix to
	at org.joda.time.format.PeriodFormatterBuilder.appendSuffix(PeriodFormatterBuilder.java:151)
	at org.joda.time.format.PeriodFormatterBuilder.appendSuffix(PeriodFormatterBuilder.java:140)
	at org.joda.time.format.ISOPeriodFormat.standard(ISOPeriodFormat.java:66)
	at org.joda.time.format.TestISOPeriodFormatParsing.testParseStandardFail3(TestISOPeriodFormatParsing.java:188)

testParseStandardFail4(org.joda.time.format.TestISOPeriodFormatParsing)  Time elapsed: 0.001 sec  <<< ERROR!
java.lang.IllegalStateException: No field to apply suffix to
	at org.joda.time.format.PeriodFormatterBuilder.appendSuffix(PeriodFormatterBuilder.java:151)
	at org.joda.time.format.PeriodFormatterBuilder.appendSuffix(PeriodFormatterBuilder.java:140)
	at org.joda.time.format.ISOPeriodFormat.standard(ISOPeriodFormat.java:66)
	at org.joda.time.format.TestISOPeriodFormatParsing.testParseStandardFail4(TestISOPeriodFormatParsing.java:197)

testParseStandard1(org.joda.time.format.TestISOPeriodFormatParsing)  Time elapsed: 0.001 sec  <<< ERROR!
java.lang.IllegalStateException: No field to apply suffix to
	at org.joda.time.format.PeriodFormatterBuilder.appendSuffix(PeriodFormatterBuilder.java:151)
	at org.joda.time.format.PeriodFormatterBuilder.appendSuffix(PeriodFormatterBuilder.java:140)
	at org.joda.time.format.ISOPeriodFormat.standard(ISOPeriodFormat.java:66)
	at org.joda.time.format.TestISOPeriodFormatParsing.testParseStandard1(TestISOPeriodFormatParsing.java:93)

testParseStandard2(org.joda.time.format.TestISOPeriodFormatParsing)  Time elapsed: 0 sec  <<< ERROR!
java.lang.IllegalStateException: No field to apply suffix to
	at org.joda.time.format.PeriodFormatterBuilder.appendSuffix(PeriodFormatterBuilder.java:151)
	at org.joda.time.format.PeriodFormatterBuilder.appendSuffix(PeriodFormatterBuilder.java:140)
	at org.joda.time.format.ISOPeriodFormat.standard(ISOPeriodFormat.java:66)
	at org.joda.time.format.TestISOPeriodFormatParsing.testParseStandard2(TestISOPeriodFormatParsing.java:100)

testParseStandard3(org.joda.time.format.TestISOPeriodFormatParsing)  Time elapsed: 0 sec  <<< ERROR!
java.lang.IllegalStateException: No field to apply suffix to
	at org.joda.time.format.PeriodFormatterBuilder.appendSuffix(PeriodFormatterBuilder.java:151)
	at org.joda.time.format.PeriodFormatterBuilder.appendSuffix(PeriodFormatterBuilder.java:140)
	at org.joda.time.format.ISOPeriodFormat.standard(ISOPeriodFormat.java:66)
	at org.joda.time.format.TestISOPeriodFormatParsing.testParseStandard3(TestISOPeriodFormatParsing.java:107)

testParseStandard4(org.joda.time.format.TestISOPeriodFormatParsing)  Time elapsed: 0 sec  <<< ERROR!
java.lang.IllegalStateException: No field to apply suffix to
	at org.joda.time.format.PeriodFormatterBuilder.appendSuffix(PeriodFormatterBuilder.java:151)
	at org.joda.time.format.PeriodFormatterBuilder.appendSuffix(PeriodFormatterBuilder.java:140)
	at org.joda.time.format.ISOPeriodFormat.standard(ISOPeriodFormat.java:66)
	at org.joda.time.format.TestISOPeriodFormatParsing.testParseStandard4(TestISOPeriodFormatParsing.java:114)

testParseStandard5(org.joda.time.format.TestISOPeriodFormatParsing)  Time elapsed: 0.001 sec  <<< ERROR!
java.lang.IllegalStateException: No field to apply suffix to
	at org.joda.time.format.PeriodFormatterBuilder.appendSuffix(PeriodFormatterBuilder.java:151)
	at org.joda.time.format.PeriodFormatterBuilder.appendSuffix(PeriodFormatterBuilder.java:140)
	at org.joda.time.format.ISOPeriodFormat.standard(ISOPeriodFormat.java:66)
	at org.joda.time.format.TestISOPeriodFormatParsing.testParseStandard5(TestISOPeriodFormatParsing.java:121)

testParseStandard6(org.joda.time.format.TestISOPeriodFormatParsing)  Time elapsed: 0.001 sec  <<< ERROR!
java.lang.IllegalStateException: No field to apply suffix to
	at org.joda.time.format.PeriodFormatterBuilder.appendSuffix(PeriodFormatterBuilder.java:151)
	at org.joda.time.format.PeriodFormatterBuilder.appendSuffix(PeriodFormatterBuilder.java:140)
	at org.joda.time.format.ISOPeriodFormat.standard(ISOPeriodFormat.java:66)
	at org.joda.time.format.TestISOPeriodFormatParsing.testParseStandard6(TestISOPeriodFormatParsing.java:128)

testParseStandard7(org.joda.time.format.TestISOPeriodFormatParsing)  Time elapsed: 0 sec  <<< ERROR!
java.lang.IllegalStateException: No field to apply suffix to
	at org.joda.time.format.PeriodFormatterBuilder.appendSuffix(PeriodFormatterBuilder.java:151)
	at org.joda.time.format.PeriodFormatterBuilder.appendSuffix(PeriodFormatterBuilder.java:140)
	at org.joda.time.format.ISOPeriodFormat.standard(ISOPeriodFormat.java:66)
	at org.joda.time.format.TestISOPeriodFormatParsing.testParseStandard7(TestISOPeriodFormatParsing.java:135)

testParseNegativeMillis1(org.joda.time.format.TestPeriodFormatParsing)  Time elapsed: 0 sec  <<< ERROR!
java.lang.IllegalStateException: No field to apply suffix to
	at org.joda.time.format.PeriodFormatterBuilder.appendSuffix(PeriodFormatterBuilder.java:151)
	at org.joda.time.format.PeriodFormatterBuilder.appendSuffix(PeriodFormatterBuilder.java:140)
	at org.joda.time.format.ISOPeriodFormat.standard(ISOPeriodFormat.java:66)
	at org.joda.time.base.AbstractPeriod.toString(AbstractPeriod.java:228)
	at org.joda.time.format.TestPeriodFormatParsing.testParseNegativeMillis1(TestPeriodFormatParsing.java:100)

testParseNegativeMillis2(org.joda.time.format.TestPeriodFormatParsing)  Time elapsed: 0 sec  <<< ERROR!
java.lang.IllegalStateException: No field to apply suffix to
	at org.joda.time.format.PeriodFormatterBuilder.appendSuffix(PeriodFormatterBuilder.java:151)
	at org.joda.time.format.PeriodFormatterBuilder.appendSuffix(PeriodFormatterBuilder.java:140)
	at org.joda.time.format.ISOPeriodFormat.standard(ISOPeriodFormat.java:66)
	at org.joda.time.base.AbstractPeriod.toString(AbstractPeriod.java:228)
	at org.joda.time.format.TestPeriodFormatParsing.testParseNegativeMillis2(TestPeriodFormatParsing.java:108)

testParseCustom1(org.joda.time.format.TestPeriodFormatParsing)  Time elapsed: 0 sec  <<< ERROR!
java.lang.IllegalStateException: No field to apply suffix to
	at org.joda.time.format.PeriodFormatterBuilder.appendSuffix(PeriodFormatterBuilder.java:151)
	at org.joda.time.format.PeriodFormatterBuilder.appendSuffix(PeriodFormatterBuilder.java:140)
	at org.joda.time.format.TestPeriodFormatParsing.testParseCustom1(TestPeriodFormatParsing.java:115)

testParseStandard1(org.joda.time.format.TestPeriodFormatParsing)  Time elapsed: 0.001 sec  <<< ERROR!
java.lang.IllegalStateException: No field to apply suffix to
	at org.joda.time.format.PeriodFormatterBuilder.appendSuffix(PeriodFormatterBuilder.java:151)
	at org.joda.time.format.PeriodFormatterBuilder.appendSuffix(PeriodFormatterBuilder.java:142)
	at org.joda.time.format.PeriodFormat.buildNonRegExFormatter(PeriodFormat.java:313)
	at org.joda.time.format.PeriodFormat.buildWordBased(PeriodFormat.java:221)
	at org.joda.time.format.PeriodFormat.wordBased(PeriodFormat.java:205)
	at org.joda.time.format.PeriodFormat.getDefault(PeriodFormat.java:73)
	at org.joda.time.format.TestPeriodFormatParsing.testParseStandard1(TestPeriodFormatParsing.java:93)

testRegExAffixParseOrder(org.joda.time.format.TestPeriodFormatterBuilder)  Time elapsed: 0.001 sec  <<< ERROR!
java.lang.IllegalStateException: No field to apply suffix to
	at org.joda.time.format.PeriodFormatterBuilder.appendSuffix(PeriodFormatterBuilder.java:151)
	at org.joda.time.format.PeriodFormatterBuilder.appendSuffix(PeriodFormatterBuilder.java:144)
	at org.joda.time.format.TestPeriodFormatterBuilder.testRegExAffixParseOrder(TestPeriodFormatterBuilder.java:421)

testFormatSuffixSimple1(org.joda.time.format.TestPeriodFormatterBuilder)  Time elapsed: 0.001 sec  <<< ERROR!
java.lang.IllegalStateException: No field to apply suffix to
	at org.joda.time.format.PeriodFormatterBuilder.appendSuffix(PeriodFormatterBuilder.java:151)
	at org.joda.time.format.PeriodFormatterBuilder.appendSuffix(PeriodFormatterBuilder.java:140)
	at org.joda.time.format.TestPeriodFormatterBuilder.testFormatSuffixSimple1(TestPeriodFormatterBuilder.java:521)

testFormatSuffixSimple2(org.joda.time.format.TestPeriodFormatterBuilder)  Time elapsed: 0.001 sec  <<< ERROR!
java.lang.IllegalStateException: No field to apply suffix to
	at org.joda.time.format.PeriodFormatterBuilder.appendSuffix(PeriodFormatterBuilder.java:151)
	at org.joda.time.format.PeriodFormatterBuilder.appendSuffix(PeriodFormatterBuilder.java:140)
	at org.joda.time.format.TestPeriodFormatterBuilder.testFormatSuffixSimple2(TestPeriodFormatterBuilder.java:533)

testFormatPrefixSimple5IgnoringPrefix(org.joda.time.format.TestPeriodFormatterBuilder)  Time elapsed: 0 sec  <<< ERROR!
java.lang.IllegalStateException: No field to apply suffix to
	at org.joda.time.format.PeriodFormatterBuilder.appendSuffix(PeriodFormatterBuilder.java:151)
	at org.joda.time.format.PeriodFormatterBuilder.appendSuffix(PeriodFormatterBuilder.java:140)
	at org.joda.time.format.TestPeriodFormatterBuilder.testFormatPrefixSimple5IgnoringPrefix(TestPeriodFormatterBuilder.java:559)

testFormatPrefixSimple6IgnoringPrefix(org.joda.time.format.TestPeriodFormatterBuilder)  Time elapsed: 0 sec  <<< ERROR!
java.lang.IllegalStateException: No field to apply suffix to
	at org.joda.time.format.PeriodFormatterBuilder.appendSuffix(PeriodFormatterBuilder.java:151)
	at org.joda.time.format.PeriodFormatterBuilder.appendSuffix(PeriodFormatterBuilder.java:140)
	at org.joda.time.format.TestPeriodFormatterBuilder.testFormatPrefixSimple6IgnoringPrefix(TestPeriodFormatterBuilder.java:570)

testFormatSuffixPlural1(org.joda.time.format.TestPeriodFormatterBuilder)  Time elapsed: 0.001 sec  <<< ERROR!
java.lang.IllegalStateException: No field to apply suffix to
	at org.joda.time.format.PeriodFormatterBuilder.appendSuffix(PeriodFormatterBuilder.java:151)
	at org.joda.time.format.PeriodFormatterBuilder.appendSuffix(PeriodFormatterBuilder.java:142)
	at org.joda.time.format.TestPeriodFormatterBuilder.testFormatSuffixPlural1(TestPeriodFormatterBuilder.java:581)

testFormatSuffixPlural2(org.joda.time.format.TestPeriodFormatterBuilder)  Time elapsed: 0.001 sec  <<< ERROR!
java.lang.IllegalStateException: No field to apply suffix to
	at org.joda.time.format.PeriodFormatterBuilder.appendSuffix(PeriodFormatterBuilder.java:151)
	at org.joda.time.format.PeriodFormatterBuilder.appendSuffix(PeriodFormatterBuilder.java:142)
	at org.joda.time.format.TestPeriodFormatterBuilder.testFormatSuffixPlural2(TestPeriodFormatterBuilder.java:593)

testFormatSuffixPlural4IgnoringPrefix(org.joda.time.format.TestPeriodFormatterBuilder)  Time elapsed: 0 sec  <<< ERROR!
java.lang.IllegalStateException: No field to apply suffix to
	at org.joda.time.format.PeriodFormatterBuilder.appendSuffix(PeriodFormatterBuilder.java:151)
	at org.joda.time.format.PeriodFormatterBuilder.appendSuffix(PeriodFormatterBuilder.java:142)
	at org.joda.time.format.TestPeriodFormatterBuilder.testFormatSuffixPlural4IgnoringPrefix(TestPeriodFormatterBuilder.java:627)

testFormatSuffixRegEx1(org.joda.time.format.TestPeriodFormatterBuilder)  Time elapsed: 0.001 sec  <<< ERROR!
java.lang.IllegalStateException: No field to apply suffix to
	at org.joda.time.format.PeriodFormatterBuilder.appendSuffix(PeriodFormatterBuilder.java:151)
	at org.joda.time.format.PeriodFormatterBuilder.appendSuffix(PeriodFormatterBuilder.java:144)
	at org.joda.time.format.TestPeriodFormatterBuilder.testFormatSuffixRegEx1(TestPeriodFormatterBuilder.java:645)

testFormatSuffixRegEx2(org.joda.time.format.TestPeriodFormatterBuilder)  Time elapsed: 0.001 sec  <<< ERROR!
java.lang.IllegalStateException: No field to apply suffix to
	at org.joda.time.format.PeriodFormatterBuilder.appendSuffix(PeriodFormatterBuilder.java:151)
	at org.joda.time.format.PeriodFormatterBuilder.appendSuffix(PeriodFormatterBuilder.java:144)
	at org.joda.time.format.TestPeriodFormatterBuilder.testFormatSuffixRegEx2(TestPeriodFormatterBuilder.java:663)

testFormatSuffixRegEx5IgnoringAffix(org.joda.time.format.TestPeriodFormatterBuilder)  Time elapsed: 0.001 sec  <<< ERROR!
java.lang.IllegalStateException: No field to apply suffix to
	at org.joda.time.format.PeriodFormatterBuilder.appendSuffix(PeriodFormatterBuilder.java:151)
	at org.joda.time.format.PeriodFormatterBuilder.appendSuffix(PeriodFormatterBuilder.java:144)
	at org.joda.time.format.TestPeriodFormatterBuilder.testFormatSuffixRegEx5IgnoringAffix(TestPeriodFormatterBuilder.java:716)

testFormatSuffixComposite1(org.joda.time.format.TestPeriodFormatterBuilder)  Time elapsed: 0.001 sec  <<< ERROR!
java.lang.IllegalStateException: No field to apply suffix to
	at org.joda.time.format.PeriodFormatterBuilder.appendSuffix(PeriodFormatterBuilder.java:151)
	at org.joda.time.format.PeriodFormatterBuilder.appendSuffix(PeriodFormatterBuilder.java:140)
	at org.joda.time.format.TestPeriodFormatterBuilder.testFormatSuffixComposite1(TestPeriodFormatterBuilder.java:737)

testFormatSuffixComposite5IgnoringAffix(org.joda.time.format.TestPeriodFormatterBuilder)  Time elapsed: 0 sec  <<< ERROR!
java.lang.IllegalStateException: No field to apply suffix to
	at org.joda.time.format.PeriodFormatterBuilder.appendSuffix(PeriodFormatterBuilder.java:151)
	at org.joda.time.format.PeriodFormatterBuilder.appendSuffix(PeriodFormatterBuilder.java:140)
	at org.joda.time.format.TestPeriodFormatterBuilder.testFormatSuffixComposite5IgnoringAffix(TestPeriodFormatterBuilder.java:750)

testFormatPrefixSuffix(org.joda.time.format.TestPeriodFormatterBuilder)  Time elapsed: 0 sec  <<< ERROR!
java.lang.IllegalStateException: No field to apply suffix to
	at org.joda.time.format.PeriodFormatterBuilder.appendSuffix(PeriodFormatterBuilder.java:151)
	at org.joda.time.format.PeriodFormatterBuilder.appendSuffix(PeriodFormatterBuilder.java:140)
	at org.joda.time.format.TestPeriodFormatterBuilder.testFormatPrefixSuffix(TestPeriodFormatterBuilder.java:765)

testPluralAffixParseOrder(org.joda.time.format.TestPeriodFormatterBuilder)  Time elapsed: 0 sec  <<< ERROR!
java.lang.IllegalStateException: No field to apply suffix to
	at org.joda.time.format.PeriodFormatterBuilder.appendSuffix(PeriodFormatterBuilder.java:151)
	at org.joda.time.format.PeriodFormatterBuilder.appendSuffix(PeriodFormatterBuilder.java:142)
	at org.joda.time.format.TestPeriodFormatterBuilder.testPluralAffixParseOrder(TestPeriodFormatterBuilder.java:355)

testBug2495455(org.joda.time.format.TestPeriodFormatterBuilder)  Time elapsed: 0 sec  <<< ERROR!
java.lang.IllegalStateException: No field to apply suffix to
	at org.joda.time.format.PeriodFormatterBuilder.appendSuffix(PeriodFormatterBuilder.java:151)
	at org.joda.time.format.PeriodFormatterBuilder.appendSuffix(PeriodFormatterBuilder.java:140)
	at org.joda.time.format.TestPeriodFormatterBuilder.testBug2495455(TestPeriodFormatterBuilder.java:1145)

testMonthsAndMinutesAreConsideredSeparateAndCaseIsNotIgnored(org.joda.time.format.TestPeriodFormatterBuilder)  Time elapsed: 0 sec  <<< ERROR!
java.lang.IllegalStateException: No field to apply suffix to
	at org.joda.time.format.PeriodFormatterBuilder.appendSuffix(PeriodFormatterBuilder.java:151)
	at org.joda.time.format.PeriodFormatterBuilder.appendSuffix(PeriodFormatterBuilder.java:140)
	at org.joda.time.format.TestPeriodFormatterBuilder.testMonthsAndMinutesAreConsideredSeparateAndCaseIsNotIgnored(TestPeriodFormatterBuilder.java:1172)


Results :

Failed tests: 
  org.joda.time.format.TestPeriodFormat#test_getDefault_checkRedundantSeparator AssertionFailedError
  org.joda.time.format.TestPeriodFormat#test_wordBased_ja_checkRedundantSeparator AssertionFailedError
  org.joda.time.format.TestPeriodFormat#test_wordBased_pl_checkRedundantSeparator AssertionFailedError
Tests in error: 
  org.joda.time.TestBaseSingleFieldPeriod#testEqualsHashCode NoClassDefFoundError
  org.joda.time.TestBaseSingleFieldPeriod#testFactory_standardPeriodIn_RPeriod IllegalStateException
  org.joda.time.TestDateTimeZoneCutover#testPeriod IllegalStateException No fiel...
  org.joda.time.TestDays#testAddToLocalDate NoClassDefFoundError Could not initi...
  org.joda.time.TestDays#testConstants NoClassDefFoundError Could not initialize...
  org.joda.time.TestDays#testDividedBy_int NoClassDefFoundError Could not initia...
  org.joda.time.TestDays#testFactory_daysBetween_RInstant NoClassDefFoundError C...
  org.joda.time.TestDays#testFactory_daysBetween_RPartial_LocalDate NoClassDefFoundError
  org.joda.time.TestDays#testFactory_daysBetween_RPartial_MonthDay NoClassDefFoundError
  org.joda.time.TestDays#testFactory_daysBetween_RPartial_YearMonth NoClassDefFoundError
  org.joda.time.TestDays#testFactory_daysIn_RInterval NoClassDefFoundError Could...
  org.joda.time.TestDays#testFactory_days_int NoClassDefFoundError Could not ini...
  org.joda.time.TestDays#testFactory_parseDays_String NoClassDefFoundError Could...
  org.joda.time.TestDays#testFactory_standardDaysIn_RPeriod NoClassDefFoundError
  org.joda.time.TestDays#testGetFieldType NoClassDefFoundError Could not initial...
  org.joda.time.TestDays#testGetMethods NoClassDefFoundError Could not initializ...
  org.joda.time.TestDays#testGetPeriodType NoClassDefFoundError Could not initia...
  org.joda.time.TestDays#testIsGreaterThan NoClassDefFoundError Could not initia...
  org.joda.time.TestDays#testIsLessThan NoClassDefFoundError Could not initializ...
  org.joda.time.TestDays#testMinus_Days NoClassDefFoundError Could not initializ...
  org.joda.time.TestDays#testMinus_int NoClassDefFoundError Could not initialize...
  org.joda.time.TestDays#testMultipliedBy_int NoClassDefFoundError Could not ini...
  org.joda.time.TestDays#testNegated NoClassDefFoundError Could not initialize c...
  org.joda.time.TestDays#testPlus_Days NoClassDefFoundError Could not initialize...
  org.joda.time.TestDays#testPlus_int NoClassDefFoundError Could not initialize ...
  org.joda.time.TestDays#testSerialization NoClassDefFoundError Could not initia...
  org.joda.time.TestDays#testToStandardDuration NoClassDefFoundError Could not i...
  org.joda.time.TestDays#testToStandardHours NoClassDefFoundError Could not init...
  org.joda.time.TestDays#testToStandardMinutes NoClassDefFoundError Could not in...
  org.joda.time.TestDays#testToStandardSeconds NoClassDefFoundError Could not in...
  org.joda.time.TestDays#testToStandardWeeks NoClassDefFoundError Could not init...
  org.joda.time.TestDays#testToString NoClassDefFoundError Could not initialize ...
  org.joda.time.TestDuration_Basics#testToStandardDays ExceptionInInitializerError
  org.joda.time.TestDuration_Basics#testToStandardHours ExceptionInInitializerError
  org.joda.time.TestDuration_Basics#testToStandardMinutes ExceptionInInitializerError
  org.joda.time.TestDuration_Basics#testToStandardSeconds ExceptionInInitializerError
  org.joda.time.TestHours#testAddToLocalDate NoClassDefFoundError Could not init...
  org.joda.time.TestHours#testConstants NoClassDefFoundError Could not initializ...
  org.joda.time.TestHours#testDividedBy_int NoClassDefFoundError Could not initi...
  org.joda.time.TestHours#testFactory_hoursBetween_RInstant NoClassDefFoundError
  org.joda.time.TestHours#testFactory_hoursBetween_RPartial NoClassDefFoundError
  org.joda.time.TestHours#testFactory_hoursIn_RInterval NoClassDefFoundError Cou...
  org.joda.time.TestHours#testFactory_hours_int NoClassDefFoundError Could not i...
  org.joda.time.TestHours#testFactory_parseHours_String NoClassDefFoundError Cou...
  org.joda.time.TestHours#testFactory_standardHoursIn_RPeriod NoClassDefFoundError
  org.joda.time.TestHours#testGetFieldType NoClassDefFoundError Could not initia...
  org.joda.time.TestHours#testGetMethods NoClassDefFoundError Could not initiali...
  org.joda.time.TestHours#testGetPeriodType NoClassDefFoundError Could not initi...
  org.joda.time.TestHours#testIsGreaterThan NoClassDefFoundError Could not initi...
  org.joda.time.TestHours#testIsLessThan NoClassDefFoundError Could not initiali...
  org.joda.time.TestHours#testMinus_Hours NoClassDefFoundError Could not initial...
  org.joda.time.TestHours#testMinus_int NoClassDefFoundError Could not initializ...
  org.joda.time.TestHours#testMultipliedBy_int NoClassDefFoundError Could not in...
  org.joda.time.TestHours#testNegated NoClassDefFoundError Could not initialize ...
  org.joda.time.TestHours#testPlus_Hours NoClassDefFoundError Could not initiali...
  org.joda.time.TestHours#testPlus_int NoClassDefFoundError Could not initialize...
  org.joda.time.TestHours#testSerialization NoClassDefFoundError Could not initi...
  org.joda.time.TestHours#testToStandardDays NoClassDefFoundError Could not init...
  org.joda.time.TestHours#testToStandardDuration NoClassDefFoundError Could not ...
  org.joda.time.TestHours#testToStandardMinutes NoClassDefFoundError Could not i...
  org.joda.time.TestHours#testToStandardSeconds NoClassDefFoundError Could not i...
  org.joda.time.TestHours#testToStandardWeeks NoClassDefFoundError Could not ini...
  org.joda.time.TestHours#testToString NoClassDefFoundError Could not initialize...
  org.joda.time.TestInterval_Basics#testToString_reparse IllegalStateException N...
  org.joda.time.TestInterval_Constructors#testConstructor_Object1 IllegalStateException
  org.joda.time.TestInterval_Constructors#testParse_noFormatter IllegalStateException
  org.joda.time.TestMinutes#testAddToLocalDate NoClassDefFoundError Could not in...
  org.joda.time.TestMinutes#testConstants NoClassDefFoundError Could not initial...
  org.joda.time.TestMinutes#testDividedBy_int NoClassDefFoundError Could not ini...
  org.joda.time.TestMinutes#testFactory_minutesBetween_RInstant NoClassDefFoundError
  org.joda.time.TestMinutes#testFactory_minutesBetween_RPartial NoClassDefFoundError
  org.joda.time.TestMinutes#testFactory_minutesIn_RInterval NoClassDefFoundError
  org.joda.time.TestMinutes#testFactory_minutes_int NoClassDefFoundError Could n...
  org.joda.time.TestMinutes#testFactory_parseMinutes_String NoClassDefFoundError
  org.joda.time.TestMinutes#testFactory_standardMinutesIn_RPeriod NoClassDefFoundError
  org.joda.time.TestMinutes#testGetFieldType NoClassDefFoundError Could not init...
  org.joda.time.TestMinutes#testGetMethods NoClassDefFoundError Could not initia...
  org.joda.time.TestMinutes#testGetPeriodType NoClassDefFoundError Could not ini...
  org.joda.time.TestMinutes#testIsGreaterThan NoClassDefFoundError Could not ini...
  org.joda.time.TestMinutes#testIsLessThan NoClassDefFoundError Could not initia...
  org.joda.time.TestMinutes#testMinus_Minutes NoClassDefFoundError Could not ini...
  org.joda.time.TestMinutes#testMinus_int NoClassDefFoundError Could not initial...
  org.joda.time.TestMinutes#testMultipliedBy_int NoClassDefFoundError Could not ...
  org.joda.time.TestMinutes#testNegated NoClassDefFoundError Could not initializ...
  org.joda.time.TestMinutes#testPlus_Minutes NoClassDefFoundError Could not init...
  org.joda.time.TestMinutes#testPlus_int NoClassDefFoundError Could not initiali...
  org.joda.time.TestMinutes#testSerialization NoClassDefFoundError Could not ini...
  org.joda.time.TestMinutes#testToStandardDays NoClassDefFoundError Could not in...
  org.joda.time.TestMinutes#testToStandardDuration NoClassDefFoundError Could no...
  org.joda.time.TestMinutes#testToStandardHours NoClassDefFoundError Could not i...
  org.joda.time.TestMinutes#testToStandardSeconds NoClassDefFoundError Could not...
  org.joda.time.TestMinutes#testToStandardWeeks NoClassDefFoundError Could not i...
  org.joda.time.TestMinutes#testToString NoClassDefFoundError Could not initiali...
  org.joda.time.TestMonths#testAddToLocalDate NoClassDefFoundError Could not ini...
  org.joda.time.TestMonths#testConstants NoClassDefFoundError Could not initiali...
  org.joda.time.TestMonths#testDividedBy_int NoClassDefFoundError Could not init...
  org.joda.time.TestMonths#testFactory_monthsBetween_RInstant NoClassDefFoundError
  org.joda.time.TestMonths#testFactory_monthsBetween_RPartial_LocalDate NoClassDefFoundError
  org.joda.time.TestMonths#testFactory_monthsBetween_RPartial_MonthDay NoClassDefFoundError
  org.joda.time.TestMonths#testFactory_monthsBetween_RPartial_YearMonth NoClassDefFoundError
  org.joda.time.TestMonths#testFactory_monthsIn_RInterval NoClassDefFoundError C...
  org.joda.time.TestMonths#testFactory_months_int NoClassDefFoundError Could not...
  org.joda.time.TestMonths#testFactory_parseMonths_String NoClassDefFoundError C...
  org.joda.time.TestMonths#testGetFieldType NoClassDefFoundError Could not initi...
  org.joda.time.TestMonths#testGetMethods NoClassDefFoundError Could not initial...
  org.joda.time.TestMonths#testGetPeriodType NoClassDefFoundError Could not init...
  org.joda.time.TestMonths#testIsGreaterThan NoClassDefFoundError Could not init...
  org.joda.time.TestMonths#testIsLessThan NoClassDefFoundError Could not initial...
  org.joda.time.TestMonths#testMinus_Months NoClassDefFoundError Could not initi...
  org.joda.time.TestMonths#testMinus_int NoClassDefFoundError Could not initiali...
  org.joda.time.TestMonths#testMultipliedBy_int NoClassDefFoundError Could not i...
  org.joda.time.TestMonths#testNegated NoClassDefFoundError Could not initialize...
  org.joda.time.TestMonths#testPlus_Months NoClassDefFoundError Could not initia...
  org.joda.time.TestMonths#testPlus_int NoClassDefFoundError Could not initializ...
  org.joda.time.TestMonths#testSerialization NoClassDefFoundError Could not init...
  org.joda.time.TestMonths#testToString ExceptionInInitializerError
  org.joda.time.TestMutableInterval_Constructors#testConstructor_Object1 IllegalStateException
  org.joda.time.TestMutableInterval_Constructors#testParse_noFormatter IllegalStateException
  org.joda.time.TestMutablePeriod_Basics#testToString IllegalStateException No f...
  org.joda.time.TestMutablePeriod_Constructors#testConstructor_Object1 IllegalStateException
  org.joda.time.TestMutablePeriod_Constructors#testConstructor_Object_PeriodType1 IllegalStateException
  org.joda.time.TestMutablePeriod_Constructors#testParse_noFormatter IllegalStateException
  org.joda.time.TestPeriod_Basics#testMinus NoClassDefFoundError Could not initi...
  org.joda.time.TestPeriod_Basics#testNormalizedStandard_periodType_yearMonth3 IllegalStateException
  org.joda.time.TestPeriod_Basics#testNormalizedStandard_periodType_years IllegalStateException
  org.joda.time.TestPeriod_Basics#testPlus ExceptionInInitializerError
  org.joda.time.TestPeriod_Basics#testToStandardDays NoClassDefFoundError Could ...
  org.joda.time.TestPeriod_Basics#testToStandardDays_months NoClassDefFoundError
  org.joda.time.TestPeriod_Basics#testToStandardDays_years NoClassDefFoundError ...
  org.joda.time.TestPeriod_Basics#testToStandardHours NoClassDefFoundError Could...
  org.joda.time.TestPeriod_Basics#testToStandardHours_months NoClassDefFoundError
  org.joda.time.TestPeriod_Basics#testToStandardHours_years NoClassDefFoundError
  org.joda.time.TestPeriod_Basics#testToStandardMinutes NoClassDefFoundError Cou...
  org.joda.time.TestPeriod_Basics#testToStandardMinutes_months NoClassDefFoundError
  org.joda.time.TestPeriod_Basics#testToStandardMinutes_years NoClassDefFoundError
  org.joda.time.TestPeriod_Basics#testToStandardSeconds NoClassDefFoundError Cou...
  org.joda.time.TestPeriod_Basics#testToStandardSeconds_months NoClassDefFoundError
  org.joda.time.TestPeriod_Basics#testToStandardSeconds_years NoClassDefFoundError
  org.joda.time.TestPeriod_Basics#testToStandardWeeks ExceptionInInitializerError
  org.joda.time.TestPeriod_Basics#testToStandardWeeks_months NoClassDefFoundError
  org.joda.time.TestPeriod_Basics#testToStandardWeeks_years NoClassDefFoundError
  org.joda.time.TestPeriod_Basics#testToString IllegalStateException No field to...
  org.joda.time.TestPeriod_Basics#testToString_PeriodFormatter IllegalStateException
  org.joda.time.TestPeriod_Basics#testToString_nullPeriodFormatter IllegalStateException
  org.joda.time.TestPeriod_Constructors#testConstructor_Object1 IllegalStateException
  org.joda.time.TestPeriod_Constructors#testConstructor_Object_PeriodType1 IllegalStateException
  org.joda.time.TestPeriod_Constructors#testParse_noFormatter IllegalStateException
  org.joda.time.TestSeconds#testAddToLocalDate NoClassDefFoundError Could not in...
  org.joda.time.TestSeconds#testConstants NoClassDefFoundError Could not initial...
  org.joda.time.TestSeconds#testDividedBy_int NoClassDefFoundError Could not ini...
  org.joda.time.TestSeconds#testFactory_parseSeconds_String NoClassDefFoundError
  org.joda.time.TestSeconds#testFactory_secondsBetween_RInstant NoClassDefFoundError
  org.joda.time.TestSeconds#testFactory_secondsBetween_RPartial NoClassDefFoundError
  org.joda.time.TestSeconds#testFactory_secondsIn_RInterval NoClassDefFoundError
  org.joda.time.TestSeconds#testFactory_seconds_int NoClassDefFoundError Could n...
  org.joda.time.TestSeconds#testFactory_standardSecondsIn_RPeriod NoClassDefFoundError
  org.joda.time.TestSeconds#testGetFieldType NoClassDefFoundError Could not init...
  org.joda.time.TestSeconds#testGetMethods NoClassDefFoundError Could not initia...
  org.joda.time.TestSeconds#testGetPeriodType NoClassDefFoundError Could not ini...
  org.joda.time.TestSeconds#testIsGreaterThan NoClassDefFoundError Could not ini...
  org.joda.time.TestSeconds#testIsLessThan NoClassDefFoundError Could not initia...
  org.joda.time.TestSeconds#testMinus_Seconds NoClassDefFoundError Could not ini...
  org.joda.time.TestSeconds#testMinus_int NoClassDefFoundError Could not initial...
  org.joda.time.TestSeconds#testMultipliedBy_int NoClassDefFoundError Could not ...
  org.joda.time.TestSeconds#testNegated NoClassDefFoundError Could not initializ...
  org.joda.time.TestSeconds#testPlus_Seconds NoClassDefFoundError Could not init...
  org.joda.time.TestSeconds#testPlus_int NoClassDefFoundError Could not initiali...
  org.joda.time.TestSeconds#testSerialization NoClassDefFoundError Could not ini...
  org.joda.time.TestSeconds#testToStandardDays NoClassDefFoundError Could not in...
  org.joda.time.TestSeconds#testToStandardDuration NoClassDefFoundError Could no...
  org.joda.time.TestSeconds#testToStandardHours NoClassDefFoundError Could not i...
  org.joda.time.TestSeconds#testToStandardMinutes NoClassDefFoundError Could not...
  org.joda.time.TestSeconds#testToStandardWeeks NoClassDefFoundError Could not i...
  org.joda.time.TestSeconds#testToString NoClassDefFoundError Could not initiali...
  org.joda.time.TestStringConvert#testDays NoClassDefFoundError Could not initia...
  org.joda.time.TestStringConvert#testHours NoClassDefFoundError Could not initi...
  org.joda.time.TestStringConvert#testMinutes NoClassDefFoundError Could not ini...
  org.joda.time.TestStringConvert#testMonths NoClassDefFoundError Could not init...
  org.joda.time.TestStringConvert#testMutablePeriod IllegalStateException No fie...
  org.joda.time.TestStringConvert#testPeriod IllegalStateException No field to a...
  org.joda.time.TestStringConvert#testSeconds NoClassDefFoundError Could not ini...
  org.joda.time.TestStringConvert#testWeeks NoClassDefFoundError Could not initi...
  org.joda.time.TestStringConvert#testYears NoClassDefFoundError Could not initi...
  org.joda.time.TestWeeks#testAddToLocalDate NoClassDefFoundError Could not init...
  org.joda.time.TestWeeks#testConstants NoClassDefFoundError Could not initializ...
  org.joda.time.TestWeeks#testDividedBy_int NoClassDefFoundError Could not initi...
  org.joda.time.TestWeeks#testFactory_parseWeeks_String NoClassDefFoundError Cou...
  org.joda.time.TestWeeks#testFactory_standardWeeksIn_RPeriod NoClassDefFoundError
  org.joda.time.TestWeeks#testFactory_weeksBetween_RInstant NoClassDefFoundError
  org.joda.time.TestWeeks#testFactory_weeksBetween_RPartial NoClassDefFoundError
  org.joda.time.TestWeeks#testFactory_weeksIn_RInterval NoClassDefFoundError Cou...
  org.joda.time.TestWeeks#testFactory_weeks_int NoClassDefFoundError Could not i...
  org.joda.time.TestWeeks#testGetFieldType NoClassDefFoundError Could not initia...
  org.joda.time.TestWeeks#testGetMethods NoClassDefFoundError Could not initiali...
  org.joda.time.TestWeeks#testGetPeriodType NoClassDefFoundError Could not initi...
  org.joda.time.TestWeeks#testIsGreaterThan NoClassDefFoundError Could not initi...
  org.joda.time.TestWeeks#testIsLessThan NoClassDefFoundError Could not initiali...
  org.joda.time.TestWeeks#testMinus_Weeks NoClassDefFoundError Could not initial...
  org.joda.time.TestWeeks#testMinus_int NoClassDefFoundError Could not initializ...
  org.joda.time.TestWeeks#testMultipliedBy_int NoClassDefFoundError Could not in...
  org.joda.time.TestWeeks#testNegated NoClassDefFoundError Could not initialize ...
  org.joda.time.TestWeeks#testPlus_Weeks NoClassDefFoundError Could not initiali...
  org.joda.time.TestWeeks#testPlus_int NoClassDefFoundError Could not initialize...
  org.joda.time.TestWeeks#testSerialization NoClassDefFoundError Could not initi...
  org.joda.time.TestWeeks#testToStandardDays NoClassDefFoundError Could not init...
  org.joda.time.TestWeeks#testToStandardDuration NoClassDefFoundError Could not ...
  org.joda.time.TestWeeks#testToStandardHours NoClassDefFoundError Could not ini...
  org.joda.time.TestWeeks#testToStandardMinutes NoClassDefFoundError Could not i...
  org.joda.time.TestWeeks#testToStandardSeconds NoClassDefFoundError Could not i...
  org.joda.time.TestWeeks#testToString NoClassDefFoundError Could not initialize...
  org.joda.time.TestYears#testAddToLocalDate NoClassDefFoundError Could not init...
  org.joda.time.TestYears#testConstants NoClassDefFoundError Could not initializ...
  org.joda.time.TestYears#testDividedBy_int NoClassDefFoundError Could not initi...
  org.joda.time.TestYears#testFactory_parseYears_String NoClassDefFoundError Cou...
  org.joda.time.TestYears#testFactory_yearsBetween_RInstant NoClassDefFoundError
  org.joda.time.TestYears#testFactory_yearsBetween_RPartial NoClassDefFoundError
  org.joda.time.TestYears#testFactory_yearsIn_RInterval NoClassDefFoundError Cou...
  org.joda.time.TestYears#testFactory_years_int NoClassDefFoundError Could not i...
  org.joda.time.TestYears#testGetFieldType NoClassDefFoundError Could not initia...
  org.joda.time.TestYears#testGetMethods NoClassDefFoundError Could not initiali...
  org.joda.time.TestYears#testGetPeriodType NoClassDefFoundError Could not initi...
  org.joda.time.TestYears#testIsGreaterThan NoClassDefFoundError Could not initi...
  org.joda.time.TestYears#testIsLessThan NoClassDefFoundError Could not initiali...
  org.joda.time.TestYears#testMinus_Years NoClassDefFoundError Could not initial...
  org.joda.time.TestYears#testMinus_int NoClassDefFoundError Could not initializ...
  org.joda.time.TestYears#testMultipliedBy_int NoClassDefFoundError Could not in...
  org.joda.time.TestYears#testNegated NoClassDefFoundError Could not initialize ...
  org.joda.time.TestYears#testPlus_Years NoClassDefFoundError Could not initiali...
  org.joda.time.TestYears#testPlus_int NoClassDefFoundError Could not initialize...
  org.joda.time.TestYears#testSerialization NoClassDefFoundError Could not initi...
  org.joda.time.TestYears#testToString NoClassDefFoundError Could not initialize...
  org.joda.time.convert.TestStringConverter#testSetIntoIntervalEx_Object_Chronology5 IllegalStateException
  org.joda.time.convert.TestStringConverter#testSetIntoInterval_Object_Chronology1 IllegalStateException
  org.joda.time.convert.TestStringConverter#testSetIntoInterval_Object_Chronology2 IllegalStateException
  org.joda.time.convert.TestStringConverter#testSetIntoInterval_Object_Chronology3 IllegalStateException
  org.joda.time.convert.TestStringConverter#testSetIntoInterval_Object_Chronology4 IllegalStateException
  org.joda.time.convert.TestStringConverter#testSetIntoInterval_Object_Chronology5 IllegalStateException
  org.joda.time.convert.TestStringConverter#testSetIntoInterval_Object_Chronology6 IllegalStateException
  org.joda.time.convert.TestStringConverter#testSetIntoInterval_Object_Chronology7 IllegalStateException
  org.joda.time.convert.TestStringConverter#testSetIntoInterval_Object_Chronology8 IllegalStateException
  org.joda.time.convert.TestStringConverter#testSetIntoPeriod_Object1 IllegalStateException
  org.joda.time.convert.TestStringConverter#testSetIntoPeriod_Object2 IllegalStateException
  org.joda.time.convert.TestStringConverter#testSetIntoPeriod_Object3 IllegalStateException
  org.joda.time.convert.TestStringConverter#testSetIntoPeriod_Object4 IllegalStateException
  org.joda.time.convert.TestStringConverter#testSetIntoPeriod_Object5 IllegalStateException
  org.joda.time.convert.TestStringConverter#testSetIntoPeriod_Object6 IllegalStateException
  org.joda.time.convert.TestStringConverter#testSetIntoPeriod_Object7 IllegalStateException
  org.joda.time.convert.TestStringConverter#testSetIntoPeriod_Object8 IllegalStateException
  org.joda.time.format.TestISOPeriodFormat#testFormatStandard IllegalStateException
  org.joda.time.format.TestISOPeriodFormat#testFormatStandard_negative IllegalStateException
  org.joda.time.format.TestISOPeriodFormatParsing#testParseStandard1 IllegalStateException
  org.joda.time.format.TestISOPeriodFormatParsing#testParseStandard10 IllegalStateException
  org.joda.time.format.TestISOPeriodFormatParsing#testParseStandard11 IllegalStateException
  org.joda.time.format.TestISOPeriodFormatParsing#testParseStandard2 IllegalStateException
  org.joda.time.format.TestISOPeriodFormatParsing#testParseStandard3 IllegalStateException
  org.joda.time.format.TestISOPeriodFormatParsing#testParseStandard4 IllegalStateException
  org.joda.time.format.TestISOPeriodFormatParsing#testParseStandard5 IllegalStateException
  org.joda.time.format.TestISOPeriodFormatParsing#testParseStandard6 IllegalStateException
  org.joda.time.format.TestISOPeriodFormatParsing#testParseStandard7 IllegalStateException
  org.joda.time.format.TestISOPeriodFormatParsing#testParseStandard8 IllegalStateException
  org.joda.time.format.TestISOPeriodFormatParsing#testParseStandard9 IllegalStateException
  org.joda.time.format.TestISOPeriodFormatParsing#testParseStandardFail1 IllegalStateException
  org.joda.time.format.TestISOPeriodFormatParsing#testParseStandardFail2 IllegalStateException
  org.joda.time.format.TestISOPeriodFormatParsing#testParseStandardFail3 IllegalStateException
  org.joda.time.format.TestISOPeriodFormatParsing#testParseStandardFail4 IllegalStateException
  org.joda.time.format.TestPeriodFormat#test_getDefault_FormatOneField IllegalStateException
  org.joda.time.format.TestPeriodFormat#test_getDefault_cached IllegalStateException
  org.joda.time.format.TestPeriodFormat#test_getDefault_formatStandard IllegalStateException
  org.joda.time.format.TestPeriodFormat#test_getDefault_formatTwoFields IllegalStateException
  org.joda.time.format.TestPeriodFormat#test_getDefault_localeValue IllegalStateException
  org.joda.time.format.TestPeriodFormat#test_getDefault_parseOneField IllegalStateException
  org.joda.time.format.TestPeriodFormat#test_getDefault_parseTwoFields IllegalStateException
  org.joda.time.format.TestPeriodFormat#test_wordBasedWithLocale_localeValue IllegalStateException
  org.joda.time.format.TestPeriodFormat#test_wordBased_da_cached IllegalStateException
  org.joda.time.format.TestPeriodFormat#test_wordBased_da_formatMultiple IllegalStateException
  org.joda.time.format.TestPeriodFormat#test_wordBased_da_formatSinglular IllegalStateException
  org.joda.time.format.TestPeriodFormat#test_wordBased_de_FormatOneField IllegalStateException
  org.joda.time.format.TestPeriodFormat#test_wordBased_de_cached IllegalStateException
  org.joda.time.format.TestPeriodFormat#test_wordBased_de_formatStandard IllegalStateException
  org.joda.time.format.TestPeriodFormat#test_wordBased_de_formatTwoFields IllegalStateException
  org.joda.time.format.TestPeriodFormat#test_wordBased_de_parseOneField IllegalStateException
  org.joda.time.format.TestPeriodFormat#test_wordBased_de_parseTwoFields IllegalStateException
  org.joda.time.format.TestPeriodFormat#test_wordBased_default IllegalStateException
  org.joda.time.format.TestPeriodFormat#test_wordBased_en_from_de IllegalStateException
  org.joda.time.format.TestPeriodFormat#test_wordBased_en_from_nl IllegalStateException
  org.joda.time.format.TestPeriodFormat#test_wordBased_en_from_pl IllegalStateException
  org.joda.time.format.TestPeriodFormat#test_wordBased_en_withLocale_pt IllegalStateException
  org.joda.time.format.TestPeriodFormat#test_wordBased_es_FormatOneField IllegalStateException
  org.joda.time.format.TestPeriodFormat#test_wordBased_es_cached IllegalStateException
  org.joda.time.format.TestPeriodFormat#test_wordBased_es_formatStandard IllegalStateException
  org.joda.time.format.TestPeriodFormat#test_wordBased_es_formatTwoFields IllegalStateException
  org.joda.time.format.TestPeriodFormat#test_wordBased_es_parseOneField IllegalStateException
  org.joda.time.format.TestPeriodFormat#test_wordBased_es_parseTwoFields IllegalStateException
  org.joda.time.format.TestPeriodFormat#test_wordBased_fr_FormatOneField IllegalStateException
  org.joda.time.format.TestPeriodFormat#test_wordBased_fr_cached IllegalStateException
  org.joda.time.format.TestPeriodFormat#test_wordBased_fr_formatStandard IllegalStateException
  org.joda.time.format.TestPeriodFormat#test_wordBased_fr_formatTwoFields IllegalStateException
  org.joda.time.format.TestPeriodFormat#test_wordBased_fr_from_de IllegalStateException
  org.joda.time.format.TestPeriodFormat#test_wordBased_fr_from_nl IllegalStateException
  org.joda.time.format.TestPeriodFormat#test_wordBased_fr_parseOneField IllegalStateException
  org.joda.time.format.TestPeriodFormat#test_wordBased_fr_parseTwoFields IllegalStateException
  org.joda.time.format.TestPeriodFormat#test_wordBased_ja_cached IllegalStateException
  org.joda.time.format.TestPeriodFormat#test_wordBased_ja_formatMultiple IllegalStateException
  org.joda.time.format.TestPeriodFormat#test_wordBased_ja_formatSingular IllegalStateException
  org.joda.time.format.TestPeriodFormat#test_wordBased_ja_parseOneField IllegalStateException
  org.joda.time.format.TestPeriodFormat#test_wordBased_ja_parseTwoFields IllegalStateException
  org.joda.time.format.TestPeriodFormat#test_wordBased_localeValue IllegalStateException
  org.joda.time.format.TestPeriodFormat#test_wordBased_nl_FormatOneField IllegalStateException
  org.joda.time.format.TestPeriodFormat#test_wordBased_nl_cached IllegalStateException
  org.joda.time.format.TestPeriodFormat#test_wordBased_nl_formatStandard IllegalStateException
  org.joda.time.format.TestPeriodFormat#test_wordBased_nl_formatTwoFields IllegalStateException
  org.joda.time.format.TestPeriodFormat#test_wordBased_nl_parseOneField IllegalStateException
  org.joda.time.format.TestPeriodFormat#test_wordBased_nl_parseTwoFields IllegalStateException
  org.joda.time.format.TestPeriodFormat#test_wordBased_pl_FormatOneField IllegalStateException
  org.joda.time.format.TestPeriodFormat#test_wordBased_pl_cached IllegalStateException
  org.joda.time.format.TestPeriodFormat#test_wordBased_pl_formatStandard IllegalStateException
  org.joda.time.format.TestPeriodFormat#test_wordBased_pl_formatTwoFields IllegalStateException
  org.joda.time.format.TestPeriodFormat#test_wordBased_pl_from_fr IllegalStateException
  org.joda.time.format.TestPeriodFormat#test_wordBased_pl_parseOneField IllegalStateException
  org.joda.time.format.TestPeriodFormat#test_wordBased_pl_parseTwoFields IllegalStateException
  org.joda.time.format.TestPeriodFormat#test_wordBased_pl_regEx IllegalStateException
  org.joda.time.format.TestPeriodFormat#test_wordBased_pt_FormatOneField IllegalStateException
  org.joda.time.format.TestPeriodFormat#test_wordBased_pt_cached IllegalStateException
  org.joda.time.format.TestPeriodFormat#test_wordBased_pt_formatStandard IllegalStateException
  org.joda.time.format.TestPeriodFormat#test_wordBased_pt_formatTwoFields IllegalStateException
  org.joda.time.format.TestPeriodFormat#test_wordBased_pt_parseOneField IllegalStateException
  org.joda.time.format.TestPeriodFormat#test_wordBased_pt_parseTwoFields IllegalStateException
  org.joda.time.format.TestPeriodFormatParsing#testParseCustom1 IllegalStateException
  org.joda.time.format.TestPeriodFormatParsing#testParseNegativeMillis1 IllegalStateException
  org.joda.time.format.TestPeriodFormatParsing#testParseNegativeMillis2 IllegalStateException
  org.joda.time.format.TestPeriodFormatParsing#testParseStandard1 IllegalStateException
  org.joda.time.format.TestPeriodFormatter#testParseInto_simple IllegalStateException
  org.joda.time.format.TestPeriodFormatter#testParseMutablePeriod_simple IllegalStateException
  org.joda.time.format.TestPeriodFormatter#testParsePeriod_parseType IllegalStateException
  org.joda.time.format.TestPeriodFormatter#testParsePeriod_simple IllegalStateException
  org.joda.time.format.TestPeriodFormatter#testPrint_bufferMethods IllegalStateException
  org.joda.time.format.TestPeriodFormatter#testPrint_simple IllegalStateException
  org.joda.time.format.TestPeriodFormatter#testPrint_writerMethods IllegalStateException
  org.joda.time.format.TestPeriodFormatter#testPrinterParserMethods IllegalStateException
  org.joda.time.format.TestPeriodFormatter#testWithGetLocaleMethods IllegalStateException
  org.joda.time.format.TestPeriodFormatter#testWithGetParseTypeMethods IllegalStateException
  org.joda.time.format.TestPeriodFormatterBuilder#testBug2495455 IllegalStateException
  org.joda.time.format.TestPeriodFormatterBuilder#testFormatPrefixSimple5IgnoringPrefix IllegalStateException
  org.joda.time.format.TestPeriodFormatterBuilder#testFormatPrefixSimple6IgnoringPrefix IllegalStateException
  org.joda.time.format.TestPeriodFormatterBuilder#testFormatPrefixSuffix IllegalStateException
  org.joda.time.format.TestPeriodFormatterBuilder#testFormatSuffixComposite1 IllegalStateException
  org.joda.time.format.TestPeriodFormatterBuilder#testFormatSuffixComposite5IgnoringAffix IllegalStateException
  org.joda.time.format.TestPeriodFormatterBuilder#testFormatSuffixPlural1 IllegalStateException
  org.joda.time.format.TestPeriodFormatterBuilder#testFormatSuffixPlural2 IllegalStateException
  org.joda.time.format.TestPeriodFormatterBuilder#testFormatSuffixPlural4IgnoringPrefix IllegalStateException
  org.joda.time.format.TestPeriodFormatterBuilder#testFormatSuffixRegEx1 IllegalStateException
  org.joda.time.format.TestPeriodFormatterBuilder#testFormatSuffixRegEx2 IllegalStateException
  org.joda.time.format.TestPeriodFormatterBuilder#testFormatSuffixRegEx5IgnoringAffix IllegalStateException
  org.joda.time.format.TestPeriodFormatterBuilder#testFormatSuffixSimple1 IllegalStateException
  org.joda.time.format.TestPeriodFormatterBuilder#testFormatSuffixSimple2 IllegalStateException
  org.joda.time.format.TestPeriodFormatterBuilder#testMonthsAndMinutesAreConsideredSeparateAndCaseIsNotIgnored IllegalStateException
  org.joda.time.format.TestPeriodFormatterBuilder#testPluralAffixParseOrder IllegalStateException
  org.joda.time.format.TestPeriodFormatterBuilder#testRegExAffixParseOrder IllegalStateException

Tests run: 4157, Failures: 3, Errors: 358, Skipped: 0

[INFO] ------------------------------------------------------------------------
[INFO] BUILD FAILURE
[INFO] ------------------------------------------------------------------------
[INFO] Total time: 18.262s
[INFO] Finished at: Thu Aug 06 11:21:42 BST 2015
[INFO] Final Memory: 10M/344M
[INFO] ------------------------------------------------------------------------
[ERROR] Failed to execute goal org.apache.maven.plugins:maven-surefire-plugin:2.18.1:test (default-test) on project joda-time: There are test failures.
[ERROR] 
[ERROR] Please refer to /home/perham/Study/LittleDarwin/Cases/joda-time-2.8.1/target/surefire-reports for the individual test results.
[ERROR] -> [Help 1]
[ERROR] 
[ERROR] To see the full stack trace of the errors, re-run Maven with the -e switch.
[ERROR] Re-run Maven using the -X switch to enable full debug logging.
[ERROR] 
[ERROR] For more information about the errors and possible solutions, please read the following articles:
[ERROR] [Help 1] http://cwiki.apache.org/confluence/display/MAVEN/MojoFailureException
