[INFO] Scanning for projects...
[INFO]                                                                         
[INFO] ------------------------------------------------------------------------
[INFO] Building Joda-Time 2.8.1
[INFO] ------------------------------------------------------------------------
[INFO] 
[INFO] --- maven-resources-plugin:2.7:resources (default-resources) @ joda-time ---
[INFO] Using 'UTF-8' encoding to copy filtered resources.
[INFO] Copying 2 resources to META-INF
[INFO] Copying 10 resources
[INFO] 
[INFO] --- maven-compiler-plugin:3.3:compile (default-compile) @ joda-time ---
[INFO] Changes detected - recompiling the module!
[INFO] Compiling 166 source files to /home/perham/Study/LittleDarwin/Cases/joda-time-2.8.1/target/classes
[INFO] 
[INFO] --- exec-maven-plugin:1.4.0:java (compile-tzdb) @ joda-time ---
Writing zoneinfo files
Writing ZoneInfoMap
[INFO] 
[INFO] --- maven-resources-plugin:2.7:testResources (default-testResources) @ joda-time ---
[INFO] Using 'UTF-8' encoding to copy filtered resources.
[INFO] Copying 34 resources
[INFO] 
[INFO] --- maven-compiler-plugin:3.3:testCompile (default-testCompile) @ joda-time ---
[INFO] Nothing to compile - all classes are up to date
[INFO] 
[INFO] --- maven-surefire-plugin:2.18.1:test (default-test) @ joda-time ---
[INFO] Surefire report directory: /home/perham/Study/LittleDarwin/Cases/joda-time-2.8.1/target/surefire-reports

-------------------------------------------------------
 T E S T S
-------------------------------------------------------
Running org.joda.time.TestAllPackages

TestBuddhistChronology.testCalendar

TestCopticChronology.testCalendar

TestEthiopicChronology.testCalendar

TestIslamicChronology.testCalendar

Testing Gregorian chronology over 1000 iterations
100% complete (i=1000)

Testing Julian chronology over 1000 iterations
100% complete (i=1000)
Writing zoneinfo files
Writing ZoneInfoMap
Tests run: 4157, Failures: 0, Errors: 20, Skipped: 0, Time elapsed: 5.588 sec <<< FAILURE! - in org.joda.time.TestAllPackages
test_getDefault_parseOneField(org.joda.time.format.TestPeriodFormat)  Time elapsed: 0.004 sec  <<< ERROR!
java.lang.IllegalArgumentException: Invalid format: "2 days"
	at org.joda.time.format.PeriodFormatter.parseMutablePeriod(PeriodFormatter.java:330)
	at org.joda.time.format.PeriodFormatter.parsePeriod(PeriodFormatter.java:308)
	at org.joda.time.format.TestPeriodFormat.test_getDefault_parseOneField(TestPeriodFormat.java:97)

test_getDefault_parseTwoFields(org.joda.time.format.TestPeriodFormat)  Time elapsed: 0 sec  <<< ERROR!
java.lang.IllegalArgumentException: Invalid format: "2 days and 5 hours"
	at org.joda.time.format.PeriodFormatter.parseMutablePeriod(PeriodFormatter.java:330)
	at org.joda.time.format.PeriodFormatter.parsePeriod(PeriodFormatter.java:308)
	at org.joda.time.format.TestPeriodFormat.test_getDefault_parseTwoFields(TestPeriodFormat.java:103)

test_wordBased_fr_parseOneField(org.joda.time.format.TestPeriodFormat)  Time elapsed: 0.001 sec  <<< ERROR!
java.lang.IllegalArgumentException: Invalid format: "2 jours"
	at org.joda.time.format.PeriodFormatter.parseMutablePeriod(PeriodFormatter.java:330)
	at org.joda.time.format.PeriodFormatter.parsePeriod(PeriodFormatter.java:308)
	at org.joda.time.format.TestPeriodFormat.test_wordBased_fr_parseOneField(TestPeriodFormat.java:152)

test_wordBased_fr_parseTwoFields(org.joda.time.format.TestPeriodFormat)  Time elapsed: 0.001 sec  <<< ERROR!
java.lang.IllegalArgumentException: Invalid format: "2 jours et 5 heures"
	at org.joda.time.format.PeriodFormatter.parseMutablePeriod(PeriodFormatter.java:330)
	at org.joda.time.format.PeriodFormatter.parsePeriod(PeriodFormatter.java:308)
	at org.joda.time.format.TestPeriodFormat.test_wordBased_fr_parseTwoFields(TestPeriodFormat.java:158)

test_wordBased_pt_parseOneField(org.joda.time.format.TestPeriodFormat)  Time elapsed: 0.001 sec  <<< ERROR!
java.lang.IllegalArgumentException: Invalid format: "2 dias"
	at org.joda.time.format.PeriodFormatter.parseMutablePeriod(PeriodFormatter.java:330)
	at org.joda.time.format.PeriodFormatter.parsePeriod(PeriodFormatter.java:308)
	at org.joda.time.format.TestPeriodFormat.test_wordBased_pt_parseOneField(TestPeriodFormat.java:189)

test_wordBased_pt_parseTwoFields(org.joda.time.format.TestPeriodFormat)  Time elapsed: 0.001 sec  <<< ERROR!
java.lang.IllegalArgumentException: Invalid format: "2 dias e 5 horas"
	at org.joda.time.format.PeriodFormatter.parseMutablePeriod(PeriodFormatter.java:330)
	at org.joda.time.format.PeriodFormatter.parsePeriod(PeriodFormatter.java:308)
	at org.joda.time.format.TestPeriodFormat.test_wordBased_pt_parseTwoFields(TestPeriodFormat.java:195)

test_wordBased_es_parseOneField(org.joda.time.format.TestPeriodFormat)  Time elapsed: 0 sec  <<< ERROR!
java.lang.IllegalArgumentException: Invalid format: "2 días"
	at org.joda.time.format.PeriodFormatter.parseMutablePeriod(PeriodFormatter.java:330)
	at org.joda.time.format.PeriodFormatter.parsePeriod(PeriodFormatter.java:308)
	at org.joda.time.format.TestPeriodFormat.test_wordBased_es_parseOneField(TestPeriodFormat.java:226)

test_wordBased_es_parseTwoFields(org.joda.time.format.TestPeriodFormat)  Time elapsed: 0 sec  <<< ERROR!
java.lang.IllegalArgumentException: Invalid format: "2 días y 5 horas"
	at org.joda.time.format.PeriodFormatter.parseMutablePeriod(PeriodFormatter.java:330)
	at org.joda.time.format.PeriodFormatter.parsePeriod(PeriodFormatter.java:308)
	at org.joda.time.format.TestPeriodFormat.test_wordBased_es_parseTwoFields(TestPeriodFormat.java:232)

test_wordBased_de_parseOneField(org.joda.time.format.TestPeriodFormat)  Time elapsed: 0 sec  <<< ERROR!
java.lang.IllegalArgumentException: Invalid format: "2 Tage"
	at org.joda.time.format.PeriodFormatter.parseMutablePeriod(PeriodFormatter.java:330)
	at org.joda.time.format.PeriodFormatter.parsePeriod(PeriodFormatter.java:308)
	at org.joda.time.format.TestPeriodFormat.test_wordBased_de_parseOneField(TestPeriodFormat.java:263)

test_wordBased_de_parseTwoFields(org.joda.time.format.TestPeriodFormat)  Time elapsed: 0.001 sec  <<< ERROR!
java.lang.IllegalArgumentException: Invalid format: "2 Tage und 5 Stunden"
	at org.joda.time.format.PeriodFormatter.parseMutablePeriod(PeriodFormatter.java:330)
	at org.joda.time.format.PeriodFormatter.parsePeriod(PeriodFormatter.java:308)
	at org.joda.time.format.TestPeriodFormat.test_wordBased_de_parseTwoFields(TestPeriodFormat.java:269)

test_wordBased_nl_parseOneField(org.joda.time.format.TestPeriodFormat)  Time elapsed: 0 sec  <<< ERROR!
java.lang.IllegalArgumentException: Invalid format: "2 dagen"
	at org.joda.time.format.PeriodFormatter.parseMutablePeriod(PeriodFormatter.java:330)
	at org.joda.time.format.PeriodFormatter.parsePeriod(PeriodFormatter.java:308)
	at org.joda.time.format.TestPeriodFormat.test_wordBased_nl_parseOneField(TestPeriodFormat.java:300)

test_wordBased_nl_parseTwoFields(org.joda.time.format.TestPeriodFormat)  Time elapsed: 0 sec  <<< ERROR!
java.lang.IllegalArgumentException: Invalid format: "2 dagen en 5 uur"
	at org.joda.time.format.PeriodFormatter.parseMutablePeriod(PeriodFormatter.java:330)
	at org.joda.time.format.PeriodFormatter.parsePeriod(PeriodFormatter.java:308)
	at org.joda.time.format.TestPeriodFormat.test_wordBased_nl_parseTwoFields(TestPeriodFormat.java:306)

test_wordBased_ja_parseOneField(org.joda.time.format.TestPeriodFormat)  Time elapsed: 0 sec  <<< ERROR!
java.lang.IllegalArgumentException: Invalid format: "2日"
	at org.joda.time.format.PeriodFormatter.parseMutablePeriod(PeriodFormatter.java:330)
	at org.joda.time.format.PeriodFormatter.parsePeriod(PeriodFormatter.java:308)
	at org.joda.time.format.TestPeriodFormat.test_wordBased_ja_parseOneField(TestPeriodFormat.java:355)

test_wordBased_ja_parseTwoFields(org.joda.time.format.TestPeriodFormat)  Time elapsed: 0 sec  <<< ERROR!
java.lang.IllegalArgumentException: Invalid format: "2日5時間"
	at org.joda.time.format.PeriodFormatter.parseMutablePeriod(PeriodFormatter.java:330)
	at org.joda.time.format.PeriodFormatter.parsePeriod(PeriodFormatter.java:308)
	at org.joda.time.format.TestPeriodFormat.test_wordBased_ja_parseTwoFields(TestPeriodFormat.java:361)

test_wordBased_pl_parseOneField(org.joda.time.format.TestPeriodFormat)  Time elapsed: 0 sec  <<< ERROR!
java.lang.IllegalArgumentException: Invalid format: "2 dni"
	at org.joda.time.format.PeriodFormatter.parseMutablePeriod(PeriodFormatter.java:330)
	at org.joda.time.format.PeriodFormatter.parsePeriod(PeriodFormatter.java:308)
	at org.joda.time.format.TestPeriodFormat.test_wordBased_pl_parseOneField(TestPeriodFormat.java:398)

test_wordBased_pl_parseTwoFields(org.joda.time.format.TestPeriodFormat)  Time elapsed: 0.001 sec  <<< ERROR!
java.lang.IllegalArgumentException: Invalid format: "2 dni i 5 godzin"
	at org.joda.time.format.PeriodFormatter.parseMutablePeriod(PeriodFormatter.java:330)
	at org.joda.time.format.PeriodFormatter.parsePeriod(PeriodFormatter.java:308)
	at org.joda.time.format.TestPeriodFormat.test_wordBased_pl_parseTwoFields(TestPeriodFormat.java:404)

test_wordBased_en_withLocale_pt(org.joda.time.format.TestPeriodFormat)  Time elapsed: 0 sec  <<< ERROR!
java.lang.IllegalArgumentException: Invalid format: "2 days and 5 hours"
	at org.joda.time.format.PeriodFormatter.parseMutablePeriod(PeriodFormatter.java:330)
	at org.joda.time.format.PeriodFormatter.parsePeriod(PeriodFormatter.java:308)
	at org.joda.time.format.TestPeriodFormat.test_wordBased_en_withLocale_pt(TestPeriodFormat.java:634)

testParseStandard1(org.joda.time.format.TestPeriodFormatParsing)  Time elapsed: 0 sec  <<< ERROR!
java.lang.IllegalArgumentException: Invalid format: "6 years, 3 months and 2 days"
	at org.joda.time.format.PeriodFormatter.parseMutablePeriod(PeriodFormatter.java:330)
	at org.joda.time.format.PeriodFormatter.parsePeriod(PeriodFormatter.java:308)
	at org.joda.time.format.TestPeriodFormatParsing.testParseStandard1(TestPeriodFormatParsing.java:94)

testPluralAffixParseOrder(org.joda.time.format.TestPeriodFormatterBuilder)  Time elapsed: 0 sec  <<< ERROR!
java.lang.IllegalArgumentException: Invalid format: "2days"
	at org.joda.time.format.PeriodFormatter.parseMutablePeriod(PeriodFormatter.java:330)
	at org.joda.time.format.PeriodFormatter.parsePeriod(PeriodFormatter.java:308)
	at org.joda.time.format.TestPeriodFormatterBuilder.testPluralAffixParseOrder(TestPeriodFormatterBuilder.java:357)

testFormatSuffixPlural4IgnoringPrefix(org.joda.time.format.TestPeriodFormatterBuilder)  Time elapsed: 0.005 sec  <<< ERROR!
java.lang.IllegalArgumentException: Invalid format: "1mss"
	at org.joda.time.format.PeriodFormatter.parseMutablePeriod(PeriodFormatter.java:330)
	at org.joda.time.format.PeriodFormatter.parsePeriod(PeriodFormatter.java:308)
	at org.joda.time.format.TestPeriodFormatterBuilder.testFormatSuffixPlural4IgnoringPrefix(TestPeriodFormatterBuilder.java:631)


Results :

Tests in error: 
  org.joda.time.format.TestPeriodFormat#test_getDefault_parseOneField IllegalArgumentException
  org.joda.time.format.TestPeriodFormat#test_getDefault_parseTwoFields IllegalArgumentException
  org.joda.time.format.TestPeriodFormat#test_wordBased_de_parseOneField IllegalArgumentException
  org.joda.time.format.TestPeriodFormat#test_wordBased_de_parseTwoFields IllegalArgumentException
  org.joda.time.format.TestPeriodFormat#test_wordBased_en_withLocale_pt IllegalArgumentException
  org.joda.time.format.TestPeriodFormat#test_wordBased_es_parseOneField IllegalArgumentException
  org.joda.time.format.TestPeriodFormat#test_wordBased_es_parseTwoFields IllegalArgumentException
  org.joda.time.format.TestPeriodFormat#test_wordBased_fr_parseOneField IllegalArgumentException
  org.joda.time.format.TestPeriodFormat#test_wordBased_fr_parseTwoFields IllegalArgumentException
  org.joda.time.format.TestPeriodFormat#test_wordBased_ja_parseOneField IllegalArgumentException
  org.joda.time.format.TestPeriodFormat#test_wordBased_ja_parseTwoFields IllegalArgumentException
  org.joda.time.format.TestPeriodFormat#test_wordBased_nl_parseOneField IllegalArgumentException
  org.joda.time.format.TestPeriodFormat#test_wordBased_nl_parseTwoFields IllegalArgumentException
  org.joda.time.format.TestPeriodFormat#test_wordBased_pl_parseOneField IllegalArgumentException
  org.joda.time.format.TestPeriodFormat#test_wordBased_pl_parseTwoFields IllegalArgumentException
  org.joda.time.format.TestPeriodFormat#test_wordBased_pt_parseOneField IllegalArgumentException
  org.joda.time.format.TestPeriodFormat#test_wordBased_pt_parseTwoFields IllegalArgumentException
  org.joda.time.format.TestPeriodFormatParsing#testParseStandard1 IllegalArgumentException
  org.joda.time.format.TestPeriodFormatterBuilder#testFormatSuffixPlural4IgnoringPrefix IllegalArgumentException
  org.joda.time.format.TestPeriodFormatterBuilder#testPluralAffixParseOrder IllegalArgumentException

Tests run: 4157, Failures: 0, Errors: 20, Skipped: 0

[INFO] ------------------------------------------------------------------------
[INFO] BUILD FAILURE
[INFO] ------------------------------------------------------------------------
[INFO] Total time: 16.055s
[INFO] Finished at: Thu Aug 06 11:13:01 BST 2015
[INFO] Final Memory: 8M/216M
[INFO] ------------------------------------------------------------------------
[ERROR] Failed to execute goal org.apache.maven.plugins:maven-surefire-plugin:2.18.1:test (default-test) on project joda-time: There are test failures.
[ERROR] 
[ERROR] Please refer to /home/perham/Study/LittleDarwin/Cases/joda-time-2.8.1/target/surefire-reports for the individual test results.
[ERROR] -> [Help 1]
[ERROR] 
[ERROR] To see the full stack trace of the errors, re-run Maven with the -e switch.
[ERROR] Re-run Maven using the -X switch to enable full debug logging.
[ERROR] 
[ERROR] For more information about the errors and possible solutions, please read the following articles:
[ERROR] [Help 1] http://cwiki.apache.org/confluence/display/MAVEN/MojoFailureException
