[INFO] Scanning for projects...
[INFO]                                                                         
[INFO] ------------------------------------------------------------------------
[INFO] Building Joda-Time 2.8.1
[INFO] ------------------------------------------------------------------------
[INFO] 
[INFO] --- maven-resources-plugin:2.7:resources (default-resources) @ joda-time ---
[INFO] Using 'UTF-8' encoding to copy filtered resources.
[INFO] Copying 2 resources to META-INF
[INFO] Copying 10 resources
[INFO] 
[INFO] --- maven-compiler-plugin:3.3:compile (default-compile) @ joda-time ---
[INFO] Changes detected - recompiling the module!
[INFO] Compiling 166 source files to /home/perham/Study/LittleDarwin/Cases/joda-time-2.8.1/target/classes
[INFO] 
[INFO] --- exec-maven-plugin:1.4.0:java (compile-tzdb) @ joda-time ---
Writing zoneinfo files
Writing ZoneInfoMap
[INFO] 
[INFO] --- maven-resources-plugin:2.7:testResources (default-testResources) @ joda-time ---
[INFO] Using 'UTF-8' encoding to copy filtered resources.
[INFO] Copying 34 resources
[INFO] 
[INFO] --- maven-compiler-plugin:3.3:testCompile (default-testCompile) @ joda-time ---
[INFO] Nothing to compile - all classes are up to date
[INFO] 
[INFO] --- maven-surefire-plugin:2.18.1:test (default-test) @ joda-time ---
[INFO] Surefire report directory: /home/perham/Study/LittleDarwin/Cases/joda-time-2.8.1/target/surefire-reports

-------------------------------------------------------
 T E S T S
-------------------------------------------------------
Running org.joda.time.TestAllPackages

TestBuddhistChronology.testCalendar

TestCopticChronology.testCalendar

TestEthiopicChronology.testCalendar

TestIslamicChronology.testCalendar

Testing Gregorian chronology over 1000 iterations
100% complete (i=1000)

Testing Julian chronology over 1000 iterations
100% complete (i=1000)
Writing zoneinfo files
Writing ZoneInfoMap
Tests run: 4157, Failures: 3, Errors: 50, Skipped: 0, Time elapsed: 5.453 sec <<< FAILURE! - in org.joda.time.TestAllPackages
testToString(org.joda.time.TestPeriod_Basics)  Time elapsed: 0.001 sec  <<< ERROR!
java.lang.NegativeArraySizeException
	at java.lang.AbstractStringBuilder.<init>(AbstractStringBuilder.java:64)
	at java.lang.StringBuffer.<init>(StringBuffer.java:108)
	at org.joda.time.format.PeriodFormatter.print(PeriodFormatter.java:244)
	at org.joda.time.base.AbstractPeriod.toString(AbstractPeriod.java:228)
	at org.joda.time.TestPeriod_Basics.testToString(TestPeriod_Basics.java:478)

testToString_PeriodFormatter(org.joda.time.TestPeriod_Basics)  Time elapsed: 0.006 sec  <<< ERROR!
java.lang.NegativeArraySizeException
	at java.lang.AbstractStringBuilder.<init>(AbstractStringBuilder.java:64)
	at java.lang.StringBuffer.<init>(StringBuffer.java:108)
	at org.joda.time.format.PeriodFormatter.print(PeriodFormatter.java:244)
	at org.joda.time.base.AbstractPeriod.toString(AbstractPeriod.java:243)
	at org.joda.time.TestPeriod_Basics.testToString_PeriodFormatter(TestPeriod_Basics.java:484)

testToString(org.joda.time.TestMutablePeriod_Basics)  Time elapsed: 0.001 sec  <<< ERROR!
java.lang.NegativeArraySizeException
	at java.lang.AbstractStringBuilder.<init>(AbstractStringBuilder.java:64)
	at java.lang.StringBuffer.<init>(StringBuffer.java:108)
	at org.joda.time.format.PeriodFormatter.print(PeriodFormatter.java:244)
	at org.joda.time.base.AbstractPeriod.toString(AbstractPeriod.java:228)
	at org.joda.time.TestMutablePeriod_Basics.testToString(TestMutablePeriod_Basics.java:411)

test_wordBased_pl_regEx(org.joda.time.format.TestPeriodFormat)  Time elapsed: 0.003 sec  <<< ERROR!
java.lang.NegativeArraySizeException
	at java.lang.AbstractStringBuilder.<init>(AbstractStringBuilder.java:64)
	at java.lang.StringBuffer.<init>(StringBuffer.java:108)
	at org.joda.time.format.PeriodFormatter.print(PeriodFormatter.java:244)
	at org.joda.time.format.TestPeriodFormat.test_wordBased_pl_regEx(TestPeriodFormat.java:445)

test_wordBased_fr_from_de(org.joda.time.format.TestPeriodFormat)  Time elapsed: 0.001 sec  <<< ERROR!
java.lang.NegativeArraySizeException
	at java.lang.AbstractStringBuilder.<init>(AbstractStringBuilder.java:64)
	at java.lang.StringBuffer.<init>(StringBuffer.java:108)
	at org.joda.time.format.PeriodFormatter.print(PeriodFormatter.java:244)
	at org.joda.time.format.TestPeriodFormat.test_wordBased_fr_from_de(TestPeriodFormat.java:580)

test_wordBased_fr_from_nl(org.joda.time.format.TestPeriodFormat)  Time elapsed: 0.001 sec  <<< ERROR!
java.lang.NegativeArraySizeException
	at java.lang.AbstractStringBuilder.<init>(AbstractStringBuilder.java:64)
	at java.lang.StringBuffer.<init>(StringBuffer.java:108)
	at org.joda.time.format.PeriodFormatter.print(PeriodFormatter.java:244)
	at org.joda.time.format.TestPeriodFormat.test_wordBased_fr_from_nl(TestPeriodFormat.java:586)

test_wordBased_en_from_de(org.joda.time.format.TestPeriodFormat)  Time elapsed: 0 sec  <<< ERROR!
java.lang.NegativeArraySizeException
	at java.lang.AbstractStringBuilder.<init>(AbstractStringBuilder.java:64)
	at java.lang.StringBuffer.<init>(StringBuffer.java:108)
	at org.joda.time.format.PeriodFormatter.print(PeriodFormatter.java:244)
	at org.joda.time.format.TestPeriodFormat.test_wordBased_en_from_de(TestPeriodFormat.java:592)

test_wordBased_en_from_nl(org.joda.time.format.TestPeriodFormat)  Time elapsed: 0.001 sec  <<< ERROR!
java.lang.NegativeArraySizeException
	at java.lang.AbstractStringBuilder.<init>(AbstractStringBuilder.java:64)
	at java.lang.StringBuffer.<init>(StringBuffer.java:108)
	at org.joda.time.format.PeriodFormatter.print(PeriodFormatter.java:244)
	at org.joda.time.format.TestPeriodFormat.test_wordBased_en_from_nl(TestPeriodFormat.java:598)

test_wordBased_en_from_pl(org.joda.time.format.TestPeriodFormat)  Time elapsed: 0 sec  <<< ERROR!
java.lang.NegativeArraySizeException
	at java.lang.AbstractStringBuilder.<init>(AbstractStringBuilder.java:64)
	at java.lang.StringBuffer.<init>(StringBuffer.java:108)
	at org.joda.time.format.PeriodFormatter.print(PeriodFormatter.java:244)
	at org.joda.time.format.TestPeriodFormat.test_wordBased_en_from_pl(TestPeriodFormat.java:604)

test_wordBased_pl_from_fr(org.joda.time.format.TestPeriodFormat)  Time elapsed: 0.001 sec  <<< ERROR!
java.lang.NegativeArraySizeException
	at java.lang.AbstractStringBuilder.<init>(AbstractStringBuilder.java:64)
	at java.lang.StringBuffer.<init>(StringBuffer.java:108)
	at org.joda.time.format.PeriodFormatter.print(PeriodFormatter.java:244)
	at org.joda.time.format.TestPeriodFormat.test_wordBased_pl_from_fr(TestPeriodFormat.java:610)

test_wordBased_en_withLocale_pt(org.joda.time.format.TestPeriodFormat)  Time elapsed: 0.001 sec  <<< ERROR!
java.lang.NegativeArraySizeException
	at java.lang.AbstractStringBuilder.<init>(AbstractStringBuilder.java:64)
	at java.lang.StringBuffer.<init>(StringBuffer.java:108)
	at org.joda.time.format.PeriodFormatter.print(PeriodFormatter.java:244)
	at org.joda.time.format.TestPeriodFormat.test_wordBased_en_withLocale_pt(TestPeriodFormat.java:633)

test_wordBased_default(org.joda.time.format.TestPeriodFormat)  Time elapsed: 0 sec  <<< ERROR!
java.lang.NegativeArraySizeException
	at java.lang.AbstractStringBuilder.<init>(AbstractStringBuilder.java:64)
	at java.lang.StringBuffer.<init>(StringBuffer.java:108)
	at org.joda.time.format.PeriodFormatter.print(PeriodFormatter.java:244)
	at org.joda.time.format.TestPeriodFormat.test_wordBased_default(TestPeriodFormat.java:126)

test_wordBased_fr_formatStandard(org.joda.time.format.TestPeriodFormat)  Time elapsed: 0.001 sec  <<< ERROR!
java.lang.NegativeArraySizeException
	at java.lang.AbstractStringBuilder.<init>(AbstractStringBuilder.java:64)
	at java.lang.StringBuffer.<init>(StringBuffer.java:108)
	at org.joda.time.format.PeriodFormatter.print(PeriodFormatter.java:244)
	at org.joda.time.format.TestPeriodFormat.test_wordBased_fr_formatStandard(TestPeriodFormat.java:134)

test_wordBased_fr_FormatOneField(org.joda.time.format.TestPeriodFormat)  Time elapsed: 0 sec  <<< ERROR!
java.lang.NegativeArraySizeException
	at java.lang.AbstractStringBuilder.<init>(AbstractStringBuilder.java:64)
	at java.lang.StringBuffer.<init>(StringBuffer.java:108)
	at org.joda.time.format.PeriodFormatter.print(PeriodFormatter.java:244)
	at org.joda.time.format.TestPeriodFormat.test_wordBased_fr_FormatOneField(TestPeriodFormat.java:140)

test_wordBased_fr_formatTwoFields(org.joda.time.format.TestPeriodFormat)  Time elapsed: 0 sec  <<< ERROR!
java.lang.NegativeArraySizeException
	at java.lang.AbstractStringBuilder.<init>(AbstractStringBuilder.java:64)
	at java.lang.StringBuffer.<init>(StringBuffer.java:108)
	at org.joda.time.format.PeriodFormatter.print(PeriodFormatter.java:244)
	at org.joda.time.format.TestPeriodFormat.test_wordBased_fr_formatTwoFields(TestPeriodFormat.java:146)

test_wordBased_pt_formatStandard(org.joda.time.format.TestPeriodFormat)  Time elapsed: 0.002 sec  <<< ERROR!
java.lang.NegativeArraySizeException
	at java.lang.AbstractStringBuilder.<init>(AbstractStringBuilder.java:64)
	at java.lang.StringBuffer.<init>(StringBuffer.java:108)
	at org.joda.time.format.PeriodFormatter.print(PeriodFormatter.java:244)
	at org.joda.time.format.TestPeriodFormat.test_wordBased_pt_formatStandard(TestPeriodFormat.java:171)

test_wordBased_pt_FormatOneField(org.joda.time.format.TestPeriodFormat)  Time elapsed: 0 sec  <<< ERROR!
java.lang.NegativeArraySizeException
	at java.lang.AbstractStringBuilder.<init>(AbstractStringBuilder.java:64)
	at java.lang.StringBuffer.<init>(StringBuffer.java:108)
	at org.joda.time.format.PeriodFormatter.print(PeriodFormatter.java:244)
	at org.joda.time.format.TestPeriodFormat.test_wordBased_pt_FormatOneField(TestPeriodFormat.java:177)

test_wordBased_pt_formatTwoFields(org.joda.time.format.TestPeriodFormat)  Time elapsed: 0.001 sec  <<< ERROR!
java.lang.NegativeArraySizeException
	at java.lang.AbstractStringBuilder.<init>(AbstractStringBuilder.java:64)
	at java.lang.StringBuffer.<init>(StringBuffer.java:108)
	at org.joda.time.format.PeriodFormatter.print(PeriodFormatter.java:244)
	at org.joda.time.format.TestPeriodFormat.test_wordBased_pt_formatTwoFields(TestPeriodFormat.java:183)

test_wordBased_es_formatStandard(org.joda.time.format.TestPeriodFormat)  Time elapsed: 0.002 sec  <<< ERROR!
java.lang.NegativeArraySizeException
	at java.lang.AbstractStringBuilder.<init>(AbstractStringBuilder.java:64)
	at java.lang.StringBuffer.<init>(StringBuffer.java:108)
	at org.joda.time.format.PeriodFormatter.print(PeriodFormatter.java:244)
	at org.joda.time.format.TestPeriodFormat.test_wordBased_es_formatStandard(TestPeriodFormat.java:208)

test_wordBased_es_FormatOneField(org.joda.time.format.TestPeriodFormat)  Time elapsed: 0.001 sec  <<< ERROR!
java.lang.NegativeArraySizeException
	at java.lang.AbstractStringBuilder.<init>(AbstractStringBuilder.java:64)
	at java.lang.StringBuffer.<init>(StringBuffer.java:108)
	at org.joda.time.format.PeriodFormatter.print(PeriodFormatter.java:244)
	at org.joda.time.format.TestPeriodFormat.test_wordBased_es_FormatOneField(TestPeriodFormat.java:214)

test_wordBased_es_formatTwoFields(org.joda.time.format.TestPeriodFormat)  Time elapsed: 0 sec  <<< ERROR!
java.lang.NegativeArraySizeException
	at java.lang.AbstractStringBuilder.<init>(AbstractStringBuilder.java:64)
	at java.lang.StringBuffer.<init>(StringBuffer.java:108)
	at org.joda.time.format.PeriodFormatter.print(PeriodFormatter.java:244)
	at org.joda.time.format.TestPeriodFormat.test_wordBased_es_formatTwoFields(TestPeriodFormat.java:220)

test_wordBased_de_formatStandard(org.joda.time.format.TestPeriodFormat)  Time elapsed: 0.001 sec  <<< ERROR!
java.lang.NegativeArraySizeException
	at java.lang.AbstractStringBuilder.<init>(AbstractStringBuilder.java:64)
	at java.lang.StringBuffer.<init>(StringBuffer.java:108)
	at org.joda.time.format.PeriodFormatter.print(PeriodFormatter.java:244)
	at org.joda.time.format.TestPeriodFormat.test_wordBased_de_formatStandard(TestPeriodFormat.java:245)

test_wordBased_de_FormatOneField(org.joda.time.format.TestPeriodFormat)  Time elapsed: 0.001 sec  <<< ERROR!
java.lang.NegativeArraySizeException
	at java.lang.AbstractStringBuilder.<init>(AbstractStringBuilder.java:64)
	at java.lang.StringBuffer.<init>(StringBuffer.java:108)
	at org.joda.time.format.PeriodFormatter.print(PeriodFormatter.java:244)
	at org.joda.time.format.TestPeriodFormat.test_wordBased_de_FormatOneField(TestPeriodFormat.java:251)

test_wordBased_de_formatTwoFields(org.joda.time.format.TestPeriodFormat)  Time elapsed: 0 sec  <<< ERROR!
java.lang.NegativeArraySizeException
	at java.lang.AbstractStringBuilder.<init>(AbstractStringBuilder.java:64)
	at java.lang.StringBuffer.<init>(StringBuffer.java:108)
	at org.joda.time.format.PeriodFormatter.print(PeriodFormatter.java:244)
	at org.joda.time.format.TestPeriodFormat.test_wordBased_de_formatTwoFields(TestPeriodFormat.java:257)

test_wordBased_nl_formatStandard(org.joda.time.format.TestPeriodFormat)  Time elapsed: 0.002 sec  <<< ERROR!
java.lang.NegativeArraySizeException
	at java.lang.AbstractStringBuilder.<init>(AbstractStringBuilder.java:64)
	at java.lang.StringBuffer.<init>(StringBuffer.java:108)
	at org.joda.time.format.PeriodFormatter.print(PeriodFormatter.java:244)
	at org.joda.time.format.TestPeriodFormat.test_wordBased_nl_formatStandard(TestPeriodFormat.java:282)

test_wordBased_nl_FormatOneField(org.joda.time.format.TestPeriodFormat)  Time elapsed: 0 sec  <<< ERROR!
java.lang.NegativeArraySizeException
	at java.lang.AbstractStringBuilder.<init>(AbstractStringBuilder.java:64)
	at java.lang.StringBuffer.<init>(StringBuffer.java:108)
	at org.joda.time.format.PeriodFormatter.print(PeriodFormatter.java:244)
	at org.joda.time.format.TestPeriodFormat.test_wordBased_nl_FormatOneField(TestPeriodFormat.java:288)

test_wordBased_nl_formatTwoFields(org.joda.time.format.TestPeriodFormat)  Time elapsed: 0.001 sec  <<< ERROR!
java.lang.NegativeArraySizeException
	at java.lang.AbstractStringBuilder.<init>(AbstractStringBuilder.java:64)
	at java.lang.StringBuffer.<init>(StringBuffer.java:108)
	at org.joda.time.format.PeriodFormatter.print(PeriodFormatter.java:244)
	at org.joda.time.format.TestPeriodFormat.test_wordBased_nl_formatTwoFields(TestPeriodFormat.java:294)

test_wordBased_da_formatMultiple(org.joda.time.format.TestPeriodFormat)  Time elapsed: 0.003 sec  <<< ERROR!
java.lang.NegativeArraySizeException
	at java.lang.AbstractStringBuilder.<init>(AbstractStringBuilder.java:64)
	at java.lang.StringBuffer.<init>(StringBuffer.java:108)
	at org.joda.time.format.PeriodFormatter.print(PeriodFormatter.java:244)
	at org.joda.time.format.TestPeriodFormat.test_wordBased_da_formatMultiple(TestPeriodFormat.java:319)

test_wordBased_da_formatSinglular(org.joda.time.format.TestPeriodFormat)  Time elapsed: 0.001 sec  <<< ERROR!
java.lang.NegativeArraySizeException
	at java.lang.AbstractStringBuilder.<init>(AbstractStringBuilder.java:64)
	at java.lang.StringBuffer.<init>(StringBuffer.java:108)
	at org.joda.time.format.PeriodFormatter.print(PeriodFormatter.java:244)
	at org.joda.time.format.TestPeriodFormat.test_wordBased_da_formatSinglular(TestPeriodFormat.java:325)

test_wordBased_ja_formatMultiple(org.joda.time.format.TestPeriodFormat)  Time elapsed: 0.003 sec  <<< ERROR!
java.lang.NegativeArraySizeException
	at java.lang.AbstractStringBuilder.<init>(AbstractStringBuilder.java:64)
	at java.lang.StringBuffer.<init>(StringBuffer.java:108)
	at org.joda.time.format.PeriodFormatter.print(PeriodFormatter.java:244)
	at org.joda.time.format.TestPeriodFormat.test_wordBased_ja_formatMultiple(TestPeriodFormat.java:338)

test_wordBased_ja_formatSingular(org.joda.time.format.TestPeriodFormat)  Time elapsed: 0.001 sec  <<< ERROR!
java.lang.NegativeArraySizeException
	at java.lang.AbstractStringBuilder.<init>(AbstractStringBuilder.java:64)
	at java.lang.StringBuffer.<init>(StringBuffer.java:108)
	at org.joda.time.format.PeriodFormatter.print(PeriodFormatter.java:244)
	at org.joda.time.format.TestPeriodFormat.test_wordBased_ja_formatSingular(TestPeriodFormat.java:344)

test_wordBased_pl_formatStandard(org.joda.time.format.TestPeriodFormat)  Time elapsed: 0.001 sec  <<< ERROR!
java.lang.NegativeArraySizeException
	at java.lang.AbstractStringBuilder.<init>(AbstractStringBuilder.java:64)
	at java.lang.StringBuffer.<init>(StringBuffer.java:108)
	at org.joda.time.format.PeriodFormatter.print(PeriodFormatter.java:244)
	at org.joda.time.format.TestPeriodFormat.test_wordBased_pl_formatStandard(TestPeriodFormat.java:380)

test_wordBased_pl_FormatOneField(org.joda.time.format.TestPeriodFormat)  Time elapsed: 0 sec  <<< ERROR!
java.lang.NegativeArraySizeException
	at java.lang.AbstractStringBuilder.<init>(AbstractStringBuilder.java:64)
	at java.lang.StringBuffer.<init>(StringBuffer.java:108)
	at org.joda.time.format.PeriodFormatter.print(PeriodFormatter.java:244)
	at org.joda.time.format.TestPeriodFormat.test_wordBased_pl_FormatOneField(TestPeriodFormat.java:386)

test_getDefault_formatStandard(org.joda.time.format.TestPeriodFormat)  Time elapsed: 0 sec  <<< ERROR!
java.lang.NegativeArraySizeException
	at java.lang.AbstractStringBuilder.<init>(AbstractStringBuilder.java:64)
	at java.lang.StringBuffer.<init>(StringBuffer.java:108)
	at org.joda.time.format.PeriodFormatter.print(PeriodFormatter.java:244)
	at org.joda.time.format.TestPeriodFormat.test_getDefault_formatStandard(TestPeriodFormat.java:79)

test_getDefault_FormatOneField(org.joda.time.format.TestPeriodFormat)  Time elapsed: 0.001 sec  <<< ERROR!
java.lang.NegativeArraySizeException
	at java.lang.AbstractStringBuilder.<init>(AbstractStringBuilder.java:64)
	at java.lang.StringBuffer.<init>(StringBuffer.java:108)
	at org.joda.time.format.PeriodFormatter.print(PeriodFormatter.java:244)
	at org.joda.time.format.TestPeriodFormat.test_getDefault_FormatOneField(TestPeriodFormat.java:85)

test_getDefault_formatTwoFields(org.joda.time.format.TestPeriodFormat)  Time elapsed: 0 sec  <<< ERROR!
java.lang.NegativeArraySizeException
	at java.lang.AbstractStringBuilder.<init>(AbstractStringBuilder.java:64)
	at java.lang.StringBuffer.<init>(StringBuffer.java:108)
	at org.joda.time.format.PeriodFormatter.print(PeriodFormatter.java:244)
	at org.joda.time.format.TestPeriodFormat.test_getDefault_formatTwoFields(TestPeriodFormat.java:91)

testFormatStandard(org.joda.time.format.TestISOPeriodFormat)  Time elapsed: 0 sec  <<< ERROR!
java.lang.NegativeArraySizeException
	at java.lang.AbstractStringBuilder.<init>(AbstractStringBuilder.java:64)
	at java.lang.StringBuffer.<init>(StringBuffer.java:108)
	at org.joda.time.format.PeriodFormatter.print(PeriodFormatter.java:244)
	at org.joda.time.format.TestISOPeriodFormat.testFormatStandard(TestISOPeriodFormat.java:112)

testFormatStandard_negative(org.joda.time.format.TestISOPeriodFormat)  Time elapsed: 0.003 sec  <<< ERROR!
java.lang.NegativeArraySizeException
	at java.lang.AbstractStringBuilder.<init>(AbstractStringBuilder.java:64)
	at java.lang.StringBuffer.<init>(StringBuffer.java:108)
	at org.joda.time.format.PeriodFormatter.print(PeriodFormatter.java:244)
	at org.joda.time.format.TestISOPeriodFormat.testFormatStandard_negative(TestISOPeriodFormat.java:126)

testParseNegativeMillis1(org.joda.time.format.TestPeriodFormatParsing)  Time elapsed: 0 sec  <<< ERROR!
java.lang.NegativeArraySizeException
	at java.lang.AbstractStringBuilder.<init>(AbstractStringBuilder.java:64)
	at java.lang.StringBuffer.<init>(StringBuffer.java:108)
	at org.joda.time.format.PeriodFormatter.print(PeriodFormatter.java:244)
	at org.joda.time.base.AbstractPeriod.toString(AbstractPeriod.java:228)
	at org.joda.time.format.TestPeriodFormatParsing.testParseNegativeMillis1(TestPeriodFormatParsing.java:100)

testParseNegativeMillis2(org.joda.time.format.TestPeriodFormatParsing)  Time elapsed: 0 sec  <<< ERROR!
java.lang.NegativeArraySizeException
	at java.lang.AbstractStringBuilder.<init>(AbstractStringBuilder.java:64)
	at java.lang.StringBuffer.<init>(StringBuffer.java:108)
	at org.joda.time.format.PeriodFormatter.print(PeriodFormatter.java:244)
	at org.joda.time.base.AbstractPeriod.toString(AbstractPeriod.java:228)
	at org.joda.time.format.TestPeriodFormatParsing.testParseNegativeMillis2(TestPeriodFormatParsing.java:108)

testFormatPrefixSimple5IgnoringPrefix(org.joda.time.format.TestPeriodFormatterBuilder)  Time elapsed: 0 sec  <<< ERROR!
java.lang.NegativeArraySizeException
	at java.lang.AbstractStringBuilder.<init>(AbstractStringBuilder.java:64)
	at java.lang.StringBuffer.<init>(StringBuffer.java:108)
	at org.joda.time.format.PeriodFormatter.print(PeriodFormatter.java:244)
	at org.joda.time.base.AbstractPeriod.toString(AbstractPeriod.java:243)
	at org.joda.time.format.TestPeriodFormatterBuilder.testFormatPrefixSimple5IgnoringPrefix(TestPeriodFormatterBuilder.java:561)

testFormatPrefixSimple6IgnoringPrefix(org.joda.time.format.TestPeriodFormatterBuilder)  Time elapsed: 0.001 sec  <<< ERROR!
java.lang.NegativeArraySizeException
	at java.lang.AbstractStringBuilder.<init>(AbstractStringBuilder.java:64)
	at java.lang.StringBuffer.<init>(StringBuffer.java:108)
	at org.joda.time.format.PeriodFormatter.print(PeriodFormatter.java:244)
	at org.joda.time.base.AbstractPeriod.toString(AbstractPeriod.java:243)
	at org.joda.time.format.TestPeriodFormatterBuilder.testFormatPrefixSimple6IgnoringPrefix(TestPeriodFormatterBuilder.java:572)

testFormatSuffixPlural4IgnoringPrefix(org.joda.time.format.TestPeriodFormatterBuilder)  Time elapsed: 0.001 sec  <<< ERROR!
java.lang.NegativeArraySizeException
	at java.lang.AbstractStringBuilder.<init>(AbstractStringBuilder.java:64)
	at java.lang.StringBuffer.<init>(StringBuffer.java:108)
	at org.joda.time.format.PeriodFormatter.print(PeriodFormatter.java:244)
	at org.joda.time.base.AbstractPeriod.toString(AbstractPeriod.java:243)
	at org.joda.time.format.TestPeriodFormatterBuilder.testFormatSuffixPlural4IgnoringPrefix(TestPeriodFormatterBuilder.java:629)

testFormatSuffixRegEx5IgnoringAffix(org.joda.time.format.TestPeriodFormatterBuilder)  Time elapsed: 0 sec  <<< ERROR!
java.lang.NegativeArraySizeException
	at java.lang.AbstractStringBuilder.<init>(AbstractStringBuilder.java:64)
	at java.lang.StringBuffer.<init>(StringBuffer.java:108)
	at org.joda.time.format.PeriodFormatter.print(PeriodFormatter.java:244)
	at org.joda.time.base.AbstractPeriod.toString(AbstractPeriod.java:243)
	at org.joda.time.format.TestPeriodFormatterBuilder.testFormatSuffixRegEx5IgnoringAffix(TestPeriodFormatterBuilder.java:721)

testFormatSuffixComposite5IgnoringAffix(org.joda.time.format.TestPeriodFormatterBuilder)  Time elapsed: 0.001 sec  <<< ERROR!
java.lang.NegativeArraySizeException
	at java.lang.AbstractStringBuilder.<init>(AbstractStringBuilder.java:64)
	at java.lang.StringBuffer.<init>(StringBuffer.java:108)
	at org.joda.time.format.PeriodFormatter.print(PeriodFormatter.java:244)
	at org.joda.time.base.AbstractPeriod.toString(AbstractPeriod.java:243)
	at org.joda.time.format.TestPeriodFormatterBuilder.testFormatSuffixComposite5IgnoringAffix(TestPeriodFormatterBuilder.java:755)

testFormatSeparatorSimple(org.joda.time.format.TestPeriodFormatterBuilder)  Time elapsed: 0 sec  <<< FAILURE!
junit.framework.AssertionFailedError: expected:<3> but was:<1>
	at junit.framework.Assert.fail(Assert.java:47)
	at junit.framework.Assert.failNotEquals(Assert.java:280)
	at junit.framework.Assert.assertEquals(Assert.java:64)
	at junit.framework.Assert.assertEquals(Assert.java:198)
	at junit.framework.Assert.assertEquals(Assert.java:204)
	at org.joda.time.format.TestPeriodFormatterBuilder.testFormatSeparatorSimple(TestPeriodFormatterBuilder.java:780)

testFormatSeparatorComplex(org.joda.time.format.TestPeriodFormatterBuilder)  Time elapsed: 0 sec  <<< ERROR!
java.lang.NegativeArraySizeException
	at java.lang.AbstractStringBuilder.<init>(AbstractStringBuilder.java:64)
	at java.lang.StringBuffer.<init>(StringBuffer.java:108)
	at org.joda.time.format.PeriodFormatter.print(PeriodFormatter.java:244)
	at org.joda.time.format.TestPeriodFormatterBuilder.testFormatSeparatorComplex(TestPeriodFormatterBuilder.java:798)

testFormatSeparatorIfFieldsAfter(org.joda.time.format.TestPeriodFormatterBuilder)  Time elapsed: 0.001 sec  <<< FAILURE!
junit.framework.AssertionFailedError: expected:<3> but was:<1>
	at junit.framework.Assert.fail(Assert.java:47)
	at junit.framework.Assert.failNotEquals(Assert.java:280)
	at junit.framework.Assert.assertEquals(Assert.java:64)
	at junit.framework.Assert.assertEquals(Assert.java:198)
	at junit.framework.Assert.assertEquals(Assert.java:204)
	at org.joda.time.format.TestPeriodFormatterBuilder.testFormatSeparatorIfFieldsAfter(TestPeriodFormatterBuilder.java:814)

testFormatSeparatorIfFieldsBefore(org.joda.time.format.TestPeriodFormatterBuilder)  Time elapsed: 0 sec  <<< FAILURE!
junit.framework.AssertionFailedError: expected:<3> but was:<1>
	at junit.framework.Assert.fail(Assert.java:47)
	at junit.framework.Assert.failNotEquals(Assert.java:280)
	at junit.framework.Assert.assertEquals(Assert.java:64)
	at junit.framework.Assert.assertEquals(Assert.java:198)
	at junit.framework.Assert.assertEquals(Assert.java:204)
	at org.joda.time.format.TestPeriodFormatterBuilder.testFormatSeparatorIfFieldsBefore(TestPeriodFormatterBuilder.java:829)

testMonthsAndMinutesAreConsideredSeparateAndCaseIsNotIgnored(org.joda.time.format.TestPeriodFormatterBuilder)  Time elapsed: 0.002 sec  <<< ERROR!
java.lang.NegativeArraySizeException
	at java.lang.AbstractStringBuilder.<init>(AbstractStringBuilder.java:64)
	at java.lang.StringBuffer.<init>(StringBuffer.java:108)
	at org.joda.time.format.PeriodFormatter.print(PeriodFormatter.java:244)
	at org.joda.time.base.AbstractPeriod.toString(AbstractPeriod.java:243)
	at org.joda.time.format.TestPeriodFormatterBuilder.testMonthsAndMinutesAreConsideredSeparateAndCaseIsNotIgnored(TestPeriodFormatterBuilder.java:1181)

testFormatPrefixSimple4IgnoringPrefix(org.joda.time.format.TestPeriodFormatterBuilder)  Time elapsed: 0.001 sec  <<< ERROR!
java.lang.NegativeArraySizeException
	at java.lang.AbstractStringBuilder.<init>(AbstractStringBuilder.java:64)
	at java.lang.StringBuffer.<init>(StringBuffer.java:108)
	at org.joda.time.format.PeriodFormatter.print(PeriodFormatter.java:244)
	at org.joda.time.base.AbstractPeriod.toString(AbstractPeriod.java:243)
	at org.joda.time.format.TestPeriodFormatterBuilder.testFormatPrefixSimple4IgnoringPrefix(TestPeriodFormatterBuilder.java:346)

testFormatPrefixPlural4IgnoringPrefix(org.joda.time.format.TestPeriodFormatterBuilder)  Time elapsed: 0 sec  <<< ERROR!
java.lang.NegativeArraySizeException
	at java.lang.AbstractStringBuilder.<init>(AbstractStringBuilder.java:64)
	at java.lang.StringBuffer.<init>(StringBuffer.java:108)
	at org.joda.time.format.PeriodFormatter.print(PeriodFormatter.java:244)
	at org.joda.time.base.AbstractPeriod.toString(AbstractPeriod.java:243)
	at org.joda.time.format.TestPeriodFormatterBuilder.testFormatPrefixPlural4IgnoringPrefix(TestPeriodFormatterBuilder.java:405)

testFormatPrefixRegEx4IgnoringPrefix(org.joda.time.format.TestPeriodFormatterBuilder)  Time elapsed: 0 sec  <<< ERROR!
java.lang.NegativeArraySizeException
	at java.lang.AbstractStringBuilder.<init>(AbstractStringBuilder.java:64)
	at java.lang.StringBuffer.<init>(StringBuffer.java:108)
	at org.joda.time.format.PeriodFormatter.print(PeriodFormatter.java:244)
	at org.joda.time.base.AbstractPeriod.toString(AbstractPeriod.java:243)
	at org.joda.time.format.TestPeriodFormatterBuilder.testFormatPrefixRegEx4IgnoringPrefix(TestPeriodFormatterBuilder.java:490)


Results :

Failed tests: 
  org.joda.time.format.TestPeriodFormatterBuilder#testFormatSeparatorIfFieldsAfter AssertionFailedError
  org.joda.time.format.TestPeriodFormatterBuilder#testFormatSeparatorIfFieldsBefore AssertionFailedError
  org.joda.time.format.TestPeriodFormatterBuilder#testFormatSeparatorSimple AssertionFailedError
Tests in error: 
  org.joda.time.TestMutablePeriod_Basics#testToString NegativeArraySizeException
  org.joda.time.TestPeriod_Basics#testToString NegativeArraySizeException
  org.joda.time.TestPeriod_Basics#testToString_PeriodFormatter NegativeArraySizeException
  org.joda.time.format.TestISOPeriodFormat#testFormatStandard NegativeArraySizeException
  org.joda.time.format.TestISOPeriodFormat#testFormatStandard_negative NegativeArraySizeException
  org.joda.time.format.TestPeriodFormat#test_getDefault_FormatOneField NegativeArraySizeException
  org.joda.time.format.TestPeriodFormat#test_getDefault_formatStandard NegativeArraySizeException
  org.joda.time.format.TestPeriodFormat#test_getDefault_formatTwoFields NegativeArraySizeException
  org.joda.time.format.TestPeriodFormat#test_wordBased_da_formatMultiple NegativeArraySizeException
  org.joda.time.format.TestPeriodFormat#test_wordBased_da_formatSinglular NegativeArraySizeException
  org.joda.time.format.TestPeriodFormat#test_wordBased_de_FormatOneField NegativeArraySizeException
  org.joda.time.format.TestPeriodFormat#test_wordBased_de_formatStandard NegativeArraySizeException
  org.joda.time.format.TestPeriodFormat#test_wordBased_de_formatTwoFields NegativeArraySizeException
  org.joda.time.format.TestPeriodFormat#test_wordBased_default NegativeArraySizeException
  org.joda.time.format.TestPeriodFormat#test_wordBased_en_from_de NegativeArraySizeException
  org.joda.time.format.TestPeriodFormat#test_wordBased_en_from_nl NegativeArraySizeException
  org.joda.time.format.TestPeriodFormat#test_wordBased_en_from_pl NegativeArraySizeException
  org.joda.time.format.TestPeriodFormat#test_wordBased_en_withLocale_pt NegativeArraySizeException
  org.joda.time.format.TestPeriodFormat#test_wordBased_es_FormatOneField NegativeArraySizeException
  org.joda.time.format.TestPeriodFormat#test_wordBased_es_formatStandard NegativeArraySizeException
  org.joda.time.format.TestPeriodFormat#test_wordBased_es_formatTwoFields NegativeArraySizeException
  org.joda.time.format.TestPeriodFormat#test_wordBased_fr_FormatOneField NegativeArraySizeException
  org.joda.time.format.TestPeriodFormat#test_wordBased_fr_formatStandard NegativeArraySizeException
  org.joda.time.format.TestPeriodFormat#test_wordBased_fr_formatTwoFields NegativeArraySizeException
  org.joda.time.format.TestPeriodFormat#test_wordBased_fr_from_de NegativeArraySizeException
  org.joda.time.format.TestPeriodFormat#test_wordBased_fr_from_nl NegativeArraySizeException
  org.joda.time.format.TestPeriodFormat#test_wordBased_ja_formatMultiple NegativeArraySizeException
  org.joda.time.format.TestPeriodFormat#test_wordBased_ja_formatSingular NegativeArraySizeException
  org.joda.time.format.TestPeriodFormat#test_wordBased_nl_FormatOneField NegativeArraySizeException
  org.joda.time.format.TestPeriodFormat#test_wordBased_nl_formatStandard NegativeArraySizeException
  org.joda.time.format.TestPeriodFormat#test_wordBased_nl_formatTwoFields NegativeArraySizeException
  org.joda.time.format.TestPeriodFormat#test_wordBased_pl_FormatOneField NegativeArraySizeException
  org.joda.time.format.TestPeriodFormat#test_wordBased_pl_formatStandard NegativeArraySizeException
  org.joda.time.format.TestPeriodFormat#test_wordBased_pl_from_fr NegativeArraySizeException
  org.joda.time.format.TestPeriodFormat#test_wordBased_pl_regEx NegativeArraySizeException
  org.joda.time.format.TestPeriodFormat#test_wordBased_pt_FormatOneField NegativeArraySizeException
  org.joda.time.format.TestPeriodFormat#test_wordBased_pt_formatStandard NegativeArraySizeException
  org.joda.time.format.TestPeriodFormat#test_wordBased_pt_formatTwoFields NegativeArraySizeException
  org.joda.time.format.TestPeriodFormatParsing#testParseNegativeMillis1 NegativeArraySizeException
  org.joda.time.format.TestPeriodFormatParsing#testParseNegativeMillis2 NegativeArraySizeException
  org.joda.time.format.TestPeriodFormatterBuilder#testFormatPrefixPlural4IgnoringPrefix NegativeArraySizeException
  org.joda.time.format.TestPeriodFormatterBuilder#testFormatPrefixRegEx4IgnoringPrefix NegativeArraySizeException
  org.joda.time.format.TestPeriodFormatterBuilder#testFormatPrefixSimple4IgnoringPrefix NegativeArraySizeException
  org.joda.time.format.TestPeriodFormatterBuilder#testFormatPrefixSimple5IgnoringPrefix NegativeArraySizeException
  org.joda.time.format.TestPeriodFormatterBuilder#testFormatPrefixSimple6IgnoringPrefix NegativeArraySizeException
  org.joda.time.format.TestPeriodFormatterBuilder#testFormatSeparatorComplex NegativeArraySizeException
  org.joda.time.format.TestPeriodFormatterBuilder#testFormatSuffixComposite5IgnoringAffix NegativeArraySizeException
  org.joda.time.format.TestPeriodFormatterBuilder#testFormatSuffixPlural4IgnoringPrefix NegativeArraySizeException
  org.joda.time.format.TestPeriodFormatterBuilder#testFormatSuffixRegEx5IgnoringAffix NegativeArraySizeException
  org.joda.time.format.TestPeriodFormatterBuilder#testMonthsAndMinutesAreConsideredSeparateAndCaseIsNotIgnored NegativeArraySizeException

Tests run: 4157, Failures: 3, Errors: 50, Skipped: 0

[INFO] ------------------------------------------------------------------------
[INFO] BUILD FAILURE
[INFO] ------------------------------------------------------------------------
[INFO] Total time: 15.698s
[INFO] Finished at: Thu Aug 06 10:03:16 BST 2015
[INFO] Final Memory: 8M/215M
[INFO] ------------------------------------------------------------------------
[ERROR] Failed to execute goal org.apache.maven.plugins:maven-surefire-plugin:2.18.1:test (default-test) on project joda-time: There are test failures.
[ERROR] 
[ERROR] Please refer to /home/perham/Study/LittleDarwin/Cases/joda-time-2.8.1/target/surefire-reports for the individual test results.
[ERROR] -> [Help 1]
[ERROR] 
[ERROR] To see the full stack trace of the errors, re-run Maven with the -e switch.
[ERROR] Re-run Maven using the -X switch to enable full debug logging.
[ERROR] 
[ERROR] For more information about the errors and possible solutions, please read the following articles:
[ERROR] [Help 1] http://cwiki.apache.org/confluence/display/MAVEN/MojoFailureException
