[INFO] Scanning for projects...
[INFO]                                                                         
[INFO] ------------------------------------------------------------------------
[INFO] Building Joda-Time 2.8.1
[INFO] ------------------------------------------------------------------------
[INFO] 
[INFO] --- maven-resources-plugin:2.7:resources (default-resources) @ joda-time ---
[INFO] Using 'UTF-8' encoding to copy filtered resources.
[INFO] Copying 2 resources to META-INF
[INFO] Copying 10 resources
[INFO] 
[INFO] --- maven-compiler-plugin:3.3:compile (default-compile) @ joda-time ---
[INFO] Changes detected - recompiling the module!
[INFO] Compiling 166 source files to /home/perham/Study/LittleDarwin/Cases/joda-time-2.8.1/target/classes
[INFO] 
[INFO] --- exec-maven-plugin:1.4.0:java (compile-tzdb) @ joda-time ---
Writing zoneinfo files
Writing ZoneInfoMap
[INFO] 
[INFO] --- maven-resources-plugin:2.7:testResources (default-testResources) @ joda-time ---
[INFO] Using 'UTF-8' encoding to copy filtered resources.
[INFO] Copying 34 resources
[INFO] 
[INFO] --- maven-compiler-plugin:3.3:testCompile (default-testCompile) @ joda-time ---
[INFO] Nothing to compile - all classes are up to date
[INFO] 
[INFO] --- maven-surefire-plugin:2.18.1:test (default-test) @ joda-time ---
[INFO] Surefire report directory: /home/perham/Study/LittleDarwin/Cases/joda-time-2.8.1/target/surefire-reports

-------------------------------------------------------
 T E S T S
-------------------------------------------------------
Running org.joda.time.TestAllPackages

TestBuddhistChronology.testCalendar

TestCopticChronology.testCalendar

TestEthiopicChronology.testCalendar

TestIslamicChronology.testCalendar

Testing Gregorian chronology over 1000 iterations
100% complete (i=1000)

Testing Julian chronology over 1000 iterations
100% complete (i=1000)
Writing zoneinfo files
Writing ZoneInfoMap
Tests run: 4157, Failures: 101, Errors: 2, Skipped: 0, Time elapsed: 5.386 sec <<< FAILURE! - in org.joda.time.TestAllPackages
testToString(org.joda.time.TestPeriod_Basics)  Time elapsed: 0.006 sec  <<< FAILURE!
junit.framework.ComparisonFailure: expected:<P1[Y2M3W4DT5H6M7.008]S> but was:<P1[.001Y2.002M3.003W4.004DT5.005H6.006M7]S>
	at junit.framework.Assert.assertEquals(Assert.java:81)
	at junit.framework.Assert.assertEquals(Assert.java:87)
	at org.joda.time.TestPeriod_Basics.testToString(TestPeriod_Basics.java:472)

testToString_PeriodFormatter(org.joda.time.TestPeriod_Basics)  Time elapsed: 0.006 sec  <<< FAILURE!
junit.framework.ComparisonFailure: expected:<1[ year, 2 months, 3 weeks, 4 days, 5 hours, 6 minutes, 7 seconds and ]8 milliseconds> but was:<1[.001 year, 2.002 months, 3.003 weeks, 4.004 days, 5.005 hours, 6.006 minutes, 7.007 seconds and 8.00]8 milliseconds>
	at junit.framework.Assert.assertEquals(Assert.java:81)
	at junit.framework.Assert.assertEquals(Assert.java:87)
	at org.joda.time.TestPeriod_Basics.testToString_PeriodFormatter(TestPeriod_Basics.java:484)

testToString_nullPeriodFormatter(org.joda.time.TestPeriod_Basics)  Time elapsed: 0.001 sec  <<< FAILURE!
junit.framework.ComparisonFailure: expected:<P1[Y2M3W4DT5H6M7.008]S> but was:<P1[.001Y2.002M3.003W4.004DT5.005H6.006M7]S>
	at junit.framework.Assert.assertEquals(Assert.java:81)
	at junit.framework.Assert.assertEquals(Assert.java:87)
	at org.joda.time.TestPeriod_Basics.testToString_nullPeriodFormatter(TestPeriod_Basics.java:492)

testToString(org.joda.time.TestMutablePeriod_Basics)  Time elapsed: 0.001 sec  <<< FAILURE!
junit.framework.ComparisonFailure: expected:<P1[Y2M3W4DT5H6M7.008]S> but was:<P1[.001Y2.002M3.003W4.004DT5.005H6.006M7]S>
	at junit.framework.Assert.assertEquals(Assert.java:81)
	at junit.framework.Assert.assertEquals(Assert.java:87)
	at org.joda.time.TestMutablePeriod_Basics.testToString(TestMutablePeriod_Basics.java:405)

testPeriod(org.joda.time.TestDateTimeZoneCutover)  Time elapsed: 0.001 sec  <<< FAILURE!
junit.framework.ComparisonFailure: expected:<PT1[]M> but was:<PT1[.001]M>
	at junit.framework.Assert.assertEquals(Assert.java:81)
	at junit.framework.Assert.assertEquals(Assert.java:87)
	at org.joda.time.TestDateTimeZoneCutover.testPeriod(TestDateTimeZoneCutover.java:1250)

testPeriod(org.joda.time.TestStringConvert)  Time elapsed: 0.002 sec  <<< FAILURE!
junit.framework.ComparisonFailure: expected:<P1[Y2M3W4DT5H6M7.008]S> but was:<P1[.001Y2.002M3.003W4.004DT5.005H6.006M7]S>
	at junit.framework.Assert.assertEquals(Assert.java:81)
	at junit.framework.Assert.assertEquals(Assert.java:87)
	at org.joda.time.TestStringConvert.testPeriod(TestStringConvert.java:143)

testMutablePeriod(org.joda.time.TestStringConvert)  Time elapsed: 0.001 sec  <<< FAILURE!
junit.framework.ComparisonFailure: expected:<P1[Y2M3W4DT5H6M7.008]S> but was:<P1[.001Y2.002M3.003W4.004DT5.005H6.006M7]S>
	at junit.framework.Assert.assertEquals(Assert.java:81)
	at junit.framework.Assert.assertEquals(Assert.java:87)
	at org.joda.time.TestStringConvert.testMutablePeriod(TestStringConvert.java:150)

testPrint_bufferMethods(org.joda.time.format.TestPeriodFormatter)  Time elapsed: 0.001 sec  <<< FAILURE!
junit.framework.ComparisonFailure: expected:<P1[Y2M3W4DT5H6M7.008]S> but was:<P1[.001Y2.002M3.003W4.004DT5.005H6.006M7]S>
	at junit.framework.Assert.assertEquals(Assert.java:81)
	at junit.framework.Assert.assertEquals(Assert.java:87)
	at org.joda.time.format.TestPeriodFormatter.testPrint_bufferMethods(TestPeriodFormatter.java:109)

testPrint_simple(org.joda.time.format.TestPeriodFormatter)  Time elapsed: 0.001 sec  <<< FAILURE!
junit.framework.ComparisonFailure: expected:<P1[Y2M3W4DT5H6M7.008]S> but was:<P1[.001Y2.002M3.003W4.004DT5.005H6.006M7]S>
	at junit.framework.Assert.assertEquals(Assert.java:81)
	at junit.framework.Assert.assertEquals(Assert.java:87)
	at org.joda.time.format.TestPeriodFormatter.testPrint_simple(TestPeriodFormatter.java:101)

test_wordBased_pl_formatTwoFields(org.joda.time.format.TestPeriodFormat)  Time elapsed: 0.007 sec  <<< FAILURE!
junit.framework.ComparisonFailure: expected:<2[ dni i ]5 godzin> but was:<2[.002 dni i 5.00]5 godzin>
	at junit.framework.Assert.assertEquals(Assert.java:81)
	at junit.framework.Assert.assertEquals(Assert.java:87)
	at org.joda.time.format.TestPeriodFormat.test_wordBased_pl_formatTwoFields(TestPeriodFormat.java:392)

test_wordBased_pl_regEx(org.joda.time.format.TestPeriodFormat)  Time elapsed: 0.001 sec  <<< FAILURE!
junit.framework.ComparisonFailure: expected:<1[] rok> but was:<1[.001] rok>
	at junit.framework.Assert.assertEquals(Assert.java:81)
	at junit.framework.Assert.assertEquals(Assert.java:87)
	at org.joda.time.format.TestPeriodFormat.test_wordBased_pl_regEx(TestPeriodFormat.java:425)

test_wordBased_fr_from_de(org.joda.time.format.TestPeriodFormat)  Time elapsed: 0.002 sec  <<< FAILURE!
junit.framework.ComparisonFailure: expected:<1[ jour, 5 heures, 6 minutes, 7 secondes et ]8 millisecondes> but was:<1[.001 jour, 5.005 heures, 6.006 minutes, 7.007 secondes et 8.00]8 millisecondes>
	at junit.framework.Assert.assertEquals(Assert.java:81)
	at junit.framework.Assert.assertEquals(Assert.java:87)
	at org.joda.time.format.TestPeriodFormat.test_wordBased_fr_from_de(TestPeriodFormat.java:580)

test_wordBased_fr_from_nl(org.joda.time.format.TestPeriodFormat)  Time elapsed: 0.001 sec  <<< FAILURE!
junit.framework.ComparisonFailure: expected:<1[ jour, 5 heures, 6 minutes, 7 secondes et ]8 millisecondes> but was:<1[.001 jour, 5.005 heures, 6.006 minutes, 7.007 secondes et 8.00]8 millisecondes>
	at junit.framework.Assert.assertEquals(Assert.java:81)
	at junit.framework.Assert.assertEquals(Assert.java:87)
	at org.joda.time.format.TestPeriodFormat.test_wordBased_fr_from_nl(TestPeriodFormat.java:586)

test_wordBased_en_from_de(org.joda.time.format.TestPeriodFormat)  Time elapsed: 0 sec  <<< FAILURE!
junit.framework.ComparisonFailure: expected:<1[ day, 5 hours, 6 minutes, 7 seconds and ]8 milliseconds> but was:<1[.001 day, 5.005 hours, 6.006 minutes, 7.007 seconds and 8.00]8 milliseconds>
	at junit.framework.Assert.assertEquals(Assert.java:81)
	at junit.framework.Assert.assertEquals(Assert.java:87)
	at org.joda.time.format.TestPeriodFormat.test_wordBased_en_from_de(TestPeriodFormat.java:592)

test_wordBased_en_from_nl(org.joda.time.format.TestPeriodFormat)  Time elapsed: 0.001 sec  <<< FAILURE!
junit.framework.ComparisonFailure: expected:<1[ day, 5 hours, 6 minutes, 7 seconds and ]8 milliseconds> but was:<1[.001 day, 5.005 hours, 6.006 minutes, 7.007 seconds and 8.00]8 milliseconds>
	at junit.framework.Assert.assertEquals(Assert.java:81)
	at junit.framework.Assert.assertEquals(Assert.java:87)
	at org.joda.time.format.TestPeriodFormat.test_wordBased_en_from_nl(TestPeriodFormat.java:598)

test_wordBased_en_from_pl(org.joda.time.format.TestPeriodFormat)  Time elapsed: 0.001 sec  <<< FAILURE!
junit.framework.ComparisonFailure: expected:<1[ day, 5 hours, 6 minutes, 7 seconds and ]8 milliseconds> but was:<1[.001 day, 5.005 hours, 6.006 minutes, 7.007 seconds and 8.00]8 milliseconds>
	at junit.framework.Assert.assertEquals(Assert.java:81)
	at junit.framework.Assert.assertEquals(Assert.java:87)
	at org.joda.time.format.TestPeriodFormat.test_wordBased_en_from_pl(TestPeriodFormat.java:604)

test_wordBased_pl_from_fr(org.joda.time.format.TestPeriodFormat)  Time elapsed: 0.001 sec  <<< FAILURE!
junit.framework.ComparisonFailure: expected:<1[ dzień, 5 godzin, 6 minut, 7 sekund i ]8 milisekund> but was:<1[.001 dzień, 5.005 godzin, 6.006 minut, 7.007 sekund i 8.00]8 milisekund>
	at junit.framework.Assert.assertEquals(Assert.java:81)
	at junit.framework.Assert.assertEquals(Assert.java:87)
	at org.joda.time.format.TestPeriodFormat.test_wordBased_pl_from_fr(TestPeriodFormat.java:610)

test_wordBased_en_withLocale_pt(org.joda.time.format.TestPeriodFormat)  Time elapsed: 0.001 sec  <<< FAILURE!
junit.framework.ComparisonFailure: expected:<2[ days and ]5 hours> but was:<2[.002 days and 5.00]5 hours>
	at junit.framework.Assert.assertEquals(Assert.java:81)
	at junit.framework.Assert.assertEquals(Assert.java:87)
	at org.joda.time.format.TestPeriodFormat.test_wordBased_en_withLocale_pt(TestPeriodFormat.java:633)

test_wordBased_es_formatStandard(org.joda.time.format.TestPeriodFormat)  Time elapsed: 0.002 sec  <<< FAILURE!
junit.framework.ComparisonFailure: expected:<1[ día, 5 horas, 6 minutos, 7 segundos y ]8 milisegundos> but was:<1[.001 día, 5.005 horas, 6.006 minutos, 7.007 segundos y 8.00]8 milisegundos>
	at junit.framework.Assert.assertEquals(Assert.java:81)
	at junit.framework.Assert.assertEquals(Assert.java:87)
	at org.joda.time.format.TestPeriodFormat.test_wordBased_es_formatStandard(TestPeriodFormat.java:208)

test_wordBased_es_FormatOneField(org.joda.time.format.TestPeriodFormat)  Time elapsed: 0 sec  <<< FAILURE!
junit.framework.ComparisonFailure: expected:<2[] días> but was:<2[.002] días>
	at junit.framework.Assert.assertEquals(Assert.java:81)
	at junit.framework.Assert.assertEquals(Assert.java:87)
	at org.joda.time.format.TestPeriodFormat.test_wordBased_es_FormatOneField(TestPeriodFormat.java:214)

test_wordBased_es_formatTwoFields(org.joda.time.format.TestPeriodFormat)  Time elapsed: 0.001 sec  <<< FAILURE!
junit.framework.ComparisonFailure: expected:<2[ días y ]5 horas> but was:<2[.002 días y 5.00]5 horas>
	at junit.framework.Assert.assertEquals(Assert.java:81)
	at junit.framework.Assert.assertEquals(Assert.java:87)
	at org.joda.time.format.TestPeriodFormat.test_wordBased_es_formatTwoFields(TestPeriodFormat.java:220)

test_wordBased_de_formatStandard(org.joda.time.format.TestPeriodFormat)  Time elapsed: 0 sec  <<< FAILURE!
junit.framework.ComparisonFailure: expected:<1[ Tag, 5 Stunden, 6 Minuten, 7 Sekunden und ]8 Millisekunden> but was:<1[.001 Tag, 5.005 Stunden, 6.006 Minuten, 7.007 Sekunden und 8.00]8 Millisekunden>
	at junit.framework.Assert.assertEquals(Assert.java:81)
	at junit.framework.Assert.assertEquals(Assert.java:87)
	at org.joda.time.format.TestPeriodFormat.test_wordBased_de_formatStandard(TestPeriodFormat.java:245)

test_wordBased_de_FormatOneField(org.joda.time.format.TestPeriodFormat)  Time elapsed: 0.001 sec  <<< FAILURE!
junit.framework.ComparisonFailure: expected:<2[] Tage> but was:<2[.002] Tage>
	at junit.framework.Assert.assertEquals(Assert.java:81)
	at junit.framework.Assert.assertEquals(Assert.java:87)
	at org.joda.time.format.TestPeriodFormat.test_wordBased_de_FormatOneField(TestPeriodFormat.java:251)

test_wordBased_de_formatTwoFields(org.joda.time.format.TestPeriodFormat)  Time elapsed: 0 sec  <<< FAILURE!
junit.framework.ComparisonFailure: expected:<2[ Tage und ]5 Stunden> but was:<2[.002 Tage und 5.00]5 Stunden>
	at junit.framework.Assert.assertEquals(Assert.java:81)
	at junit.framework.Assert.assertEquals(Assert.java:87)
	at org.joda.time.format.TestPeriodFormat.test_wordBased_de_formatTwoFields(TestPeriodFormat.java:257)

test_wordBased_nl_formatStandard(org.joda.time.format.TestPeriodFormat)  Time elapsed: 0.002 sec  <<< FAILURE!
junit.framework.ComparisonFailure: expected:<1[ dag, 5 uur, 6 minuten, 7 seconden en ]8 milliseconden> but was:<1[.001 dag, 5.005 uur, 6.006 minuten, 7.007 seconden en 8.00]8 milliseconden>
	at junit.framework.Assert.assertEquals(Assert.java:81)
	at junit.framework.Assert.assertEquals(Assert.java:87)
	at org.joda.time.format.TestPeriodFormat.test_wordBased_nl_formatStandard(TestPeriodFormat.java:282)

test_wordBased_nl_FormatOneField(org.joda.time.format.TestPeriodFormat)  Time elapsed: 0.001 sec  <<< FAILURE!
junit.framework.ComparisonFailure: expected:<2[] dagen> but was:<2[.002] dagen>
	at junit.framework.Assert.assertEquals(Assert.java:81)
	at junit.framework.Assert.assertEquals(Assert.java:87)
	at org.joda.time.format.TestPeriodFormat.test_wordBased_nl_FormatOneField(TestPeriodFormat.java:288)

test_wordBased_nl_formatTwoFields(org.joda.time.format.TestPeriodFormat)  Time elapsed: 0.001 sec  <<< FAILURE!
junit.framework.ComparisonFailure: expected:<2[ dagen en ]5 uur> but was:<2[.002 dagen en 5.00]5 uur>
	at junit.framework.Assert.assertEquals(Assert.java:81)
	at junit.framework.Assert.assertEquals(Assert.java:87)
	at org.joda.time.format.TestPeriodFormat.test_wordBased_nl_formatTwoFields(TestPeriodFormat.java:294)

test_wordBased_da_formatMultiple(org.joda.time.format.TestPeriodFormat)  Time elapsed: 0.002 sec  <<< FAILURE!
junit.framework.ComparisonFailure: expected:<2[ år, 3 måneder, 4 uger, 2 dage, 5 timer, 6 minutter, 7 sekunder og ]8 millisekunder> but was:<2[.002 år, 3.003 måneder, 4.004 uger, 2.002 dage, 5.005 timer, 6.006 minutter, 7.007 sekunder og 8.00]8 millisekunder>
	at junit.framework.Assert.assertEquals(Assert.java:81)
	at junit.framework.Assert.assertEquals(Assert.java:87)
	at org.joda.time.format.TestPeriodFormat.test_wordBased_da_formatMultiple(TestPeriodFormat.java:319)

test_wordBased_da_formatSinglular(org.joda.time.format.TestPeriodFormat)  Time elapsed: 0 sec  <<< FAILURE!
junit.framework.ComparisonFailure: expected:<1[ år, 1 måned, 1 uge, 1 dag, 1 time, 1 minut, 1 sekund og ]1 millisekund> but was:<1[.001 år, 1.001 måned, 1.001 uge, 1.001 dag, 1.001 time, 1.001 minut, 1.001 sekund og 1.00]1 millisekund>
	at junit.framework.Assert.assertEquals(Assert.java:81)
	at junit.framework.Assert.assertEquals(Assert.java:87)
	at org.joda.time.format.TestPeriodFormat.test_wordBased_da_formatSinglular(TestPeriodFormat.java:325)

test_wordBased_ja_formatMultiple(org.joda.time.format.TestPeriodFormat)  Time elapsed: 0.003 sec  <<< FAILURE!
junit.framework.ComparisonFailure: expected:<2[年3か月4週間2日5時間6分7秒]8ミリ秒> but was:<2[.002年3.003か月4.004週間2.002日5.005時間6.006分7.007秒8.00]8ミリ秒>
	at junit.framework.Assert.assertEquals(Assert.java:81)
	at junit.framework.Assert.assertEquals(Assert.java:87)
	at org.joda.time.format.TestPeriodFormat.test_wordBased_ja_formatMultiple(TestPeriodFormat.java:338)

test_wordBased_ja_formatSingular(org.joda.time.format.TestPeriodFormat)  Time elapsed: 0 sec  <<< FAILURE!
junit.framework.ComparisonFailure: expected:<1[年1か月1週間1日1時間1分1秒]1ミリ秒> but was:<1[.001年1.001か月1.001週間1.001日1.001時間1.001分1.001秒1.00]1ミリ秒>
	at junit.framework.Assert.assertEquals(Assert.java:81)
	at junit.framework.Assert.assertEquals(Assert.java:87)
	at org.joda.time.format.TestPeriodFormat.test_wordBased_ja_formatSingular(TestPeriodFormat.java:344)

test_wordBased_pl_formatStandard(org.joda.time.format.TestPeriodFormat)  Time elapsed: 0.001 sec  <<< FAILURE!
junit.framework.ComparisonFailure: expected:<1[ dzień, 5 godzin, 6 minut, 7 sekund i ]8 milisekund> but was:<1[.001 dzień, 5.005 godzin, 6.006 minut, 7.007 sekund i 8.00]8 milisekund>
	at junit.framework.Assert.assertEquals(Assert.java:81)
	at junit.framework.Assert.assertEquals(Assert.java:87)
	at org.joda.time.format.TestPeriodFormat.test_wordBased_pl_formatStandard(TestPeriodFormat.java:380)

test_wordBased_pl_FormatOneField(org.joda.time.format.TestPeriodFormat)  Time elapsed: 0 sec  <<< FAILURE!
junit.framework.ComparisonFailure: expected:<2[] dni> but was:<2[.002] dni>
	at junit.framework.Assert.assertEquals(Assert.java:81)
	at junit.framework.Assert.assertEquals(Assert.java:87)
	at org.joda.time.format.TestPeriodFormat.test_wordBased_pl_FormatOneField(TestPeriodFormat.java:386)

test_wordBased_default(org.joda.time.format.TestPeriodFormat)  Time elapsed: 0 sec  <<< FAILURE!
junit.framework.ComparisonFailure: expected:<1[ Tag, 5 Stunden, 6 Minuten, 7 Sekunden und ]8 Millisekunden> but was:<1[.001 Tag, 5.005 Stunden, 6.006 Minuten, 7.007 Sekunden und 8.00]8 Millisekunden>
	at junit.framework.Assert.assertEquals(Assert.java:81)
	at junit.framework.Assert.assertEquals(Assert.java:87)
	at org.joda.time.format.TestPeriodFormat.test_wordBased_default(TestPeriodFormat.java:126)

test_wordBased_fr_formatStandard(org.joda.time.format.TestPeriodFormat)  Time elapsed: 0.001 sec  <<< FAILURE!
junit.framework.ComparisonFailure: expected:<1[ jour, 5 heures, 6 minutes, 7 secondes et ]8 millisecondes> but was:<1[.001 jour, 5.005 heures, 6.006 minutes, 7.007 secondes et 8.00]8 millisecondes>
	at junit.framework.Assert.assertEquals(Assert.java:81)
	at junit.framework.Assert.assertEquals(Assert.java:87)
	at org.joda.time.format.TestPeriodFormat.test_wordBased_fr_formatStandard(TestPeriodFormat.java:134)

test_wordBased_fr_FormatOneField(org.joda.time.format.TestPeriodFormat)  Time elapsed: 0.001 sec  <<< FAILURE!
junit.framework.ComparisonFailure: expected:<2[] jours> but was:<2[.002] jours>
	at junit.framework.Assert.assertEquals(Assert.java:81)
	at junit.framework.Assert.assertEquals(Assert.java:87)
	at org.joda.time.format.TestPeriodFormat.test_wordBased_fr_FormatOneField(TestPeriodFormat.java:140)

test_wordBased_fr_formatTwoFields(org.joda.time.format.TestPeriodFormat)  Time elapsed: 0 sec  <<< FAILURE!
junit.framework.ComparisonFailure: expected:<2[ jours et ]5 heures> but was:<2[.002 jours et 5.00]5 heures>
	at junit.framework.Assert.assertEquals(Assert.java:81)
	at junit.framework.Assert.assertEquals(Assert.java:87)
	at org.joda.time.format.TestPeriodFormat.test_wordBased_fr_formatTwoFields(TestPeriodFormat.java:146)

test_wordBased_pt_formatStandard(org.joda.time.format.TestPeriodFormat)  Time elapsed: 0.002 sec  <<< FAILURE!
junit.framework.ComparisonFailure: expected:<1[ dia, 5 horas, 6 minutos, 7 segundos e ]8 milissegundos> but was:<1[.001 dia, 5.005 horas, 6.006 minutos, 7.007 segundos e 8.00]8 milissegundos>
	at junit.framework.Assert.assertEquals(Assert.java:81)
	at junit.framework.Assert.assertEquals(Assert.java:87)
	at org.joda.time.format.TestPeriodFormat.test_wordBased_pt_formatStandard(TestPeriodFormat.java:171)

test_wordBased_pt_FormatOneField(org.joda.time.format.TestPeriodFormat)  Time elapsed: 0 sec  <<< FAILURE!
junit.framework.ComparisonFailure: expected:<2[] dias> but was:<2[.002] dias>
	at junit.framework.Assert.assertEquals(Assert.java:81)
	at junit.framework.Assert.assertEquals(Assert.java:87)
	at org.joda.time.format.TestPeriodFormat.test_wordBased_pt_FormatOneField(TestPeriodFormat.java:177)

test_wordBased_pt_formatTwoFields(org.joda.time.format.TestPeriodFormat)  Time elapsed: 0.001 sec  <<< FAILURE!
junit.framework.ComparisonFailure: expected:<2[ dias e ]5 horas> but was:<2[.002 dias e 5.00]5 horas>
	at junit.framework.Assert.assertEquals(Assert.java:81)
	at junit.framework.Assert.assertEquals(Assert.java:87)
	at org.joda.time.format.TestPeriodFormat.test_wordBased_pt_formatTwoFields(TestPeriodFormat.java:183)

test_getDefault_formatStandard(org.joda.time.format.TestPeriodFormat)  Time elapsed: 0.001 sec  <<< FAILURE!
junit.framework.ComparisonFailure: expected:<1[ day, 5 hours, 6 minutes, 7 seconds and ]8 milliseconds> but was:<1[.001 day, 5.005 hours, 6.006 minutes, 7.007 seconds and 8.00]8 milliseconds>
	at junit.framework.Assert.assertEquals(Assert.java:81)
	at junit.framework.Assert.assertEquals(Assert.java:87)
	at org.joda.time.format.TestPeriodFormat.test_getDefault_formatStandard(TestPeriodFormat.java:79)

test_getDefault_FormatOneField(org.joda.time.format.TestPeriodFormat)  Time elapsed: 0.001 sec  <<< FAILURE!
junit.framework.ComparisonFailure: expected:<2[] days> but was:<2[.002] days>
	at junit.framework.Assert.assertEquals(Assert.java:81)
	at junit.framework.Assert.assertEquals(Assert.java:87)
	at org.joda.time.format.TestPeriodFormat.test_getDefault_FormatOneField(TestPeriodFormat.java:85)

test_getDefault_formatTwoFields(org.joda.time.format.TestPeriodFormat)  Time elapsed: 0 sec  <<< FAILURE!
junit.framework.ComparisonFailure: expected:<2[ days and ]5 hours> but was:<2[.002 days and 5.00]5 hours>
	at junit.framework.Assert.assertEquals(Assert.java:81)
	at junit.framework.Assert.assertEquals(Assert.java:87)
	at org.joda.time.format.TestPeriodFormat.test_getDefault_formatTwoFields(TestPeriodFormat.java:91)

testFormatStandard(org.joda.time.format.TestISOPeriodFormat)  Time elapsed: 0.001 sec  <<< FAILURE!
junit.framework.ComparisonFailure: expected:<P1[Y2M3W4DT5H6M7.008]S> but was:<P1[.001Y2.002M3.003W4.004DT5.005H6.006M7]S>
	at junit.framework.Assert.assertEquals(Assert.java:81)
	at junit.framework.Assert.assertEquals(Assert.java:87)
	at org.joda.time.format.TestISOPeriodFormat.testFormatStandard(TestISOPeriodFormat.java:103)

testFormatStandard_negative(org.joda.time.format.TestISOPeriodFormat)  Time elapsed: 0 sec  <<< FAILURE!
junit.framework.ComparisonFailure: expected:<P-[1Y-2M-3W-4DT-5H-6M-7.008]S> but was:<P-[-1.001Y--2.002M--3.003W--4.004DT--5.005H--6.006M-7]S>
	at junit.framework.Assert.assertEquals(Assert.java:81)
	at junit.framework.Assert.assertEquals(Assert.java:87)
	at org.joda.time.format.TestISOPeriodFormat.testFormatStandard_negative(TestISOPeriodFormat.java:120)

testFormatAlternate(org.joda.time.format.TestISOPeriodFormat)  Time elapsed: 0.001 sec  <<< FAILURE!
junit.framework.ComparisonFailure: expected:<P0001[0204T050607.008]> but was:<P0001[.00102.00204.004T05.00506.00607]>
	at junit.framework.Assert.assertEquals(Assert.java:81)
	at junit.framework.Assert.assertEquals(Assert.java:87)
	at org.joda.time.format.TestISOPeriodFormat.testFormatAlternate(TestISOPeriodFormat.java:141)

testFormatAlternateExtended(org.joda.time.format.TestISOPeriodFormat)  Time elapsed: 0.001 sec  <<< FAILURE!
junit.framework.ComparisonFailure: expected:<P0001[-02-04T05:06:07.008]> but was:<P0001[.001-02.002-04.004T05.005:06.006:07]>
	at junit.framework.Assert.assertEquals(Assert.java:81)
	at junit.framework.Assert.assertEquals(Assert.java:87)
	at org.joda.time.format.TestISOPeriodFormat.testFormatAlternateExtended(TestISOPeriodFormat.java:159)

testFormatAlternateWithWeeks(org.joda.time.format.TestISOPeriodFormat)  Time elapsed: 0 sec  <<< FAILURE!
junit.framework.ComparisonFailure: expected:<P0001[W0304T050607.008]> but was:<P0001[.001W03.00304.004T05.00506.00607]>
	at junit.framework.Assert.assertEquals(Assert.java:81)
	at junit.framework.Assert.assertEquals(Assert.java:87)
	at org.joda.time.format.TestISOPeriodFormat.testFormatAlternateWithWeeks(TestISOPeriodFormat.java:177)

testFormatAlternateExtendedWithWeeks(org.joda.time.format.TestISOPeriodFormat)  Time elapsed: 0.001 sec  <<< FAILURE!
junit.framework.ComparisonFailure: expected:<P0001[-W03-04T05:06:07.008]> but was:<P0001[.001-W03.003-04.004T05.005:06.006:07]>
	at junit.framework.Assert.assertEquals(Assert.java:81)
	at junit.framework.Assert.assertEquals(Assert.java:87)
	at org.joda.time.format.TestISOPeriodFormat.testFormatAlternateExtendedWithWeeks(TestISOPeriodFormat.java:195)

testParseNegativeMillis2(org.joda.time.format.TestPeriodFormatParsing)  Time elapsed: 0 sec  <<< FAILURE!
junit.framework.ComparisonFailure: expected:<PT[-0.999]S> but was:<PT[0]S>
	at junit.framework.Assert.assertEquals(Assert.java:81)
	at junit.framework.Assert.assertEquals(Assert.java:87)
	at org.joda.time.format.TestPeriodFormatParsing.testParseNegativeMillis2(TestPeriodFormatParsing.java:109)

testParseCustom1(org.joda.time.format.TestPeriodFormatParsing)  Time elapsed: 0.001 sec  <<< FAILURE!
junit.framework.ComparisonFailure: expected:<47[:]55> but was:<47[.047:55.0]55>
	at junit.framework.Assert.assertEquals(Assert.java:81)
	at junit.framework.Assert.assertEquals(Assert.java:87)
	at org.joda.time.format.TestPeriodFormatParsing.testParseCustom1(TestPeriodFormatParsing.java:126)

testParseNegativeMillis1(org.joda.time.format.TestPeriodFormatParsing)  Time elapsed: 0 sec  <<< FAILURE!
junit.framework.ComparisonFailure: expected:<PT[-0.001]S> but was:<PT[0]S>
	at junit.framework.Assert.assertEquals(Assert.java:81)
	at junit.framework.Assert.assertEquals(Assert.java:87)
	at org.joda.time.format.TestPeriodFormatParsing.testParseNegativeMillis1(TestPeriodFormatParsing.java:101)

testFormatPrintZeroIfSupported(org.joda.time.format.TestPeriodFormatterBuilder)  Time elapsed: 0.001 sec  <<< FAILURE!
junit.framework.ComparisonFailure: expected:<1[-2-3-]4> but was:<1[.001-2.002-3.003-4.00]4>
	at junit.framework.Assert.assertEquals(Assert.java:81)
	at junit.framework.Assert.assertEquals(Assert.java:87)
	at org.joda.time.format.TestPeriodFormatterBuilder.testFormatPrintZeroIfSupported(TestPeriodFormatterBuilder.java:1004)

testFormatPrintZeroAlways(org.joda.time.format.TestPeriodFormatterBuilder)  Time elapsed: 0 sec  <<< FAILURE!
junit.framework.ComparisonFailure: expected:<1[-2-3-]4> but was:<1[.001-2.002-3.003-4.00]4>
	at junit.framework.Assert.assertEquals(Assert.java:81)
	at junit.framework.Assert.assertEquals(Assert.java:87)
	at org.joda.time.format.TestPeriodFormatterBuilder.testFormatPrintZeroAlways(TestPeriodFormatterBuilder.java:1029)

testFormatPrintZeroNever(org.joda.time.format.TestPeriodFormatterBuilder)  Time elapsed: 0.001 sec  <<< FAILURE!
junit.framework.ComparisonFailure: expected:<1[-2-3-]4> but was:<1[.001-2.002-3.003-4.00]4>
	at junit.framework.Assert.assertEquals(Assert.java:81)
	at junit.framework.Assert.assertEquals(Assert.java:87)
	at org.joda.time.format.TestPeriodFormatterBuilder.testFormatPrintZeroNever(TestPeriodFormatterBuilder.java:1054)

testFormatAppend_PrinterParser_Printer_null(org.joda.time.format.TestPeriodFormatterBuilder)  Time elapsed: 0 sec  <<< FAILURE!
junit.framework.ComparisonFailure: expected:<1[-]2> but was:<1[.001-2.00]2>
	at junit.framework.Assert.assertEquals(Assert.java:81)
	at junit.framework.Assert.assertEquals(Assert.java:87)
	at org.joda.time.format.TestPeriodFormatterBuilder.testFormatAppend_PrinterParser_Printer_null(TestPeriodFormatterBuilder.java:1086)

testFormatAppend_PrinterParser_PrinterParser(org.joda.time.format.TestPeriodFormatterBuilder)  Time elapsed: 0.001 sec  <<< FAILURE!
junit.framework.ComparisonFailure: expected:<1[-]2> but was:<1[.001-2.00]2>
	at junit.framework.Assert.assertEquals(Assert.java:81)
	at junit.framework.Assert.assertEquals(Assert.java:87)
	at org.joda.time.format.TestPeriodFormatterBuilder.testFormatAppend_PrinterParser_PrinterParser(TestPeriodFormatterBuilder.java:1115)

testMonthsAndMinutesAreConsideredSeparateAndCaseIsNotIgnored(org.joda.time.format.TestPeriodFormatterBuilder)  Time elapsed: 0 sec  <<< FAILURE!
junit.framework.ComparisonFailure: expected:<1[]M> but was:<1[.001]M>
	at junit.framework.Assert.assertEquals(Assert.java:81)
	at junit.framework.Assert.assertEquals(Assert.java:87)
	at org.joda.time.format.TestPeriodFormatterBuilder.testMonthsAndMinutesAreConsideredSeparateAndCaseIsNotIgnored(TestPeriodFormatterBuilder.java:1178)

testFormatMinutes(org.joda.time.format.TestPeriodFormatterBuilder)  Time elapsed: 0.001 sec  <<< FAILURE!
junit.framework.ComparisonFailure: expected:<6[]> but was:<6[.006]>
	at junit.framework.Assert.assertEquals(Assert.java:81)
	at junit.framework.Assert.assertEquals(Assert.java:87)
	at org.joda.time.format.TestPeriodFormatterBuilder.testFormatMinutes(TestPeriodFormatterBuilder.java:169)

testFormatSeconds(org.joda.time.format.TestPeriodFormatterBuilder)  Time elapsed: 0 sec  <<< FAILURE!
junit.framework.ComparisonFailure: expected:<7[]> but was:<7[.007]>
	at junit.framework.Assert.assertEquals(Assert.java:81)
	at junit.framework.Assert.assertEquals(Assert.java:87)
	at org.joda.time.format.TestPeriodFormatterBuilder.testFormatSeconds(TestPeriodFormatterBuilder.java:181)

testFormatSecondsWithMillis(org.joda.time.format.TestPeriodFormatterBuilder)  Time elapsed: 0.001 sec  <<< FAILURE!
junit.framework.ComparisonFailure: expected:<7[.000]> but was:<7[]>
	at junit.framework.Assert.assertEquals(Assert.java:81)
	at junit.framework.Assert.assertEquals(Assert.java:87)
	at org.joda.time.format.TestPeriodFormatterBuilder.testFormatSecondsWithMillis(TestPeriodFormatterBuilder.java:194)

testFormatSecondsWithOptionalMillis(org.joda.time.format.TestPeriodFormatterBuilder)  Time elapsed: 0 sec  <<< FAILURE!
junit.framework.ComparisonFailure: expected:<7[.001]> but was:<7[]>
	at junit.framework.Assert.assertEquals(Assert.java:81)
	at junit.framework.Assert.assertEquals(Assert.java:87)
	at org.joda.time.format.TestPeriodFormatterBuilder.testFormatSecondsWithOptionalMillis(TestPeriodFormatterBuilder.java:247)

testFormatMillis(org.joda.time.format.TestPeriodFormatterBuilder)  Time elapsed: 0.001 sec  <<< FAILURE!
junit.framework.ComparisonFailure: expected:<8[]> but was:<8[.008]>
	at junit.framework.Assert.assertEquals(Assert.java:81)
	at junit.framework.Assert.assertEquals(Assert.java:87)
	at org.joda.time.format.TestPeriodFormatterBuilder.testFormatMillis(TestPeriodFormatterBuilder.java:289)

testFormatMillis3Digit(org.joda.time.format.TestPeriodFormatterBuilder)  Time elapsed: 0 sec  <<< FAILURE!
junit.framework.ComparisonFailure: expected:<008[]> but was:<008[.008]>
	at junit.framework.Assert.assertEquals(Assert.java:81)
	at junit.framework.Assert.assertEquals(Assert.java:87)
	at org.joda.time.format.TestPeriodFormatterBuilder.testFormatMillis3Digit(TestPeriodFormatterBuilder.java:301)

testFormatPrefixSimple1(org.joda.time.format.TestPeriodFormatterBuilder)  Time elapsed: 0.001 sec  <<< FAILURE!
junit.framework.ComparisonFailure: expected:<Years:1[]> but was:<Years:1[.001]>
	at junit.framework.Assert.assertEquals(Assert.java:81)
	at junit.framework.Assert.assertEquals(Assert.java:87)
	at org.joda.time.format.TestPeriodFormatterBuilder.testFormatPrefixSimple1(TestPeriodFormatterBuilder.java:314)

testFormatPrefixSimple2(org.joda.time.format.TestPeriodFormatterBuilder)  Time elapsed: 0 sec  <<< FAILURE!
junit.framework.ComparisonFailure: expected:<Hours:5[]> but was:<Hours:5[.005]>
	at junit.framework.Assert.assertEquals(Assert.java:81)
	at junit.framework.Assert.assertEquals(Assert.java:87)
	at org.joda.time.format.TestPeriodFormatterBuilder.testFormatPrefixSimple2(TestPeriodFormatterBuilder.java:326)

testFormatPrefixSimple4IgnoringPrefix(org.joda.time.format.TestPeriodFormatterBuilder)  Time elapsed: 0.001 sec  <<< FAILURE!
junit.framework.ComparisonFailure: expected:<ms1[]> but was:<ms1[.001]>
	at junit.framework.Assert.assertEquals(Assert.java:81)
	at junit.framework.Assert.assertEquals(Assert.java:87)
	at org.joda.time.format.TestPeriodFormatterBuilder.testFormatPrefixSimple4IgnoringPrefix(TestPeriodFormatterBuilder.java:347)

testPluralAffixParseOrder(org.joda.time.format.TestPeriodFormatterBuilder)  Time elapsed: 0 sec  <<< ERROR!
java.lang.IllegalArgumentException: Invalid format: "2.002days"
	at org.joda.time.format.PeriodFormatter.parseMutablePeriod(PeriodFormatter.java:330)
	at org.joda.time.format.PeriodFormatter.parsePeriod(PeriodFormatter.java:308)
	at org.joda.time.format.TestPeriodFormatterBuilder.testPluralAffixParseOrder(TestPeriodFormatterBuilder.java:357)

testFormatPrefixPlural1(org.joda.time.format.TestPeriodFormatterBuilder)  Time elapsed: 0.001 sec  <<< FAILURE!
junit.framework.ComparisonFailure: expected:<Year:1[]> but was:<Year:1[.001]>
	at junit.framework.Assert.assertEquals(Assert.java:81)
	at junit.framework.Assert.assertEquals(Assert.java:87)
	at org.joda.time.format.TestPeriodFormatterBuilder.testFormatPrefixPlural1(TestPeriodFormatterBuilder.java:365)

testFormatPrefixPlural2(org.joda.time.format.TestPeriodFormatterBuilder)  Time elapsed: 0 sec  <<< FAILURE!
junit.framework.ComparisonFailure: expected:<Hours:5[]> but was:<Hours:5[.005]>
	at junit.framework.Assert.assertEquals(Assert.java:81)
	at junit.framework.Assert.assertEquals(Assert.java:87)
	at org.joda.time.format.TestPeriodFormatterBuilder.testFormatPrefixPlural2(TestPeriodFormatterBuilder.java:377)

testFormatPrefixPlural4IgnoringPrefix(org.joda.time.format.TestPeriodFormatterBuilder)  Time elapsed: 0.001 sec  <<< FAILURE!
junit.framework.ComparisonFailure: expected:<mss1[]> but was:<mss1[.001]>
	at junit.framework.Assert.assertEquals(Assert.java:81)
	at junit.framework.Assert.assertEquals(Assert.java:87)
	at org.joda.time.format.TestPeriodFormatterBuilder.testFormatPrefixPlural4IgnoringPrefix(TestPeriodFormatterBuilder.java:406)

testRegExAffixParseOrder(org.joda.time.format.TestPeriodFormatterBuilder)  Time elapsed: 0 sec  <<< ERROR!
java.lang.IllegalArgumentException: Invalid format: "2.002days"
	at org.joda.time.format.PeriodFormatter.parseMutablePeriod(PeriodFormatter.java:330)
	at org.joda.time.format.PeriodFormatter.parsePeriod(PeriodFormatter.java:308)
	at org.joda.time.format.TestPeriodFormatterBuilder.testRegExAffixParseOrder(TestPeriodFormatterBuilder.java:424)

testFormatPrefixRegEx1(org.joda.time.format.TestPeriodFormatterBuilder)  Time elapsed: 0.001 sec  <<< FAILURE!
junit.framework.ComparisonFailure: expected:<Year:1[]> but was:<Year:1[.001]>
	at junit.framework.Assert.assertEquals(Assert.java:81)
	at junit.framework.Assert.assertEquals(Assert.java:87)
	at org.joda.time.format.TestPeriodFormatterBuilder.testFormatPrefixRegEx1(TestPeriodFormatterBuilder.java:433)

testFormatPrefixRegEx2(org.joda.time.format.TestPeriodFormatterBuilder)  Time elapsed: 0 sec  <<< FAILURE!
junit.framework.ComparisonFailure: expected:<Hours:5[]> but was:<Hours:5[.005]>
	at junit.framework.Assert.assertEquals(Assert.java:81)
	at junit.framework.Assert.assertEquals(Assert.java:87)
	at org.joda.time.format.TestPeriodFormatterBuilder.testFormatPrefixRegEx2(TestPeriodFormatterBuilder.java:446)

testFormatPrefixRegEx4IgnoringPrefix(org.joda.time.format.TestPeriodFormatterBuilder)  Time elapsed: 0.001 sec  <<< FAILURE!
junit.framework.ComparisonFailure: expected:<mss1[]> but was:<mss1[.001]>
	at junit.framework.Assert.assertEquals(Assert.java:81)
	at junit.framework.Assert.assertEquals(Assert.java:87)
	at org.joda.time.format.TestPeriodFormatterBuilder.testFormatPrefixRegEx4IgnoringPrefix(TestPeriodFormatterBuilder.java:491)

testFormatPrefixComposite1(org.joda.time.format.TestPeriodFormatterBuilder)  Time elapsed: 0.001 sec  <<< FAILURE!
junit.framework.ComparisonFailure: expected:<days:2[]> but was:<days:2[.002]>
	at junit.framework.Assert.assertEquals(Assert.java:81)
	at junit.framework.Assert.assertEquals(Assert.java:87)
	at org.joda.time.format.TestPeriodFormatterBuilder.testFormatPrefixComposite1(TestPeriodFormatterBuilder.java:512)

testFormatSuffixSimple1(org.joda.time.format.TestPeriodFormatterBuilder)  Time elapsed: 0 sec  <<< FAILURE!
junit.framework.ComparisonFailure: expected:<1[] years> but was:<1[.001] years>
	at junit.framework.Assert.assertEquals(Assert.java:81)
	at junit.framework.Assert.assertEquals(Assert.java:87)
	at org.joda.time.format.TestPeriodFormatterBuilder.testFormatSuffixSimple1(TestPeriodFormatterBuilder.java:522)

testFormatSuffixSimple2(org.joda.time.format.TestPeriodFormatterBuilder)  Time elapsed: 0 sec  <<< FAILURE!
junit.framework.ComparisonFailure: expected:<5[] hours> but was:<5[.005] hours>
	at junit.framework.Assert.assertEquals(Assert.java:81)
	at junit.framework.Assert.assertEquals(Assert.java:87)
	at org.joda.time.format.TestPeriodFormatterBuilder.testFormatSuffixSimple2(TestPeriodFormatterBuilder.java:534)

testFormatPrefixSimple5IgnoringPrefix(org.joda.time.format.TestPeriodFormatterBuilder)  Time elapsed: 0.001 sec  <<< FAILURE!
junit.framework.ComparisonFailure: expected:<1[]ms> but was:<1[.001]ms>
	at junit.framework.Assert.assertEquals(Assert.java:81)
	at junit.framework.Assert.assertEquals(Assert.java:87)
	at org.joda.time.format.TestPeriodFormatterBuilder.testFormatPrefixSimple5IgnoringPrefix(TestPeriodFormatterBuilder.java:562)

testFormatPrefixSimple6IgnoringPrefix(org.joda.time.format.TestPeriodFormatterBuilder)  Time elapsed: 0 sec  <<< FAILURE!
junit.framework.ComparisonFailure: expected:<1[]ms> but was:<1[.001]ms>
	at junit.framework.Assert.assertEquals(Assert.java:81)
	at junit.framework.Assert.assertEquals(Assert.java:87)
	at org.joda.time.format.TestPeriodFormatterBuilder.testFormatPrefixSimple6IgnoringPrefix(TestPeriodFormatterBuilder.java:573)

testFormatSuffixPlural1(org.joda.time.format.TestPeriodFormatterBuilder)  Time elapsed: 0.001 sec  <<< FAILURE!
junit.framework.ComparisonFailure: expected:<1[] year> but was:<1[.001] year>
	at junit.framework.Assert.assertEquals(Assert.java:81)
	at junit.framework.Assert.assertEquals(Assert.java:87)
	at org.joda.time.format.TestPeriodFormatterBuilder.testFormatSuffixPlural1(TestPeriodFormatterBuilder.java:582)

testFormatSuffixPlural2(org.joda.time.format.TestPeriodFormatterBuilder)  Time elapsed: 0 sec  <<< FAILURE!
junit.framework.ComparisonFailure: expected:<5[] hours> but was:<5[.005] hours>
	at junit.framework.Assert.assertEquals(Assert.java:81)
	at junit.framework.Assert.assertEquals(Assert.java:87)
	at org.joda.time.format.TestPeriodFormatterBuilder.testFormatSuffixPlural2(TestPeriodFormatterBuilder.java:594)

testFormatSuffixPlural4IgnoringPrefix(org.joda.time.format.TestPeriodFormatterBuilder)  Time elapsed: 0.001 sec  <<< FAILURE!
junit.framework.ComparisonFailure: expected:<1[]mss> but was:<1[.001]mss>
	at junit.framework.Assert.assertEquals(Assert.java:81)
	at junit.framework.Assert.assertEquals(Assert.java:87)
	at org.joda.time.format.TestPeriodFormatterBuilder.testFormatSuffixPlural4IgnoringPrefix(TestPeriodFormatterBuilder.java:630)

testFormatSuffixRegEx1(org.joda.time.format.TestPeriodFormatterBuilder)  Time elapsed: 0 sec  <<< FAILURE!
junit.framework.ComparisonFailure: expected:<1[] year> but was:<1[.001] year>
	at junit.framework.Assert.assertEquals(Assert.java:81)
	at junit.framework.Assert.assertEquals(Assert.java:87)
	at org.joda.time.format.TestPeriodFormatterBuilder.testFormatSuffixRegEx1(TestPeriodFormatterBuilder.java:647)

testFormatSuffixRegEx2(org.joda.time.format.TestPeriodFormatterBuilder)  Time elapsed: 0 sec  <<< FAILURE!
junit.framework.ComparisonFailure: expected:<5[] hours> but was:<5[.005] hours>
	at junit.framework.Assert.assertEquals(Assert.java:81)
	at junit.framework.Assert.assertEquals(Assert.java:87)
	at org.joda.time.format.TestPeriodFormatterBuilder.testFormatSuffixRegEx2(TestPeriodFormatterBuilder.java:664)

testFormatSuffixRegEx5IgnoringAffix(org.joda.time.format.TestPeriodFormatterBuilder)  Time elapsed: 0.005 sec  <<< FAILURE!
junit.framework.ComparisonFailure: expected:<1[]mss> but was:<1[.001]mss>
	at junit.framework.Assert.assertEquals(Assert.java:81)
	at junit.framework.Assert.assertEquals(Assert.java:87)
	at org.joda.time.format.TestPeriodFormatterBuilder.testFormatSuffixRegEx5IgnoringAffix(TestPeriodFormatterBuilder.java:722)

testFormatSuffixComposite1(org.joda.time.format.TestPeriodFormatterBuilder)  Time elapsed: 0 sec  <<< FAILURE!
junit.framework.ComparisonFailure: expected:<2[]days> but was:<2[.002]days>
	at junit.framework.Assert.assertEquals(Assert.java:81)
	at junit.framework.Assert.assertEquals(Assert.java:87)
	at org.joda.time.format.TestPeriodFormatterBuilder.testFormatSuffixComposite1(TestPeriodFormatterBuilder.java:742)

testFormatSuffixComposite5IgnoringAffix(org.joda.time.format.TestPeriodFormatterBuilder)  Time elapsed: 0 sec  <<< FAILURE!
junit.framework.ComparisonFailure: expected:<1[]ms> but was:<1[.001]ms>
	at junit.framework.Assert.assertEquals(Assert.java:81)
	at junit.framework.Assert.assertEquals(Assert.java:87)
	at org.joda.time.format.TestPeriodFormatterBuilder.testFormatSuffixComposite5IgnoringAffix(TestPeriodFormatterBuilder.java:756)

testFormatPrefixSuffix(org.joda.time.format.TestPeriodFormatterBuilder)  Time elapsed: 0.001 sec  <<< FAILURE!
junit.framework.ComparisonFailure: expected:<P1[]Y> but was:<P1[.001]Y>
	at junit.framework.Assert.assertEquals(Assert.java:81)
	at junit.framework.Assert.assertEquals(Assert.java:87)
	at org.joda.time.format.TestPeriodFormatterBuilder.testFormatPrefixSuffix(TestPeriodFormatterBuilder.java:766)

testFormatSeparatorSimple(org.joda.time.format.TestPeriodFormatterBuilder)  Time elapsed: 0.001 sec  <<< FAILURE!
junit.framework.ComparisonFailure: expected:<1[T]5> but was:<1[.001T5.00]5>
	at junit.framework.Assert.assertEquals(Assert.java:81)
	at junit.framework.Assert.assertEquals(Assert.java:87)
	at org.joda.time.format.TestPeriodFormatterBuilder.testFormatSeparatorSimple(TestPeriodFormatterBuilder.java:779)

testFormatSeparatorComplex(org.joda.time.format.TestPeriodFormatterBuilder)  Time elapsed: 0.001 sec  <<< FAILURE!
junit.framework.ComparisonFailure: expected:<1[, 5 and ]6> but was:<1[.001, 5.005 and 6.00]6>
	at junit.framework.Assert.assertEquals(Assert.java:81)
	at junit.framework.Assert.assertEquals(Assert.java:87)
	at org.joda.time.format.TestPeriodFormatterBuilder.testFormatSeparatorComplex(TestPeriodFormatterBuilder.java:798)

testFormatSeparatorIfFieldsAfter(org.joda.time.format.TestPeriodFormatterBuilder)  Time elapsed: 0.004 sec  <<< FAILURE!
junit.framework.ComparisonFailure: expected:<1[T]5> but was:<1[.001T5.00]5>
	at junit.framework.Assert.assertEquals(Assert.java:81)
	at junit.framework.Assert.assertEquals(Assert.java:87)
	at org.joda.time.format.TestPeriodFormatterBuilder.testFormatSeparatorIfFieldsAfter(TestPeriodFormatterBuilder.java:813)

testFormatSeparatorIfFieldsBefore(org.joda.time.format.TestPeriodFormatterBuilder)  Time elapsed: 0 sec  <<< FAILURE!
junit.framework.ComparisonFailure: expected:<1[T]5> but was:<1[.001T5.00]5>
	at junit.framework.Assert.assertEquals(Assert.java:81)
	at junit.framework.Assert.assertEquals(Assert.java:87)
	at org.joda.time.format.TestPeriodFormatterBuilder.testFormatSeparatorIfFieldsBefore(TestPeriodFormatterBuilder.java:828)

testFormatAppendFormatter(org.joda.time.format.TestPeriodFormatterBuilder)  Time elapsed: 0 sec  <<< FAILURE!
junit.framework.ComparisonFailure: expected:<1[-]1> but was:<1[.001-1.00]1>
	at junit.framework.Assert.assertEquals(Assert.java:81)
	at junit.framework.Assert.assertEquals(Assert.java:87)
	at org.joda.time.format.TestPeriodFormatterBuilder.testFormatAppendFormatter(TestPeriodFormatterBuilder.java:852)

testFormatMinDigits(org.joda.time.format.TestPeriodFormatterBuilder)  Time elapsed: 0 sec  <<< FAILURE!
junit.framework.ComparisonFailure: expected:<0001[]> but was:<0001[.001]>
	at junit.framework.Assert.assertEquals(Assert.java:81)
	at junit.framework.Assert.assertEquals(Assert.java:87)
	at org.joda.time.format.TestPeriodFormatterBuilder.testFormatMinDigits(TestPeriodFormatterBuilder.java:859)

testFormatPrintZeroDefault(org.joda.time.format.TestPeriodFormatterBuilder)  Time elapsed: 0.001 sec  <<< FAILURE!
junit.framework.ComparisonFailure: expected:<1[-2-3-]4> but was:<1[.001-2.002-3.003-4.00]4>
	at junit.framework.Assert.assertEquals(Assert.java:81)
	at junit.framework.Assert.assertEquals(Assert.java:87)
	at org.joda.time.format.TestPeriodFormatterBuilder.testFormatPrintZeroDefault(TestPeriodFormatterBuilder.java:872)

testFormatPrintZeroRarelyLast(org.joda.time.format.TestPeriodFormatterBuilder)  Time elapsed: 0 sec  <<< FAILURE!
junit.framework.ComparisonFailure: expected:<1[-2-3-]4> but was:<1[.001-2.002-3.003-4.00]4>
	at junit.framework.Assert.assertEquals(Assert.java:81)
	at junit.framework.Assert.assertEquals(Assert.java:87)
	at org.joda.time.format.TestPeriodFormatterBuilder.testFormatPrintZeroRarelyLast(TestPeriodFormatterBuilder.java:905)

testFormatPrintZeroRarelyFirst(org.joda.time.format.TestPeriodFormatterBuilder)  Time elapsed: 0 sec  <<< FAILURE!
junit.framework.ComparisonFailure: expected:<1[-2-3-]4> but was:<1[.001-2.002-3.003-4.00]4>
	at junit.framework.Assert.assertEquals(Assert.java:81)
	at junit.framework.Assert.assertEquals(Assert.java:87)
	at org.joda.time.format.TestPeriodFormatterBuilder.testFormatPrintZeroRarelyFirst(TestPeriodFormatterBuilder.java:930)

testFormatYears(org.joda.time.format.TestPeriodFormatterBuilder)  Time elapsed: 0.001 sec  <<< FAILURE!
junit.framework.ComparisonFailure: expected:<1[]> but was:<1[.001]>
	at junit.framework.Assert.assertEquals(Assert.java:81)
	at junit.framework.Assert.assertEquals(Assert.java:87)
	at org.joda.time.format.TestPeriodFormatterBuilder.testFormatYears(TestPeriodFormatterBuilder.java:109)

testFormatMonths(org.joda.time.format.TestPeriodFormatterBuilder)  Time elapsed: 0 sec  <<< FAILURE!
junit.framework.ComparisonFailure: expected:<2[]> but was:<2[.002]>
	at junit.framework.Assert.assertEquals(Assert.java:81)
	at junit.framework.Assert.assertEquals(Assert.java:87)
	at org.joda.time.format.TestPeriodFormatterBuilder.testFormatMonths(TestPeriodFormatterBuilder.java:121)

testFormatWeeks(org.joda.time.format.TestPeriodFormatterBuilder)  Time elapsed: 0.001 sec  <<< FAILURE!
junit.framework.ComparisonFailure: expected:<3[]> but was:<3[.003]>
	at junit.framework.Assert.assertEquals(Assert.java:81)
	at junit.framework.Assert.assertEquals(Assert.java:87)
	at org.joda.time.format.TestPeriodFormatterBuilder.testFormatWeeks(TestPeriodFormatterBuilder.java:133)

testFormatDays(org.joda.time.format.TestPeriodFormatterBuilder)  Time elapsed: 0 sec  <<< FAILURE!
junit.framework.ComparisonFailure: expected:<4[]> but was:<4[.004]>
	at junit.framework.Assert.assertEquals(Assert.java:81)
	at junit.framework.Assert.assertEquals(Assert.java:87)
	at org.joda.time.format.TestPeriodFormatterBuilder.testFormatDays(TestPeriodFormatterBuilder.java:145)

testFormatHours(org.joda.time.format.TestPeriodFormatterBuilder)  Time elapsed: 0 sec  <<< FAILURE!
junit.framework.ComparisonFailure: expected:<5[]> but was:<5[.005]>
	at junit.framework.Assert.assertEquals(Assert.java:81)
	at junit.framework.Assert.assertEquals(Assert.java:87)
	at org.joda.time.format.TestPeriodFormatterBuilder.testFormatHours(TestPeriodFormatterBuilder.java:157)


Results :

Failed tests: 
  org.joda.time.TestDateTimeZoneCutover#testPeriod ComparisonFailure expected:<P...
  org.joda.time.TestMutablePeriod_Basics#testToString ComparisonFailure expected...
  org.joda.time.TestPeriod_Basics#testToString ComparisonFailure expected:<P1[Y2...
  org.joda.time.TestPeriod_Basics#testToString_PeriodFormatter ComparisonFailure
  org.joda.time.TestPeriod_Basics#testToString_nullPeriodFormatter ComparisonFailure
  org.joda.time.TestStringConvert#testMutablePeriod ComparisonFailure expected:<...
  org.joda.time.TestStringConvert#testPeriod ComparisonFailure expected:<P1[Y2M3...
  org.joda.time.format.TestISOPeriodFormat#testFormatAlternate ComparisonFailure
  org.joda.time.format.TestISOPeriodFormat#testFormatAlternateExtended ComparisonFailure
  org.joda.time.format.TestISOPeriodFormat#testFormatAlternateExtendedWithWeeks ComparisonFailure
  org.joda.time.format.TestISOPeriodFormat#testFormatAlternateWithWeeks ComparisonFailure
  org.joda.time.format.TestISOPeriodFormat#testFormatStandard ComparisonFailure ...
  org.joda.time.format.TestISOPeriodFormat#testFormatStandard_negative ComparisonFailure
  org.joda.time.format.TestPeriodFormat#test_getDefault_FormatOneField ComparisonFailure
  org.joda.time.format.TestPeriodFormat#test_getDefault_formatStandard ComparisonFailure
  org.joda.time.format.TestPeriodFormat#test_getDefault_formatTwoFields ComparisonFailure
  org.joda.time.format.TestPeriodFormat#test_wordBased_da_formatMultiple ComparisonFailure
  org.joda.time.format.TestPeriodFormat#test_wordBased_da_formatSinglular ComparisonFailure
  org.joda.time.format.TestPeriodFormat#test_wordBased_de_FormatOneField ComparisonFailure
  org.joda.time.format.TestPeriodFormat#test_wordBased_de_formatStandard ComparisonFailure
  org.joda.time.format.TestPeriodFormat#test_wordBased_de_formatTwoFields ComparisonFailure
  org.joda.time.format.TestPeriodFormat#test_wordBased_default ComparisonFailure
  org.joda.time.format.TestPeriodFormat#test_wordBased_en_from_de ComparisonFailure
  org.joda.time.format.TestPeriodFormat#test_wordBased_en_from_nl ComparisonFailure
  org.joda.time.format.TestPeriodFormat#test_wordBased_en_from_pl ComparisonFailure
  org.joda.time.format.TestPeriodFormat#test_wordBased_en_withLocale_pt ComparisonFailure
  org.joda.time.format.TestPeriodFormat#test_wordBased_es_FormatOneField ComparisonFailure
  org.joda.time.format.TestPeriodFormat#test_wordBased_es_formatStandard ComparisonFailure
  org.joda.time.format.TestPeriodFormat#test_wordBased_es_formatTwoFields ComparisonFailure
  org.joda.time.format.TestPeriodFormat#test_wordBased_fr_FormatOneField ComparisonFailure
  org.joda.time.format.TestPeriodFormat#test_wordBased_fr_formatStandard ComparisonFailure
  org.joda.time.format.TestPeriodFormat#test_wordBased_fr_formatTwoFields ComparisonFailure
  org.joda.time.format.TestPeriodFormat#test_wordBased_fr_from_de ComparisonFailure
  org.joda.time.format.TestPeriodFormat#test_wordBased_fr_from_nl ComparisonFailure
  org.joda.time.format.TestPeriodFormat#test_wordBased_ja_formatMultiple ComparisonFailure
  org.joda.time.format.TestPeriodFormat#test_wordBased_ja_formatSingular ComparisonFailure
  org.joda.time.format.TestPeriodFormat#test_wordBased_nl_FormatOneField ComparisonFailure
  org.joda.time.format.TestPeriodFormat#test_wordBased_nl_formatStandard ComparisonFailure
  org.joda.time.format.TestPeriodFormat#test_wordBased_nl_formatTwoFields ComparisonFailure
  org.joda.time.format.TestPeriodFormat#test_wordBased_pl_FormatOneField ComparisonFailure
  org.joda.time.format.TestPeriodFormat#test_wordBased_pl_formatStandard ComparisonFailure
  org.joda.time.format.TestPeriodFormat#test_wordBased_pl_formatTwoFields ComparisonFailure
  org.joda.time.format.TestPeriodFormat#test_wordBased_pl_from_fr ComparisonFailure
  org.joda.time.format.TestPeriodFormat#test_wordBased_pl_regEx ComparisonFailure
  org.joda.time.format.TestPeriodFormat#test_wordBased_pt_FormatOneField ComparisonFailure
  org.joda.time.format.TestPeriodFormat#test_wordBased_pt_formatStandard ComparisonFailure
  org.joda.time.format.TestPeriodFormat#test_wordBased_pt_formatTwoFields ComparisonFailure
  org.joda.time.format.TestPeriodFormatParsing#testParseCustom1 ComparisonFailure
  org.joda.time.format.TestPeriodFormatParsing#testParseNegativeMillis1 ComparisonFailure
  org.joda.time.format.TestPeriodFormatParsing#testParseNegativeMillis2 ComparisonFailure
  org.joda.time.format.TestPeriodFormatter#testPrint_bufferMethods ComparisonFailure
  org.joda.time.format.TestPeriodFormatter#testPrint_simple ComparisonFailure ex...
  org.joda.time.format.TestPeriodFormatterBuilder#testFormatAppendFormatter ComparisonFailure
  org.joda.time.format.TestPeriodFormatterBuilder#testFormatAppend_PrinterParser_PrinterParser ComparisonFailure
  org.joda.time.format.TestPeriodFormatterBuilder#testFormatAppend_PrinterParser_Printer_null ComparisonFailure
  org.joda.time.format.TestPeriodFormatterBuilder#testFormatDays ComparisonFailure
  org.joda.time.format.TestPeriodFormatterBuilder#testFormatHours ComparisonFailure
  org.joda.time.format.TestPeriodFormatterBuilder#testFormatMillis ComparisonFailure
  org.joda.time.format.TestPeriodFormatterBuilder#testFormatMillis3Digit ComparisonFailure
  org.joda.time.format.TestPeriodFormatterBuilder#testFormatMinDigits ComparisonFailure
  org.joda.time.format.TestPeriodFormatterBuilder#testFormatMinutes ComparisonFailure
  org.joda.time.format.TestPeriodFormatterBuilder#testFormatMonths ComparisonFailure
  org.joda.time.format.TestPeriodFormatterBuilder#testFormatPrefixComposite1 ComparisonFailure
  org.joda.time.format.TestPeriodFormatterBuilder#testFormatPrefixPlural1 ComparisonFailure
  org.joda.time.format.TestPeriodFormatterBuilder#testFormatPrefixPlural2 ComparisonFailure
  org.joda.time.format.TestPeriodFormatterBuilder#testFormatPrefixPlural4IgnoringPrefix ComparisonFailure
  org.joda.time.format.TestPeriodFormatterBuilder#testFormatPrefixRegEx1 ComparisonFailure
  org.joda.time.format.TestPeriodFormatterBuilder#testFormatPrefixRegEx2 ComparisonFailure
  org.joda.time.format.TestPeriodFormatterBuilder#testFormatPrefixRegEx4IgnoringPrefix ComparisonFailure
  org.joda.time.format.TestPeriodFormatterBuilder#testFormatPrefixSimple1 ComparisonFailure
  org.joda.time.format.TestPeriodFormatterBuilder#testFormatPrefixSimple2 ComparisonFailure
  org.joda.time.format.TestPeriodFormatterBuilder#testFormatPrefixSimple4IgnoringPrefix ComparisonFailure
  org.joda.time.format.TestPeriodFormatterBuilder#testFormatPrefixSimple5IgnoringPrefix ComparisonFailure
  org.joda.time.format.TestPeriodFormatterBuilder#testFormatPrefixSimple6IgnoringPrefix ComparisonFailure
  org.joda.time.format.TestPeriodFormatterBuilder#testFormatPrefixSuffix ComparisonFailure
  org.joda.time.format.TestPeriodFormatterBuilder#testFormatPrintZeroAlways ComparisonFailure
  org.joda.time.format.TestPeriodFormatterBuilder#testFormatPrintZeroDefault ComparisonFailure
  org.joda.time.format.TestPeriodFormatterBuilder#testFormatPrintZeroIfSupported ComparisonFailure
  org.joda.time.format.TestPeriodFormatterBuilder#testFormatPrintZeroNever ComparisonFailure
  org.joda.time.format.TestPeriodFormatterBuilder#testFormatPrintZeroRarelyFirst ComparisonFailure
  org.joda.time.format.TestPeriodFormatterBuilder#testFormatPrintZeroRarelyLast ComparisonFailure
  org.joda.time.format.TestPeriodFormatterBuilder#testFormatSeconds ComparisonFailure
  org.joda.time.format.TestPeriodFormatterBuilder#testFormatSecondsWithMillis ComparisonFailure
  org.joda.time.format.TestPeriodFormatterBuilder#testFormatSecondsWithOptionalMillis ComparisonFailure
  org.joda.time.format.TestPeriodFormatterBuilder#testFormatSeparatorComplex ComparisonFailure
  org.joda.time.format.TestPeriodFormatterBuilder#testFormatSeparatorIfFieldsAfter ComparisonFailure
  org.joda.time.format.TestPeriodFormatterBuilder#testFormatSeparatorIfFieldsBefore ComparisonFailure
  org.joda.time.format.TestPeriodFormatterBuilder#testFormatSeparatorSimple ComparisonFailure
  org.joda.time.format.TestPeriodFormatterBuilder#testFormatSuffixComposite1 ComparisonFailure
  org.joda.time.format.TestPeriodFormatterBuilder#testFormatSuffixComposite5IgnoringAffix ComparisonFailure
  org.joda.time.format.TestPeriodFormatterBuilder#testFormatSuffixPlural1 ComparisonFailure
  org.joda.time.format.TestPeriodFormatterBuilder#testFormatSuffixPlural2 ComparisonFailure
  org.joda.time.format.TestPeriodFormatterBuilder#testFormatSuffixPlural4IgnoringPrefix ComparisonFailure
  org.joda.time.format.TestPeriodFormatterBuilder#testFormatSuffixRegEx1 ComparisonFailure
  org.joda.time.format.TestPeriodFormatterBuilder#testFormatSuffixRegEx2 ComparisonFailure
  org.joda.time.format.TestPeriodFormatterBuilder#testFormatSuffixRegEx5IgnoringAffix ComparisonFailure
  org.joda.time.format.TestPeriodFormatterBuilder#testFormatSuffixSimple1 ComparisonFailure
  org.joda.time.format.TestPeriodFormatterBuilder#testFormatSuffixSimple2 ComparisonFailure
  org.joda.time.format.TestPeriodFormatterBuilder#testFormatWeeks ComparisonFailure
  org.joda.time.format.TestPeriodFormatterBuilder#testFormatYears ComparisonFailure
  org.joda.time.format.TestPeriodFormatterBuilder#testMonthsAndMinutesAreConsideredSeparateAndCaseIsNotIgnored ComparisonFailure
Tests in error: 
  org.joda.time.format.TestPeriodFormatterBuilder#testPluralAffixParseOrder IllegalArgumentException
  org.joda.time.format.TestPeriodFormatterBuilder#testRegExAffixParseOrder IllegalArgumentException

Tests run: 4157, Failures: 101, Errors: 2, Skipped: 0

[INFO] ------------------------------------------------------------------------
[INFO] BUILD FAILURE
[INFO] ------------------------------------------------------------------------
[INFO] Total time: 15.899s
[INFO] Finished at: Thu Aug 06 11:03:58 BST 2015
[INFO] Final Memory: 8M/216M
[INFO] ------------------------------------------------------------------------
[ERROR] Failed to execute goal org.apache.maven.plugins:maven-surefire-plugin:2.18.1:test (default-test) on project joda-time: There are test failures.
[ERROR] 
[ERROR] Please refer to /home/perham/Study/LittleDarwin/Cases/joda-time-2.8.1/target/surefire-reports for the individual test results.
[ERROR] -> [Help 1]
[ERROR] 
[ERROR] To see the full stack trace of the errors, re-run Maven with the -e switch.
[ERROR] Re-run Maven using the -X switch to enable full debug logging.
[ERROR] 
[ERROR] For more information about the errors and possible solutions, please read the following articles:
[ERROR] [Help 1] http://cwiki.apache.org/confluence/display/MAVEN/MojoFailureException
