[INFO] Scanning for projects...
[INFO]                                                                         
[INFO] ------------------------------------------------------------------------
[INFO] Building Joda-Time 2.8.1
[INFO] ------------------------------------------------------------------------
[INFO] 
[INFO] --- maven-resources-plugin:2.7:resources (default-resources) @ joda-time ---
[INFO] Using 'UTF-8' encoding to copy filtered resources.
[INFO] Copying 2 resources to META-INF
[INFO] Copying 10 resources
[INFO] 
[INFO] --- maven-compiler-plugin:3.3:compile (default-compile) @ joda-time ---
[INFO] Changes detected - recompiling the module!
[INFO] Compiling 166 source files to /home/perham/Study/LittleDarwin/Cases/joda-time-2.8.1/target/classes
[INFO] 
[INFO] --- exec-maven-plugin:1.4.0:java (compile-tzdb) @ joda-time ---
Writing zoneinfo files
Writing ZoneInfoMap
[INFO] 
[INFO] --- maven-resources-plugin:2.7:testResources (default-testResources) @ joda-time ---
[INFO] Using 'UTF-8' encoding to copy filtered resources.
[INFO] Copying 34 resources
[INFO] 
[INFO] --- maven-compiler-plugin:3.3:testCompile (default-testCompile) @ joda-time ---
[INFO] Nothing to compile - all classes are up to date
[INFO] 
[INFO] --- maven-surefire-plugin:2.18.1:test (default-test) @ joda-time ---
[INFO] Surefire report directory: /home/perham/Study/LittleDarwin/Cases/joda-time-2.8.1/target/surefire-reports

-------------------------------------------------------
 T E S T S
-------------------------------------------------------
Running org.joda.time.TestAllPackages

TestBuddhistChronology.testCalendar

TestCopticChronology.testCalendar

TestEthiopicChronology.testCalendar

TestIslamicChronology.testCalendar

Testing Gregorian chronology over 1000 iterations
100% complete (i=1000)

Testing Julian chronology over 1000 iterations
100% complete (i=1000)
Writing zoneinfo files
Writing ZoneInfoMap
Tests run: 4157, Failures: 1, Errors: 20, Skipped: 0, Time elapsed: 5.324 sec <<< FAILURE! - in org.joda.time.TestAllPackages
testParse_noFormatter(org.joda.time.TestPeriod_Constructors)  Time elapsed: 0.005 sec  <<< ERROR!
java.lang.IllegalArgumentException: Invalid format: "P1Y2M3W4DT5H6M7.890S" is malformed at "7.890S"
	at org.joda.time.format.PeriodFormatter.parseMutablePeriod(PeriodFormatter.java:330)
	at org.joda.time.format.PeriodFormatter.parsePeriod(PeriodFormatter.java:308)
	at org.joda.time.Period.parse(Period.java:92)
	at org.joda.time.Period.parse(Period.java:81)
	at org.joda.time.TestPeriod_Constructors.testParse_noFormatter(TestPeriod_Constructors.java:104)

testParse_noFormatter(org.joda.time.TestMutablePeriod_Constructors)  Time elapsed: 0.001 sec  <<< ERROR!
java.lang.IllegalArgumentException: Invalid format: "P1Y2M3W4DT5H6M7.890S" is malformed at "7.890S"
	at org.joda.time.format.PeriodFormatter.parseMutablePeriod(PeriodFormatter.java:330)
	at org.joda.time.format.PeriodFormatter.parsePeriod(PeriodFormatter.java:308)
	at org.joda.time.MutablePeriod.parse(MutablePeriod.java:85)
	at org.joda.time.MutablePeriod.parse(MutablePeriod.java:74)
	at org.joda.time.TestMutablePeriod_Constructors.testParse_noFormatter(TestMutablePeriod_Constructors.java:102)

testMutablePeriod(org.joda.time.TestStringConvert)  Time elapsed: 0.001 sec  <<< ERROR!
java.lang.IllegalArgumentException: Invalid format: "P1Y2M3W4DT5H6M7.008S" is malformed at "7.008S"
	at org.joda.time.format.PeriodFormatter.parseMutablePeriod(PeriodFormatter.java:330)
	at org.joda.time.format.PeriodFormatter.parsePeriod(PeriodFormatter.java:308)
	at org.joda.time.MutablePeriod.parse(MutablePeriod.java:85)
	at org.joda.time.MutablePeriod.parse(MutablePeriod.java:74)
	at sun.reflect.NativeMethodAccessorImpl.invoke0(Native Method)
	at sun.reflect.NativeMethodAccessorImpl.invoke(NativeMethodAccessorImpl.java:57)
	at sun.reflect.DelegatingMethodAccessorImpl.invoke(DelegatingMethodAccessorImpl.java:43)
	at java.lang.reflect.Method.invoke(Method.java:606)
	at org.joda.convert.MethodsStringConverter.convertFromString(MethodsStringConverter.java:70)
	at org.joda.convert.StringConvert.convertFromString(StringConvert.java:163)
	at org.joda.time.TestStringConvert.testMutablePeriod(TestStringConvert.java:151)

testPeriod(org.joda.time.TestStringConvert)  Time elapsed: 0.001 sec  <<< ERROR!
java.lang.IllegalArgumentException: Invalid format: "P1Y2M3W4DT5H6M7.008S" is malformed at "7.008S"
	at org.joda.time.format.PeriodFormatter.parseMutablePeriod(PeriodFormatter.java:330)
	at org.joda.time.format.PeriodFormatter.parsePeriod(PeriodFormatter.java:308)
	at org.joda.time.Period.parse(Period.java:92)
	at org.joda.time.Period.parse(Period.java:81)
	at sun.reflect.NativeMethodAccessorImpl.invoke0(Native Method)
	at sun.reflect.NativeMethodAccessorImpl.invoke(NativeMethodAccessorImpl.java:57)
	at sun.reflect.DelegatingMethodAccessorImpl.invoke(DelegatingMethodAccessorImpl.java:43)
	at java.lang.reflect.Method.invoke(Method.java:606)
	at org.joda.convert.MethodsStringConverter.convertFromString(MethodsStringConverter.java:70)
	at org.joda.convert.StringConvert.convertFromString(StringConvert.java:163)
	at org.joda.time.TestStringConvert.testPeriod(TestStringConvert.java:144)

testSetIntoPeriod_Object3(org.joda.time.convert.TestStringConverter)  Time elapsed: 0 sec  <<< ERROR!
java.lang.IllegalArgumentException: Invalid format: "P2Y4W3DT12H24M48.034S"
	at org.joda.time.convert.StringConverter.setInto(StringConverter.java:171)
	at org.joda.time.convert.TestStringConverter.testSetIntoPeriod_Object3(TestStringConverter.java:389)

testSetIntoPeriod_Object4(org.joda.time.convert.TestStringConverter)  Time elapsed: 0.001 sec  <<< ERROR!
java.lang.IllegalArgumentException: Invalid format: "P2Y4W3DT12H24M.056S" is malformed at ".056S"
	at org.joda.time.format.PeriodFormatter.parseMutablePeriod(PeriodFormatter.java:330)
	at org.joda.time.convert.StringConverter.setInto(StringConverter.java:169)
	at org.joda.time.convert.TestStringConverter.testSetIntoPeriod_Object4(TestStringConverter.java:401)

testSetIntoPeriod_Object5(org.joda.time.convert.TestStringConverter)  Time elapsed: 0.001 sec  <<< ERROR!
java.lang.IllegalArgumentException: Invalid format: "P2Y4W3DT12H24M56.S"
	at org.joda.time.convert.StringConverter.setInto(StringConverter.java:171)
	at org.joda.time.convert.TestStringConverter.testSetIntoPeriod_Object5(TestStringConverter.java:413)

testSetIntoPeriod_Object6(org.joda.time.convert.TestStringConverter)  Time elapsed: 0 sec  <<< ERROR!
java.lang.IllegalArgumentException: Invalid format: "P2Y4W3DT12H24M56.1234567S"
	at org.joda.time.convert.StringConverter.setInto(StringConverter.java:171)
	at org.joda.time.convert.TestStringConverter.testSetIntoPeriod_Object6(TestStringConverter.java:425)

testPrinterParserMethods(org.joda.time.format.TestPeriodFormatter)  Time elapsed: 0.001 sec  <<< ERROR!
java.lang.IllegalArgumentException: Invalid format: "P1Y2M3W4DT5H6M7.008S" is malformed at "7.008S"
	at org.joda.time.format.PeriodFormatter.parseMutablePeriod(PeriodFormatter.java:330)
	at org.joda.time.format.PeriodFormatter.parsePeriod(PeriodFormatter.java:308)
	at org.joda.time.format.TestPeriodFormatter.testPrinterParserMethods(TestPeriodFormatter.java:161)

testParsePeriod_simple(org.joda.time.format.TestPeriodFormatter)  Time elapsed: 0 sec  <<< ERROR!
java.lang.IllegalArgumentException: Invalid format: "P1Y2M3W4DT5H6M7.008S" is malformed at "7.008S"
	at org.joda.time.format.PeriodFormatter.parseMutablePeriod(PeriodFormatter.java:330)
	at org.joda.time.format.PeriodFormatter.parsePeriod(PeriodFormatter.java:308)
	at org.joda.time.format.TestPeriodFormatter.testParsePeriod_simple(TestPeriodFormatter.java:189)

testParsePeriod_parseType(org.joda.time.format.TestPeriodFormatter)  Time elapsed: 0.001 sec  <<< ERROR!
java.lang.IllegalArgumentException: Invalid format: "P4DT5H6M7.008S" is malformed at "7.008S"
	at org.joda.time.format.PeriodFormatter.parseMutablePeriod(PeriodFormatter.java:330)
	at org.joda.time.format.PeriodFormatter.parsePeriod(PeriodFormatter.java:308)
	at org.joda.time.format.TestPeriodFormatter.testParsePeriod_parseType(TestPeriodFormatter.java:199)

testParseMutablePeriod_simple(org.joda.time.format.TestPeriodFormatter)  Time elapsed: 0.001 sec  <<< ERROR!
java.lang.IllegalArgumentException: Invalid format: "P1Y2M3W4DT5H6M7.008S" is malformed at "7.008S"
	at org.joda.time.format.PeriodFormatter.parseMutablePeriod(PeriodFormatter.java:330)
	at org.joda.time.format.TestPeriodFormatter.testParseMutablePeriod_simple(TestPeriodFormatter.java:209)

testParseInto_simple(org.joda.time.format.TestPeriodFormatter)  Time elapsed: 0 sec  <<< FAILURE!
junit.framework.AssertionFailedError: expected:<20> but was:<14>
	at junit.framework.Assert.fail(Assert.java:47)
	at junit.framework.Assert.failNotEquals(Assert.java:280)
	at junit.framework.Assert.assertEquals(Assert.java:64)
	at junit.framework.Assert.assertEquals(Assert.java:198)
	at junit.framework.Assert.assertEquals(Assert.java:204)
	at org.joda.time.format.TestPeriodFormatter.testParseInto_simple(TestPeriodFormatter.java:221)

testParseStandard2(org.joda.time.format.TestISOPeriodFormatParsing)  Time elapsed: 0 sec  <<< ERROR!
java.lang.IllegalArgumentException: Invalid format: "P0Y0M0W0DT5H6M7.008S" is malformed at "7.008S"
	at org.joda.time.format.PeriodFormatter.parseMutablePeriod(PeriodFormatter.java:330)
	at org.joda.time.format.PeriodFormatter.parsePeriod(PeriodFormatter.java:308)
	at org.joda.time.format.TestISOPeriodFormatParsing.testParseStandard2(TestISOPeriodFormatParsing.java:101)

testParseStandard3(org.joda.time.format.TestISOPeriodFormatParsing)  Time elapsed: 0 sec  <<< ERROR!
java.lang.IllegalArgumentException: Invalid format: "P0DT5H6M7.008S" is malformed at "7.008S"
	at org.joda.time.format.PeriodFormatter.parseMutablePeriod(PeriodFormatter.java:330)
	at org.joda.time.format.PeriodFormatter.parsePeriod(PeriodFormatter.java:308)
	at org.joda.time.format.TestISOPeriodFormatParsing.testParseStandard3(TestISOPeriodFormatParsing.java:108)

testParseStandard4(org.joda.time.format.TestISOPeriodFormatParsing)  Time elapsed: 0.001 sec  <<< ERROR!
java.lang.IllegalArgumentException: Invalid format: "P2Y3DT5H6M7.008S" is malformed at "7.008S"
	at org.joda.time.format.PeriodFormatter.parseMutablePeriod(PeriodFormatter.java:330)
	at org.joda.time.format.PeriodFormatter.parsePeriod(PeriodFormatter.java:308)
	at org.joda.time.format.TestISOPeriodFormatParsing.testParseStandard4(TestISOPeriodFormatParsing.java:115)

testParseStandard5(org.joda.time.format.TestISOPeriodFormatParsing)  Time elapsed: 0.001 sec  <<< ERROR!
java.lang.IllegalArgumentException: Invalid format: "P2YT5H6M7.008S" is malformed at "7.008S"
	at org.joda.time.format.PeriodFormatter.parseMutablePeriod(PeriodFormatter.java:330)
	at org.joda.time.format.PeriodFormatter.parsePeriod(PeriodFormatter.java:308)
	at org.joda.time.format.TestISOPeriodFormatParsing.testParseStandard5(TestISOPeriodFormatParsing.java:122)

testParseStandard6(org.joda.time.format.TestISOPeriodFormatParsing)  Time elapsed: 0 sec  <<< ERROR!
java.lang.IllegalArgumentException: Invalid format: "PT5H6M7.008S" is malformed at "7.008S"
	at org.joda.time.format.PeriodFormatter.parseMutablePeriod(PeriodFormatter.java:330)
	at org.joda.time.format.PeriodFormatter.parsePeriod(PeriodFormatter.java:308)
	at org.joda.time.format.TestISOPeriodFormatParsing.testParseStandard6(TestISOPeriodFormatParsing.java:129)

testParseStandard1(org.joda.time.format.TestISOPeriodFormatParsing)  Time elapsed: 0.001 sec  <<< ERROR!
java.lang.IllegalArgumentException: Invalid format: "P1Y2M3W4DT5H6M7.008S" is malformed at "7.008S"
	at org.joda.time.format.PeriodFormatter.parseMutablePeriod(PeriodFormatter.java:330)
	at org.joda.time.format.PeriodFormatter.parsePeriod(PeriodFormatter.java:308)
	at org.joda.time.format.TestISOPeriodFormatParsing.testParseStandard1(TestISOPeriodFormatParsing.java:94)

testParseNegativeMillis2(org.joda.time.format.TestPeriodFormatParsing)  Time elapsed: 0 sec  <<< ERROR!
java.lang.IllegalArgumentException: Invalid format: "PT-0.999S" is malformed at "-0.999S"
	at org.joda.time.format.PeriodFormatter.parseMutablePeriod(PeriodFormatter.java:330)
	at org.joda.time.format.PeriodFormatter.parsePeriod(PeriodFormatter.java:308)
	at org.joda.time.Period.parse(Period.java:92)
	at org.joda.time.Period.parse(Period.java:81)
	at org.joda.time.format.TestPeriodFormatParsing.testParseNegativeMillis2(TestPeriodFormatParsing.java:110)

testParseNegativeMillis1(org.joda.time.format.TestPeriodFormatParsing)  Time elapsed: 0 sec  <<< ERROR!
java.lang.IllegalArgumentException: Invalid format: "PT-0.001S" is malformed at "-0.001S"
	at org.joda.time.format.PeriodFormatter.parseMutablePeriod(PeriodFormatter.java:330)
	at org.joda.time.format.PeriodFormatter.parsePeriod(PeriodFormatter.java:308)
	at org.joda.time.Period.parse(Period.java:92)
	at org.joda.time.Period.parse(Period.java:81)
	at org.joda.time.format.TestPeriodFormatParsing.testParseNegativeMillis1(TestPeriodFormatParsing.java:102)


Results :

Failed tests: 
  org.joda.time.format.TestPeriodFormatter#testParseInto_simple AssertionFailedError
Tests in error: 
  org.joda.time.TestMutablePeriod_Constructors#testParse_noFormatter IllegalArgumentException
  org.joda.time.TestPeriod_Constructors#testParse_noFormatter IllegalArgumentException
  org.joda.time.TestStringConvert#testMutablePeriod IllegalArgumentException Inv...
  org.joda.time.TestStringConvert#testPeriod IllegalArgumentException Invalid fo...
  org.joda.time.convert.TestStringConverter#testSetIntoPeriod_Object3 IllegalArgumentException
  org.joda.time.convert.TestStringConverter#testSetIntoPeriod_Object4 IllegalArgumentException
  org.joda.time.convert.TestStringConverter#testSetIntoPeriod_Object5 IllegalArgumentException
  org.joda.time.convert.TestStringConverter#testSetIntoPeriod_Object6 IllegalArgumentException
  org.joda.time.format.TestISOPeriodFormatParsing#testParseStandard1 IllegalArgumentException
  org.joda.time.format.TestISOPeriodFormatParsing#testParseStandard2 IllegalArgumentException
  org.joda.time.format.TestISOPeriodFormatParsing#testParseStandard3 IllegalArgumentException
  org.joda.time.format.TestISOPeriodFormatParsing#testParseStandard4 IllegalArgumentException
  org.joda.time.format.TestISOPeriodFormatParsing#testParseStandard5 IllegalArgumentException
  org.joda.time.format.TestISOPeriodFormatParsing#testParseStandard6 IllegalArgumentException
  org.joda.time.format.TestPeriodFormatParsing#testParseNegativeMillis1 IllegalArgumentException
  org.joda.time.format.TestPeriodFormatParsing#testParseNegativeMillis2 IllegalArgumentException
  org.joda.time.format.TestPeriodFormatter#testParseMutablePeriod_simple IllegalArgumentException
  org.joda.time.format.TestPeriodFormatter#testParsePeriod_parseType IllegalArgumentException
  org.joda.time.format.TestPeriodFormatter#testParsePeriod_simple IllegalArgumentException
  org.joda.time.format.TestPeriodFormatter#testPrinterParserMethods IllegalArgumentException

Tests run: 4157, Failures: 1, Errors: 20, Skipped: 0

[INFO] ------------------------------------------------------------------------
[INFO] BUILD FAILURE
[INFO] ------------------------------------------------------------------------
[INFO] Total time: 15.813s
[INFO] Finished at: Thu Aug 06 10:53:36 BST 2015
[INFO] Final Memory: 9M/213M
[INFO] ------------------------------------------------------------------------
[ERROR] Failed to execute goal org.apache.maven.plugins:maven-surefire-plugin:2.18.1:test (default-test) on project joda-time: There are test failures.
[ERROR] 
[ERROR] Please refer to /home/perham/Study/LittleDarwin/Cases/joda-time-2.8.1/target/surefire-reports for the individual test results.
[ERROR] -> [Help 1]
[ERROR] 
[ERROR] To see the full stack trace of the errors, re-run Maven with the -e switch.
[ERROR] Re-run Maven using the -X switch to enable full debug logging.
[ERROR] 
[ERROR] For more information about the errors and possible solutions, please read the following articles:
[ERROR] [Help 1] http://cwiki.apache.org/confluence/display/MAVEN/MojoFailureException
