[INFO] Scanning for projects...
[INFO]                                                                         
[INFO] ------------------------------------------------------------------------
[INFO] Building Joda-Time 2.8.1
[INFO] ------------------------------------------------------------------------
[INFO] 
[INFO] --- maven-resources-plugin:2.7:resources (default-resources) @ joda-time ---
[INFO] Using 'UTF-8' encoding to copy filtered resources.
[INFO] Copying 2 resources to META-INF
[INFO] Copying 10 resources
[INFO] 
[INFO] --- maven-compiler-plugin:3.3:compile (default-compile) @ joda-time ---
[INFO] Changes detected - recompiling the module!
[INFO] Compiling 166 source files to /home/perham/Study/LittleDarwin/Cases/joda-time-2.8.1/target/classes
[INFO] 
[INFO] --- exec-maven-plugin:1.4.0:java (compile-tzdb) @ joda-time ---
Writing zoneinfo files
Writing ZoneInfoMap
[INFO] 
[INFO] --- maven-resources-plugin:2.7:testResources (default-testResources) @ joda-time ---
[INFO] Using 'UTF-8' encoding to copy filtered resources.
[INFO] Copying 34 resources
[INFO] 
[INFO] --- maven-compiler-plugin:3.3:testCompile (default-testCompile) @ joda-time ---
[INFO] Nothing to compile - all classes are up to date
[INFO] 
[INFO] --- maven-surefire-plugin:2.18.1:test (default-test) @ joda-time ---
[INFO] Surefire report directory: /home/perham/Study/LittleDarwin/Cases/joda-time-2.8.1/target/surefire-reports

-------------------------------------------------------
 T E S T S
-------------------------------------------------------
Running org.joda.time.TestAllPackages

TestBuddhistChronology.testCalendar

TestCopticChronology.testCalendar

TestEthiopicChronology.testCalendar

TestIslamicChronology.testCalendar

Testing Gregorian chronology over 1000 iterations
100% complete (i=1000)

Testing Julian chronology over 1000 iterations
100% complete (i=1000)
Writing zoneinfo files
Writing ZoneInfoMap
Tests run: 4157, Failures: 105, Errors: 0, Skipped: 0, Time elapsed: 5.485 sec <<< FAILURE! - in org.joda.time.TestAllPackages
testToString(org.joda.time.TestPeriod_Basics)  Time elapsed: 0.004 sec  <<< FAILURE!
junit.framework.ComparisonFailure: expected:<P[1Y2M3W4DT5H6M7.008S]> but was:<P[]>
	at junit.framework.Assert.assertEquals(Assert.java:81)
	at junit.framework.Assert.assertEquals(Assert.java:87)
	at org.joda.time.TestPeriod_Basics.testToString(TestPeriod_Basics.java:472)

testToString_PeriodFormatter(org.joda.time.TestPeriod_Basics)  Time elapsed: 0.006 sec  <<< FAILURE!
junit.framework.ComparisonFailure: expected:<[1 year, 2 months, 3 weeks, 4 days, 5 hours, 6 minutes, 7 seconds and 8 milliseconds]> but was:<[]>
	at junit.framework.Assert.assertEquals(Assert.java:81)
	at junit.framework.Assert.assertEquals(Assert.java:87)
	at org.joda.time.TestPeriod_Basics.testToString_PeriodFormatter(TestPeriod_Basics.java:484)

testToString_nullPeriodFormatter(org.joda.time.TestPeriod_Basics)  Time elapsed: 0.001 sec  <<< FAILURE!
junit.framework.ComparisonFailure: expected:<P[1Y2M3W4DT5H6M7.008S]> but was:<P[]>
	at junit.framework.Assert.assertEquals(Assert.java:81)
	at junit.framework.Assert.assertEquals(Assert.java:87)
	at org.joda.time.TestPeriod_Basics.testToString_nullPeriodFormatter(TestPeriod_Basics.java:492)

testToString(org.joda.time.TestMutablePeriod_Basics)  Time elapsed: 0.001 sec  <<< FAILURE!
junit.framework.ComparisonFailure: expected:<P[1Y2M3W4DT5H6M7.008S]> but was:<P[]>
	at junit.framework.Assert.assertEquals(Assert.java:81)
	at junit.framework.Assert.assertEquals(Assert.java:87)
	at org.joda.time.TestMutablePeriod_Basics.testToString(TestMutablePeriod_Basics.java:405)

testPeriod(org.joda.time.TestDateTimeZoneCutover)  Time elapsed: 0.001 sec  <<< FAILURE!
junit.framework.ComparisonFailure: expected:<P[T1M]> but was:<P[]>
	at junit.framework.Assert.assertEquals(Assert.java:81)
	at junit.framework.Assert.assertEquals(Assert.java:87)
	at org.joda.time.TestDateTimeZoneCutover.testPeriod(TestDateTimeZoneCutover.java:1250)

testPeriod(org.joda.time.TestStringConvert)  Time elapsed: 0.03 sec  <<< FAILURE!
junit.framework.ComparisonFailure: expected:<P[1Y2M3W4DT5H6M7.008S]> but was:<P[]>
	at junit.framework.Assert.assertEquals(Assert.java:81)
	at junit.framework.Assert.assertEquals(Assert.java:87)
	at org.joda.time.TestStringConvert.testPeriod(TestStringConvert.java:143)

testMutablePeriod(org.joda.time.TestStringConvert)  Time elapsed: 0.001 sec  <<< FAILURE!
junit.framework.ComparisonFailure: expected:<P[1Y2M3W4DT5H6M7.008S]> but was:<P[]>
	at junit.framework.Assert.assertEquals(Assert.java:81)
	at junit.framework.Assert.assertEquals(Assert.java:87)
	at org.joda.time.TestStringConvert.testMutablePeriod(TestStringConvert.java:150)

testPrint_simple(org.joda.time.format.TestPeriodFormatter)  Time elapsed: 0.001 sec  <<< FAILURE!
junit.framework.ComparisonFailure: expected:<P[1Y2M3W4DT5H6M7.008S]> but was:<P[]>
	at junit.framework.Assert.assertEquals(Assert.java:81)
	at junit.framework.Assert.assertEquals(Assert.java:87)
	at org.joda.time.format.TestPeriodFormatter.testPrint_simple(TestPeriodFormatter.java:101)

testPrint_bufferMethods(org.joda.time.format.TestPeriodFormatter)  Time elapsed: 0 sec  <<< FAILURE!
junit.framework.ComparisonFailure: expected:<P[1Y2M3W4DT5H6M7.008S]> but was:<P[]>
	at junit.framework.Assert.assertEquals(Assert.java:81)
	at junit.framework.Assert.assertEquals(Assert.java:87)
	at org.joda.time.format.TestPeriodFormatter.testPrint_bufferMethods(TestPeriodFormatter.java:109)

testPrint_writerMethods(org.joda.time.format.TestPeriodFormatter)  Time elapsed: 0.001 sec  <<< FAILURE!
junit.framework.ComparisonFailure: expected:<P[1Y2M3W4DT5H6M7.008S]> but was:<P[]>
	at junit.framework.Assert.assertEquals(Assert.java:81)
	at junit.framework.Assert.assertEquals(Assert.java:87)
	at org.joda.time.format.TestPeriodFormatter.testPrint_writerMethods(TestPeriodFormatter.java:123)

test_wordBased_pl_formatTwoFields(org.joda.time.format.TestPeriodFormat)  Time elapsed: 0.006 sec  <<< FAILURE!
junit.framework.ComparisonFailure: expected:<[2 dni i 5 godzin]> but was:<[]>
	at junit.framework.Assert.assertEquals(Assert.java:81)
	at junit.framework.Assert.assertEquals(Assert.java:87)
	at org.joda.time.format.TestPeriodFormat.test_wordBased_pl_formatTwoFields(TestPeriodFormat.java:392)

test_wordBased_pl_regEx(org.joda.time.format.TestPeriodFormat)  Time elapsed: 0 sec  <<< FAILURE!
junit.framework.ComparisonFailure: expected:<[1 rok]> but was:<[]>
	at junit.framework.Assert.assertEquals(Assert.java:81)
	at junit.framework.Assert.assertEquals(Assert.java:87)
	at org.joda.time.format.TestPeriodFormat.test_wordBased_pl_regEx(TestPeriodFormat.java:425)

test_wordBased_fr_from_de(org.joda.time.format.TestPeriodFormat)  Time elapsed: 0.002 sec  <<< FAILURE!
junit.framework.ComparisonFailure: expected:<[1 jour, 5 heures, 6 minutes, 7 secondes et 8 millisecondes]> but was:<[]>
	at junit.framework.Assert.assertEquals(Assert.java:81)
	at junit.framework.Assert.assertEquals(Assert.java:87)
	at org.joda.time.format.TestPeriodFormat.test_wordBased_fr_from_de(TestPeriodFormat.java:580)

test_wordBased_fr_from_nl(org.joda.time.format.TestPeriodFormat)  Time elapsed: 0 sec  <<< FAILURE!
junit.framework.ComparisonFailure: expected:<[1 jour, 5 heures, 6 minutes, 7 secondes et 8 millisecondes]> but was:<[]>
	at junit.framework.Assert.assertEquals(Assert.java:81)
	at junit.framework.Assert.assertEquals(Assert.java:87)
	at org.joda.time.format.TestPeriodFormat.test_wordBased_fr_from_nl(TestPeriodFormat.java:586)

test_wordBased_en_from_de(org.joda.time.format.TestPeriodFormat)  Time elapsed: 0.001 sec  <<< FAILURE!
junit.framework.ComparisonFailure: expected:<[1 day, 5 hours, 6 minutes, 7 seconds and 8 milliseconds]> but was:<[]>
	at junit.framework.Assert.assertEquals(Assert.java:81)
	at junit.framework.Assert.assertEquals(Assert.java:87)
	at org.joda.time.format.TestPeriodFormat.test_wordBased_en_from_de(TestPeriodFormat.java:592)

test_wordBased_en_from_nl(org.joda.time.format.TestPeriodFormat)  Time elapsed: 0 sec  <<< FAILURE!
junit.framework.ComparisonFailure: expected:<[1 day, 5 hours, 6 minutes, 7 seconds and 8 milliseconds]> but was:<[]>
	at junit.framework.Assert.assertEquals(Assert.java:81)
	at junit.framework.Assert.assertEquals(Assert.java:87)
	at org.joda.time.format.TestPeriodFormat.test_wordBased_en_from_nl(TestPeriodFormat.java:598)

test_wordBased_en_from_pl(org.joda.time.format.TestPeriodFormat)  Time elapsed: 0.001 sec  <<< FAILURE!
junit.framework.ComparisonFailure: expected:<[1 day, 5 hours, 6 minutes, 7 seconds and 8 milliseconds]> but was:<[]>
	at junit.framework.Assert.assertEquals(Assert.java:81)
	at junit.framework.Assert.assertEquals(Assert.java:87)
	at org.joda.time.format.TestPeriodFormat.test_wordBased_en_from_pl(TestPeriodFormat.java:604)

test_wordBased_pl_from_fr(org.joda.time.format.TestPeriodFormat)  Time elapsed: 0 sec  <<< FAILURE!
junit.framework.ComparisonFailure: expected:<[1 dzień, 5 godzin, 6 minut, 7 sekund i 8 milisekund]> but was:<[]>
	at junit.framework.Assert.assertEquals(Assert.java:81)
	at junit.framework.Assert.assertEquals(Assert.java:87)
	at org.joda.time.format.TestPeriodFormat.test_wordBased_pl_from_fr(TestPeriodFormat.java:610)

test_wordBased_en_withLocale_pt(org.joda.time.format.TestPeriodFormat)  Time elapsed: 0 sec  <<< FAILURE!
junit.framework.ComparisonFailure: expected:<[2 days and 5 hours]> but was:<[]>
	at junit.framework.Assert.assertEquals(Assert.java:81)
	at junit.framework.Assert.assertEquals(Assert.java:87)
	at org.joda.time.format.TestPeriodFormat.test_wordBased_en_withLocale_pt(TestPeriodFormat.java:633)

test_wordBased_ja_formatMultiple(org.joda.time.format.TestPeriodFormat)  Time elapsed: 0.002 sec  <<< FAILURE!
junit.framework.ComparisonFailure: expected:<[2年3か月4週間2日5時間6分7秒8ミリ秒]> but was:<[]>
	at junit.framework.Assert.assertEquals(Assert.java:81)
	at junit.framework.Assert.assertEquals(Assert.java:87)
	at org.joda.time.format.TestPeriodFormat.test_wordBased_ja_formatMultiple(TestPeriodFormat.java:338)

test_wordBased_ja_formatSingular(org.joda.time.format.TestPeriodFormat)  Time elapsed: 0.001 sec  <<< FAILURE!
junit.framework.ComparisonFailure: expected:<[1年1か月1週間1日1時間1分1秒1ミリ秒]> but was:<[]>
	at junit.framework.Assert.assertEquals(Assert.java:81)
	at junit.framework.Assert.assertEquals(Assert.java:87)
	at org.joda.time.format.TestPeriodFormat.test_wordBased_ja_formatSingular(TestPeriodFormat.java:344)

test_wordBased_pl_formatStandard(org.joda.time.format.TestPeriodFormat)  Time elapsed: 0.001 sec  <<< FAILURE!
junit.framework.ComparisonFailure: expected:<[1 dzień, 5 godzin, 6 minut, 7 sekund i 8 milisekund]> but was:<[]>
	at junit.framework.Assert.assertEquals(Assert.java:81)
	at junit.framework.Assert.assertEquals(Assert.java:87)
	at org.joda.time.format.TestPeriodFormat.test_wordBased_pl_formatStandard(TestPeriodFormat.java:380)

test_wordBased_pl_FormatOneField(org.joda.time.format.TestPeriodFormat)  Time elapsed: 0.001 sec  <<< FAILURE!
junit.framework.ComparisonFailure: expected:<[2 dni]> but was:<[]>
	at junit.framework.Assert.assertEquals(Assert.java:81)
	at junit.framework.Assert.assertEquals(Assert.java:87)
	at org.joda.time.format.TestPeriodFormat.test_wordBased_pl_FormatOneField(TestPeriodFormat.java:386)

test_getDefault_formatStandard(org.joda.time.format.TestPeriodFormat)  Time elapsed: 0 sec  <<< FAILURE!
junit.framework.ComparisonFailure: expected:<[1 day, 5 hours, 6 minutes, 7 seconds and 8 milliseconds]> but was:<[]>
	at junit.framework.Assert.assertEquals(Assert.java:81)
	at junit.framework.Assert.assertEquals(Assert.java:87)
	at org.joda.time.format.TestPeriodFormat.test_getDefault_formatStandard(TestPeriodFormat.java:79)

test_getDefault_FormatOneField(org.joda.time.format.TestPeriodFormat)  Time elapsed: 0.001 sec  <<< FAILURE!
junit.framework.ComparisonFailure: expected:<[2 days]> but was:<[]>
	at junit.framework.Assert.assertEquals(Assert.java:81)
	at junit.framework.Assert.assertEquals(Assert.java:87)
	at org.joda.time.format.TestPeriodFormat.test_getDefault_FormatOneField(TestPeriodFormat.java:85)

test_getDefault_formatTwoFields(org.joda.time.format.TestPeriodFormat)  Time elapsed: 0.001 sec  <<< FAILURE!
junit.framework.ComparisonFailure: expected:<[2 days and 5 hours]> but was:<[]>
	at junit.framework.Assert.assertEquals(Assert.java:81)
	at junit.framework.Assert.assertEquals(Assert.java:87)
	at org.joda.time.format.TestPeriodFormat.test_getDefault_formatTwoFields(TestPeriodFormat.java:91)

test_wordBased_default(org.joda.time.format.TestPeriodFormat)  Time elapsed: 0 sec  <<< FAILURE!
junit.framework.ComparisonFailure: expected:<[1 Tag, 5 Stunden, 6 Minuten, 7 Sekunden und 8 Millisekunden]> but was:<[]>
	at junit.framework.Assert.assertEquals(Assert.java:81)
	at junit.framework.Assert.assertEquals(Assert.java:87)
	at org.joda.time.format.TestPeriodFormat.test_wordBased_default(TestPeriodFormat.java:126)

test_wordBased_fr_formatStandard(org.joda.time.format.TestPeriodFormat)  Time elapsed: 0 sec  <<< FAILURE!
junit.framework.ComparisonFailure: expected:<[1 jour, 5 heures, 6 minutes, 7 secondes et 8 millisecondes]> but was:<[]>
	at junit.framework.Assert.assertEquals(Assert.java:81)
	at junit.framework.Assert.assertEquals(Assert.java:87)
	at org.joda.time.format.TestPeriodFormat.test_wordBased_fr_formatStandard(TestPeriodFormat.java:134)

test_wordBased_fr_FormatOneField(org.joda.time.format.TestPeriodFormat)  Time elapsed: 0.001 sec  <<< FAILURE!
junit.framework.ComparisonFailure: expected:<[2 jours]> but was:<[]>
	at junit.framework.Assert.assertEquals(Assert.java:81)
	at junit.framework.Assert.assertEquals(Assert.java:87)
	at org.joda.time.format.TestPeriodFormat.test_wordBased_fr_FormatOneField(TestPeriodFormat.java:140)

test_wordBased_fr_formatTwoFields(org.joda.time.format.TestPeriodFormat)  Time elapsed: 0.001 sec  <<< FAILURE!
junit.framework.ComparisonFailure: expected:<[2 jours et 5 heures]> but was:<[]>
	at junit.framework.Assert.assertEquals(Assert.java:81)
	at junit.framework.Assert.assertEquals(Assert.java:87)
	at org.joda.time.format.TestPeriodFormat.test_wordBased_fr_formatTwoFields(TestPeriodFormat.java:146)

test_wordBased_pt_formatStandard(org.joda.time.format.TestPeriodFormat)  Time elapsed: 0.003 sec  <<< FAILURE!
junit.framework.ComparisonFailure: expected:<[1 dia, 5 horas, 6 minutos, 7 segundos e 8 milissegundos]> but was:<[]>
	at junit.framework.Assert.assertEquals(Assert.java:81)
	at junit.framework.Assert.assertEquals(Assert.java:87)
	at org.joda.time.format.TestPeriodFormat.test_wordBased_pt_formatStandard(TestPeriodFormat.java:171)

test_wordBased_pt_FormatOneField(org.joda.time.format.TestPeriodFormat)  Time elapsed: 0.001 sec  <<< FAILURE!
junit.framework.ComparisonFailure: expected:<[2 dias]> but was:<[]>
	at junit.framework.Assert.assertEquals(Assert.java:81)
	at junit.framework.Assert.assertEquals(Assert.java:87)
	at org.joda.time.format.TestPeriodFormat.test_wordBased_pt_FormatOneField(TestPeriodFormat.java:177)

test_wordBased_pt_formatTwoFields(org.joda.time.format.TestPeriodFormat)  Time elapsed: 0.001 sec  <<< FAILURE!
junit.framework.ComparisonFailure: expected:<[2 dias e 5 horas]> but was:<[]>
	at junit.framework.Assert.assertEquals(Assert.java:81)
	at junit.framework.Assert.assertEquals(Assert.java:87)
	at org.joda.time.format.TestPeriodFormat.test_wordBased_pt_formatTwoFields(TestPeriodFormat.java:183)

test_wordBased_es_formatStandard(org.joda.time.format.TestPeriodFormat)  Time elapsed: 0.003 sec  <<< FAILURE!
junit.framework.ComparisonFailure: expected:<[1 día, 5 horas, 6 minutos, 7 segundos y 8 milisegundos]> but was:<[]>
	at junit.framework.Assert.assertEquals(Assert.java:81)
	at junit.framework.Assert.assertEquals(Assert.java:87)
	at org.joda.time.format.TestPeriodFormat.test_wordBased_es_formatStandard(TestPeriodFormat.java:208)

test_wordBased_es_FormatOneField(org.joda.time.format.TestPeriodFormat)  Time elapsed: 0.001 sec  <<< FAILURE!
junit.framework.ComparisonFailure: expected:<[2 días]> but was:<[]>
	at junit.framework.Assert.assertEquals(Assert.java:81)
	at junit.framework.Assert.assertEquals(Assert.java:87)
	at org.joda.time.format.TestPeriodFormat.test_wordBased_es_FormatOneField(TestPeriodFormat.java:214)

test_wordBased_es_formatTwoFields(org.joda.time.format.TestPeriodFormat)  Time elapsed: 0 sec  <<< FAILURE!
junit.framework.ComparisonFailure: expected:<[2 días y 5 horas]> but was:<[]>
	at junit.framework.Assert.assertEquals(Assert.java:81)
	at junit.framework.Assert.assertEquals(Assert.java:87)
	at org.joda.time.format.TestPeriodFormat.test_wordBased_es_formatTwoFields(TestPeriodFormat.java:220)

test_wordBased_de_formatStandard(org.joda.time.format.TestPeriodFormat)  Time elapsed: 0 sec  <<< FAILURE!
junit.framework.ComparisonFailure: expected:<[1 Tag, 5 Stunden, 6 Minuten, 7 Sekunden und 8 Millisekunden]> but was:<[]>
	at junit.framework.Assert.assertEquals(Assert.java:81)
	at junit.framework.Assert.assertEquals(Assert.java:87)
	at org.joda.time.format.TestPeriodFormat.test_wordBased_de_formatStandard(TestPeriodFormat.java:245)

test_wordBased_de_FormatOneField(org.joda.time.format.TestPeriodFormat)  Time elapsed: 0.001 sec  <<< FAILURE!
junit.framework.ComparisonFailure: expected:<[2 Tage]> but was:<[]>
	at junit.framework.Assert.assertEquals(Assert.java:81)
	at junit.framework.Assert.assertEquals(Assert.java:87)
	at org.joda.time.format.TestPeriodFormat.test_wordBased_de_FormatOneField(TestPeriodFormat.java:251)

test_wordBased_de_formatTwoFields(org.joda.time.format.TestPeriodFormat)  Time elapsed: 0 sec  <<< FAILURE!
junit.framework.ComparisonFailure: expected:<[2 Tage und 5 Stunden]> but was:<[]>
	at junit.framework.Assert.assertEquals(Assert.java:81)
	at junit.framework.Assert.assertEquals(Assert.java:87)
	at org.joda.time.format.TestPeriodFormat.test_wordBased_de_formatTwoFields(TestPeriodFormat.java:257)

test_wordBased_nl_formatStandard(org.joda.time.format.TestPeriodFormat)  Time elapsed: 0.002 sec  <<< FAILURE!
junit.framework.ComparisonFailure: expected:<[1 dag, 5 uur, 6 minuten, 7 seconden en 8 milliseconden]> but was:<[]>
	at junit.framework.Assert.assertEquals(Assert.java:81)
	at junit.framework.Assert.assertEquals(Assert.java:87)
	at org.joda.time.format.TestPeriodFormat.test_wordBased_nl_formatStandard(TestPeriodFormat.java:282)

test_wordBased_nl_FormatOneField(org.joda.time.format.TestPeriodFormat)  Time elapsed: 0.001 sec  <<< FAILURE!
junit.framework.ComparisonFailure: expected:<[2 dagen]> but was:<[]>
	at junit.framework.Assert.assertEquals(Assert.java:81)
	at junit.framework.Assert.assertEquals(Assert.java:87)
	at org.joda.time.format.TestPeriodFormat.test_wordBased_nl_FormatOneField(TestPeriodFormat.java:288)

test_wordBased_nl_formatTwoFields(org.joda.time.format.TestPeriodFormat)  Time elapsed: 0 sec  <<< FAILURE!
junit.framework.ComparisonFailure: expected:<[2 dagen en 5 uur]> but was:<[]>
	at junit.framework.Assert.assertEquals(Assert.java:81)
	at junit.framework.Assert.assertEquals(Assert.java:87)
	at org.joda.time.format.TestPeriodFormat.test_wordBased_nl_formatTwoFields(TestPeriodFormat.java:294)

test_wordBased_da_formatMultiple(org.joda.time.format.TestPeriodFormat)  Time elapsed: 0.002 sec  <<< FAILURE!
junit.framework.ComparisonFailure: expected:<[2 år, 3 måneder, 4 uger, 2 dage, 5 timer, 6 minutter, 7 sekunder og 8 millisekunder]> but was:<[]>
	at junit.framework.Assert.assertEquals(Assert.java:81)
	at junit.framework.Assert.assertEquals(Assert.java:87)
	at org.joda.time.format.TestPeriodFormat.test_wordBased_da_formatMultiple(TestPeriodFormat.java:319)

test_wordBased_da_formatSinglular(org.joda.time.format.TestPeriodFormat)  Time elapsed: 0.001 sec  <<< FAILURE!
junit.framework.ComparisonFailure: expected:<[1 år, 1 måned, 1 uge, 1 dag, 1 time, 1 minut, 1 sekund og 1 millisekund]> but was:<[]>
	at junit.framework.Assert.assertEquals(Assert.java:81)
	at junit.framework.Assert.assertEquals(Assert.java:87)
	at org.joda.time.format.TestPeriodFormat.test_wordBased_da_formatSinglular(TestPeriodFormat.java:325)

testFormatStandard(org.joda.time.format.TestISOPeriodFormat)  Time elapsed: 0.002 sec  <<< FAILURE!
junit.framework.ComparisonFailure: expected:<P[1Y2M3W4DT5H6M7.008S]> but was:<P[]>
	at junit.framework.Assert.assertEquals(Assert.java:81)
	at junit.framework.Assert.assertEquals(Assert.java:87)
	at org.joda.time.format.TestISOPeriodFormat.testFormatStandard(TestISOPeriodFormat.java:103)

testFormatStandard_negative(org.joda.time.format.TestISOPeriodFormat)  Time elapsed: 0 sec  <<< FAILURE!
junit.framework.ComparisonFailure: expected:<P[-1Y-2M-3W-4DT-5H-6M-7.008S]> but was:<P[]>
	at junit.framework.Assert.assertEquals(Assert.java:81)
	at junit.framework.Assert.assertEquals(Assert.java:87)
	at org.joda.time.format.TestISOPeriodFormat.testFormatStandard_negative(TestISOPeriodFormat.java:120)

testParseNegativeMillis1(org.joda.time.format.TestPeriodFormatParsing)  Time elapsed: 0.006 sec  <<< FAILURE!
junit.framework.ComparisonFailure: expected:<P[T-0.001S]> but was:<P[]>
	at junit.framework.Assert.assertEquals(Assert.java:81)
	at junit.framework.Assert.assertEquals(Assert.java:87)
	at org.joda.time.format.TestPeriodFormatParsing.testParseNegativeMillis1(TestPeriodFormatParsing.java:101)

testParseNegativeMillis2(org.joda.time.format.TestPeriodFormatParsing)  Time elapsed: 0 sec  <<< FAILURE!
junit.framework.ComparisonFailure: expected:<P[T-0.999S]> but was:<P[]>
	at junit.framework.Assert.assertEquals(Assert.java:81)
	at junit.framework.Assert.assertEquals(Assert.java:87)
	at org.joda.time.format.TestPeriodFormatParsing.testParseNegativeMillis2(TestPeriodFormatParsing.java:109)

testFormatMillis3Digit(org.joda.time.format.TestPeriodFormatterBuilder)  Time elapsed: 0 sec  <<< FAILURE!
junit.framework.ComparisonFailure: expected:<[008]> but was:<[]>
	at junit.framework.Assert.assertEquals(Assert.java:81)
	at junit.framework.Assert.assertEquals(Assert.java:87)
	at org.joda.time.format.TestPeriodFormatterBuilder.testFormatMillis3Digit(TestPeriodFormatterBuilder.java:301)

testFormatPrefixSimple1(org.joda.time.format.TestPeriodFormatterBuilder)  Time elapsed: 0.001 sec  <<< FAILURE!
junit.framework.ComparisonFailure: expected:<[Years:1]> but was:<[]>
	at junit.framework.Assert.assertEquals(Assert.java:81)
	at junit.framework.Assert.assertEquals(Assert.java:87)
	at org.joda.time.format.TestPeriodFormatterBuilder.testFormatPrefixSimple1(TestPeriodFormatterBuilder.java:314)

testFormatPrefixSimple2(org.joda.time.format.TestPeriodFormatterBuilder)  Time elapsed: 0 sec  <<< FAILURE!
junit.framework.ComparisonFailure: expected:<[Hours:5]> but was:<[]>
	at junit.framework.Assert.assertEquals(Assert.java:81)
	at junit.framework.Assert.assertEquals(Assert.java:87)
	at org.joda.time.format.TestPeriodFormatterBuilder.testFormatPrefixSimple2(TestPeriodFormatterBuilder.java:326)

testFormatYears(org.joda.time.format.TestPeriodFormatterBuilder)  Time elapsed: 0 sec  <<< FAILURE!
junit.framework.ComparisonFailure: expected:<[1]> but was:<[]>
	at junit.framework.Assert.assertEquals(Assert.java:81)
	at junit.framework.Assert.assertEquals(Assert.java:87)
	at org.joda.time.format.TestPeriodFormatterBuilder.testFormatYears(TestPeriodFormatterBuilder.java:109)

testFormatMonths(org.joda.time.format.TestPeriodFormatterBuilder)  Time elapsed: 0 sec  <<< FAILURE!
junit.framework.ComparisonFailure: expected:<[2]> but was:<[]>
	at junit.framework.Assert.assertEquals(Assert.java:81)
	at junit.framework.Assert.assertEquals(Assert.java:87)
	at org.joda.time.format.TestPeriodFormatterBuilder.testFormatMonths(TestPeriodFormatterBuilder.java:121)

testFormatWeeks(org.joda.time.format.TestPeriodFormatterBuilder)  Time elapsed: 0 sec  <<< FAILURE!
junit.framework.ComparisonFailure: expected:<[3]> but was:<[]>
	at junit.framework.Assert.assertEquals(Assert.java:81)
	at junit.framework.Assert.assertEquals(Assert.java:87)
	at org.joda.time.format.TestPeriodFormatterBuilder.testFormatWeeks(TestPeriodFormatterBuilder.java:133)

testFormatDays(org.joda.time.format.TestPeriodFormatterBuilder)  Time elapsed: 0 sec  <<< FAILURE!
junit.framework.ComparisonFailure: expected:<[4]> but was:<[]>
	at junit.framework.Assert.assertEquals(Assert.java:81)
	at junit.framework.Assert.assertEquals(Assert.java:87)
	at org.joda.time.format.TestPeriodFormatterBuilder.testFormatDays(TestPeriodFormatterBuilder.java:145)

testFormatHours(org.joda.time.format.TestPeriodFormatterBuilder)  Time elapsed: 0 sec  <<< FAILURE!
junit.framework.ComparisonFailure: expected:<[5]> but was:<[]>
	at junit.framework.Assert.assertEquals(Assert.java:81)
	at junit.framework.Assert.assertEquals(Assert.java:87)
	at org.joda.time.format.TestPeriodFormatterBuilder.testFormatHours(TestPeriodFormatterBuilder.java:157)

testFormatMinutes(org.joda.time.format.TestPeriodFormatterBuilder)  Time elapsed: 0.001 sec  <<< FAILURE!
junit.framework.ComparisonFailure: expected:<[6]> but was:<[]>
	at junit.framework.Assert.assertEquals(Assert.java:81)
	at junit.framework.Assert.assertEquals(Assert.java:87)
	at org.joda.time.format.TestPeriodFormatterBuilder.testFormatMinutes(TestPeriodFormatterBuilder.java:169)

testFormatSeconds(org.joda.time.format.TestPeriodFormatterBuilder)  Time elapsed: 0 sec  <<< FAILURE!
junit.framework.ComparisonFailure: expected:<[7]> but was:<[]>
	at junit.framework.Assert.assertEquals(Assert.java:81)
	at junit.framework.Assert.assertEquals(Assert.java:87)
	at org.joda.time.format.TestPeriodFormatterBuilder.testFormatSeconds(TestPeriodFormatterBuilder.java:181)

testFormatSecondsWithMillis(org.joda.time.format.TestPeriodFormatterBuilder)  Time elapsed: 0 sec  <<< FAILURE!
junit.framework.ComparisonFailure: expected:<[7.000]> but was:<[]>
	at junit.framework.Assert.assertEquals(Assert.java:81)
	at junit.framework.Assert.assertEquals(Assert.java:87)
	at org.joda.time.format.TestPeriodFormatterBuilder.testFormatSecondsWithMillis(TestPeriodFormatterBuilder.java:194)

testFormatSecondsWithOptionalMillis(org.joda.time.format.TestPeriodFormatterBuilder)  Time elapsed: 0 sec  <<< FAILURE!
junit.framework.ComparisonFailure: expected:<[7]> but was:<[]>
	at junit.framework.Assert.assertEquals(Assert.java:81)
	at junit.framework.Assert.assertEquals(Assert.java:87)
	at org.joda.time.format.TestPeriodFormatterBuilder.testFormatSecondsWithOptionalMillis(TestPeriodFormatterBuilder.java:242)

testFormatMillis(org.joda.time.format.TestPeriodFormatterBuilder)  Time elapsed: 0 sec  <<< FAILURE!
junit.framework.ComparisonFailure: expected:<[8]> but was:<[]>
	at junit.framework.Assert.assertEquals(Assert.java:81)
	at junit.framework.Assert.assertEquals(Assert.java:87)
	at org.joda.time.format.TestPeriodFormatterBuilder.testFormatMillis(TestPeriodFormatterBuilder.java:289)

testFormatPrefixSimple4IgnoringPrefix(org.joda.time.format.TestPeriodFormatterBuilder)  Time elapsed: 0 sec  <<< FAILURE!
junit.framework.ComparisonFailure: expected:<[ms1]> but was:<[]>
	at junit.framework.Assert.assertEquals(Assert.java:81)
	at junit.framework.Assert.assertEquals(Assert.java:87)
	at org.joda.time.format.TestPeriodFormatterBuilder.testFormatPrefixSimple4IgnoringPrefix(TestPeriodFormatterBuilder.java:347)

testPluralAffixParseOrder(org.joda.time.format.TestPeriodFormatterBuilder)  Time elapsed: 0.001 sec  <<< FAILURE!
junit.framework.AssertionFailedError: expected:<P> but was:<P>
	at junit.framework.Assert.fail(Assert.java:47)
	at junit.framework.Assert.failNotEquals(Assert.java:280)
	at junit.framework.Assert.assertEquals(Assert.java:64)
	at junit.framework.Assert.assertEquals(Assert.java:71)
	at org.joda.time.format.TestPeriodFormatterBuilder.testPluralAffixParseOrder(TestPeriodFormatterBuilder.java:358)

testFormatPrefixPlural1(org.joda.time.format.TestPeriodFormatterBuilder)  Time elapsed: 0.001 sec  <<< FAILURE!
junit.framework.ComparisonFailure: expected:<[Year:1]> but was:<[]>
	at junit.framework.Assert.assertEquals(Assert.java:81)
	at junit.framework.Assert.assertEquals(Assert.java:87)
	at org.joda.time.format.TestPeriodFormatterBuilder.testFormatPrefixPlural1(TestPeriodFormatterBuilder.java:365)

testFormatPrefixPlural2(org.joda.time.format.TestPeriodFormatterBuilder)  Time elapsed: 0 sec  <<< FAILURE!
junit.framework.ComparisonFailure: expected:<[Hours:5]> but was:<[]>
	at junit.framework.Assert.assertEquals(Assert.java:81)
	at junit.framework.Assert.assertEquals(Assert.java:87)
	at org.joda.time.format.TestPeriodFormatterBuilder.testFormatPrefixPlural2(TestPeriodFormatterBuilder.java:377)

testFormatPrefixPlural4IgnoringPrefix(org.joda.time.format.TestPeriodFormatterBuilder)  Time elapsed: 0 sec  <<< FAILURE!
junit.framework.ComparisonFailure: expected:<[mss1]> but was:<[]>
	at junit.framework.Assert.assertEquals(Assert.java:81)
	at junit.framework.Assert.assertEquals(Assert.java:87)
	at org.joda.time.format.TestPeriodFormatterBuilder.testFormatPrefixPlural4IgnoringPrefix(TestPeriodFormatterBuilder.java:406)

testRegExAffixParseOrder(org.joda.time.format.TestPeriodFormatterBuilder)  Time elapsed: 0.001 sec  <<< FAILURE!
junit.framework.AssertionFailedError: expected:<P> but was:<P>
	at junit.framework.Assert.fail(Assert.java:47)
	at junit.framework.Assert.failNotEquals(Assert.java:280)
	at junit.framework.Assert.assertEquals(Assert.java:64)
	at junit.framework.Assert.assertEquals(Assert.java:71)
	at org.joda.time.format.TestPeriodFormatterBuilder.testRegExAffixParseOrder(TestPeriodFormatterBuilder.java:425)

testFormatPrefixRegEx1(org.joda.time.format.TestPeriodFormatterBuilder)  Time elapsed: 0.001 sec  <<< FAILURE!
junit.framework.ComparisonFailure: expected:<[Year:1]> but was:<[]>
	at junit.framework.Assert.assertEquals(Assert.java:81)
	at junit.framework.Assert.assertEquals(Assert.java:87)
	at org.joda.time.format.TestPeriodFormatterBuilder.testFormatPrefixRegEx1(TestPeriodFormatterBuilder.java:433)

testFormatPrefixRegEx2(org.joda.time.format.TestPeriodFormatterBuilder)  Time elapsed: 0 sec  <<< FAILURE!
junit.framework.ComparisonFailure: expected:<[Hours:5]> but was:<[]>
	at junit.framework.Assert.assertEquals(Assert.java:81)
	at junit.framework.Assert.assertEquals(Assert.java:87)
	at org.joda.time.format.TestPeriodFormatterBuilder.testFormatPrefixRegEx2(TestPeriodFormatterBuilder.java:446)

testFormatPrefixRegEx4IgnoringPrefix(org.joda.time.format.TestPeriodFormatterBuilder)  Time elapsed: 0.001 sec  <<< FAILURE!
junit.framework.ComparisonFailure: expected:<[mss1]> but was:<[]>
	at junit.framework.Assert.assertEquals(Assert.java:81)
	at junit.framework.Assert.assertEquals(Assert.java:87)
	at org.joda.time.format.TestPeriodFormatterBuilder.testFormatPrefixRegEx4IgnoringPrefix(TestPeriodFormatterBuilder.java:491)

testFormatPrefixComposite1(org.joda.time.format.TestPeriodFormatterBuilder)  Time elapsed: 0.001 sec  <<< FAILURE!
junit.framework.ComparisonFailure: expected:<[days:2]> but was:<[]>
	at junit.framework.Assert.assertEquals(Assert.java:81)
	at junit.framework.Assert.assertEquals(Assert.java:87)
	at org.joda.time.format.TestPeriodFormatterBuilder.testFormatPrefixComposite1(TestPeriodFormatterBuilder.java:512)

testFormatSuffixSimple1(org.joda.time.format.TestPeriodFormatterBuilder)  Time elapsed: 0 sec  <<< FAILURE!
junit.framework.ComparisonFailure: expected:<[1 years]> but was:<[]>
	at junit.framework.Assert.assertEquals(Assert.java:81)
	at junit.framework.Assert.assertEquals(Assert.java:87)
	at org.joda.time.format.TestPeriodFormatterBuilder.testFormatSuffixSimple1(TestPeriodFormatterBuilder.java:522)

testFormatSuffixSimple2(org.joda.time.format.TestPeriodFormatterBuilder)  Time elapsed: 0.001 sec  <<< FAILURE!
junit.framework.ComparisonFailure: expected:<[5 hours]> but was:<[]>
	at junit.framework.Assert.assertEquals(Assert.java:81)
	at junit.framework.Assert.assertEquals(Assert.java:87)
	at org.joda.time.format.TestPeriodFormatterBuilder.testFormatSuffixSimple2(TestPeriodFormatterBuilder.java:534)

testFormatPrefixSimple5IgnoringPrefix(org.joda.time.format.TestPeriodFormatterBuilder)  Time elapsed: 0.001 sec  <<< FAILURE!
junit.framework.ComparisonFailure: expected:<[1ms]> but was:<[]>
	at junit.framework.Assert.assertEquals(Assert.java:81)
	at junit.framework.Assert.assertEquals(Assert.java:87)
	at org.joda.time.format.TestPeriodFormatterBuilder.testFormatPrefixSimple5IgnoringPrefix(TestPeriodFormatterBuilder.java:562)

testFormatPrefixSimple6IgnoringPrefix(org.joda.time.format.TestPeriodFormatterBuilder)  Time elapsed: 0.001 sec  <<< FAILURE!
junit.framework.ComparisonFailure: expected:<[1ms]> but was:<[]>
	at junit.framework.Assert.assertEquals(Assert.java:81)
	at junit.framework.Assert.assertEquals(Assert.java:87)
	at org.joda.time.format.TestPeriodFormatterBuilder.testFormatPrefixSimple6IgnoringPrefix(TestPeriodFormatterBuilder.java:573)

testFormatSuffixPlural1(org.joda.time.format.TestPeriodFormatterBuilder)  Time elapsed: 0 sec  <<< FAILURE!
junit.framework.ComparisonFailure: expected:<[1 year]> but was:<[]>
	at junit.framework.Assert.assertEquals(Assert.java:81)
	at junit.framework.Assert.assertEquals(Assert.java:87)
	at org.joda.time.format.TestPeriodFormatterBuilder.testFormatSuffixPlural1(TestPeriodFormatterBuilder.java:582)

testFormatSuffixPlural2(org.joda.time.format.TestPeriodFormatterBuilder)  Time elapsed: 0.001 sec  <<< FAILURE!
junit.framework.ComparisonFailure: expected:<[5 hours]> but was:<[]>
	at junit.framework.Assert.assertEquals(Assert.java:81)
	at junit.framework.Assert.assertEquals(Assert.java:87)
	at org.joda.time.format.TestPeriodFormatterBuilder.testFormatSuffixPlural2(TestPeriodFormatterBuilder.java:594)

testFormatSuffixPlural4IgnoringPrefix(org.joda.time.format.TestPeriodFormatterBuilder)  Time elapsed: 0.001 sec  <<< FAILURE!
junit.framework.ComparisonFailure: expected:<[1mss]> but was:<[]>
	at junit.framework.Assert.assertEquals(Assert.java:81)
	at junit.framework.Assert.assertEquals(Assert.java:87)
	at org.joda.time.format.TestPeriodFormatterBuilder.testFormatSuffixPlural4IgnoringPrefix(TestPeriodFormatterBuilder.java:630)

testFormatSuffixRegEx1(org.joda.time.format.TestPeriodFormatterBuilder)  Time elapsed: 0.001 sec  <<< FAILURE!
junit.framework.ComparisonFailure: expected:<[1 year]> but was:<[]>
	at junit.framework.Assert.assertEquals(Assert.java:81)
	at junit.framework.Assert.assertEquals(Assert.java:87)
	at org.joda.time.format.TestPeriodFormatterBuilder.testFormatSuffixRegEx1(TestPeriodFormatterBuilder.java:647)

testFormatSuffixRegEx2(org.joda.time.format.TestPeriodFormatterBuilder)  Time elapsed: 0 sec  <<< FAILURE!
junit.framework.ComparisonFailure: expected:<[5 hours]> but was:<[]>
	at junit.framework.Assert.assertEquals(Assert.java:81)
	at junit.framework.Assert.assertEquals(Assert.java:87)
	at org.joda.time.format.TestPeriodFormatterBuilder.testFormatSuffixRegEx2(TestPeriodFormatterBuilder.java:664)

testFormatSuffixRegEx5IgnoringAffix(org.joda.time.format.TestPeriodFormatterBuilder)  Time elapsed: 0 sec  <<< FAILURE!
junit.framework.ComparisonFailure: expected:<[1mss]> but was:<[]>
	at junit.framework.Assert.assertEquals(Assert.java:81)
	at junit.framework.Assert.assertEquals(Assert.java:87)
	at org.joda.time.format.TestPeriodFormatterBuilder.testFormatSuffixRegEx5IgnoringAffix(TestPeriodFormatterBuilder.java:722)

testFormatSuffixComposite1(org.joda.time.format.TestPeriodFormatterBuilder)  Time elapsed: 0.009 sec  <<< FAILURE!
junit.framework.ComparisonFailure: expected:<[2days]> but was:<[]>
	at junit.framework.Assert.assertEquals(Assert.java:81)
	at junit.framework.Assert.assertEquals(Assert.java:87)
	at org.joda.time.format.TestPeriodFormatterBuilder.testFormatSuffixComposite1(TestPeriodFormatterBuilder.java:742)

testFormatSuffixComposite5IgnoringAffix(org.joda.time.format.TestPeriodFormatterBuilder)  Time elapsed: 0 sec  <<< FAILURE!
junit.framework.ComparisonFailure: expected:<[1ms]> but was:<[]>
	at junit.framework.Assert.assertEquals(Assert.java:81)
	at junit.framework.Assert.assertEquals(Assert.java:87)
	at org.joda.time.format.TestPeriodFormatterBuilder.testFormatSuffixComposite5IgnoringAffix(TestPeriodFormatterBuilder.java:756)

testFormatPrefixSuffix(org.joda.time.format.TestPeriodFormatterBuilder)  Time elapsed: 0 sec  <<< FAILURE!
junit.framework.ComparisonFailure: expected:<[P1Y]> but was:<[]>
	at junit.framework.Assert.assertEquals(Assert.java:81)
	at junit.framework.Assert.assertEquals(Assert.java:87)
	at org.joda.time.format.TestPeriodFormatterBuilder.testFormatPrefixSuffix(TestPeriodFormatterBuilder.java:766)

testFormatSeparatorSimple(org.joda.time.format.TestPeriodFormatterBuilder)  Time elapsed: 0 sec  <<< FAILURE!
junit.framework.ComparisonFailure: expected:<[1T5]> but was:<[]>
	at junit.framework.Assert.assertEquals(Assert.java:81)
	at junit.framework.Assert.assertEquals(Assert.java:87)
	at org.joda.time.format.TestPeriodFormatterBuilder.testFormatSeparatorSimple(TestPeriodFormatterBuilder.java:779)

testFormatSeparatorComplex(org.joda.time.format.TestPeriodFormatterBuilder)  Time elapsed: 0 sec  <<< FAILURE!
junit.framework.ComparisonFailure: expected:<[1, 5 and 6]> but was:<[]>
	at junit.framework.Assert.assertEquals(Assert.java:81)
	at junit.framework.Assert.assertEquals(Assert.java:87)
	at org.joda.time.format.TestPeriodFormatterBuilder.testFormatSeparatorComplex(TestPeriodFormatterBuilder.java:798)

testFormatSeparatorIfFieldsAfter(org.joda.time.format.TestPeriodFormatterBuilder)  Time elapsed: 0.001 sec  <<< FAILURE!
junit.framework.ComparisonFailure: expected:<[1T5]> but was:<[]>
	at junit.framework.Assert.assertEquals(Assert.java:81)
	at junit.framework.Assert.assertEquals(Assert.java:87)
	at org.joda.time.format.TestPeriodFormatterBuilder.testFormatSeparatorIfFieldsAfter(TestPeriodFormatterBuilder.java:813)

testFormatSeparatorIfFieldsBefore(org.joda.time.format.TestPeriodFormatterBuilder)  Time elapsed: 0.001 sec  <<< FAILURE!
junit.framework.ComparisonFailure: expected:<[1T5]> but was:<[]>
	at junit.framework.Assert.assertEquals(Assert.java:81)
	at junit.framework.Assert.assertEquals(Assert.java:87)
	at org.joda.time.format.TestPeriodFormatterBuilder.testFormatSeparatorIfFieldsBefore(TestPeriodFormatterBuilder.java:828)

testFormatAppendFormatter(org.joda.time.format.TestPeriodFormatterBuilder)  Time elapsed: 0.001 sec  <<< FAILURE!
junit.framework.ComparisonFailure: expected:<[1-1]> but was:<[-]>
	at junit.framework.Assert.assertEquals(Assert.java:81)
	at junit.framework.Assert.assertEquals(Assert.java:87)
	at org.joda.time.format.TestPeriodFormatterBuilder.testFormatAppendFormatter(TestPeriodFormatterBuilder.java:852)

testFormatMinDigits(org.joda.time.format.TestPeriodFormatterBuilder)  Time elapsed: 0 sec  <<< FAILURE!
junit.framework.ComparisonFailure: expected:<[0001]> but was:<[]>
	at junit.framework.Assert.assertEquals(Assert.java:81)
	at junit.framework.Assert.assertEquals(Assert.java:87)
	at org.joda.time.format.TestPeriodFormatterBuilder.testFormatMinDigits(TestPeriodFormatterBuilder.java:859)

testFormatPrintZeroDefault(org.joda.time.format.TestPeriodFormatterBuilder)  Time elapsed: 0.001 sec  <<< FAILURE!
junit.framework.ComparisonFailure: expected:<[1-2-3-4]> but was:<[---]>
	at junit.framework.Assert.assertEquals(Assert.java:81)
	at junit.framework.Assert.assertEquals(Assert.java:87)
	at org.joda.time.format.TestPeriodFormatterBuilder.testFormatPrintZeroDefault(TestPeriodFormatterBuilder.java:872)

testFormatPrintZeroRarelyLast(org.joda.time.format.TestPeriodFormatterBuilder)  Time elapsed: 0.007 sec  <<< FAILURE!
junit.framework.ComparisonFailure: expected:<[1-2-3-4]> but was:<[---]>
	at junit.framework.Assert.assertEquals(Assert.java:81)
	at junit.framework.Assert.assertEquals(Assert.java:87)
	at org.joda.time.format.TestPeriodFormatterBuilder.testFormatPrintZeroRarelyLast(TestPeriodFormatterBuilder.java:905)

testFormatPrintZeroRarelyFirst(org.joda.time.format.TestPeriodFormatterBuilder)  Time elapsed: 0 sec  <<< FAILURE!
junit.framework.ComparisonFailure: expected:<[1-2-3-4]> but was:<[---]>
	at junit.framework.Assert.assertEquals(Assert.java:81)
	at junit.framework.Assert.assertEquals(Assert.java:87)
	at org.joda.time.format.TestPeriodFormatterBuilder.testFormatPrintZeroRarelyFirst(TestPeriodFormatterBuilder.java:930)

testFormatPrintZeroRarelyFirstYears(org.joda.time.format.TestPeriodFormatterBuilder)  Time elapsed: 0 sec  <<< FAILURE!
junit.framework.ComparisonFailure: expected:<[0]> but was:<[]>
	at junit.framework.Assert.assertEquals(Assert.java:81)
	at junit.framework.Assert.assertEquals(Assert.java:87)
	at org.joda.time.format.TestPeriodFormatterBuilder.testFormatPrintZeroRarelyFirstYears(TestPeriodFormatterBuilder.java:951)

testFormatPrintZeroRarelyFirstMonths(org.joda.time.format.TestPeriodFormatterBuilder)  Time elapsed: 0 sec  <<< FAILURE!
junit.framework.ComparisonFailure: expected:<[0]> but was:<[]>
	at junit.framework.Assert.assertEquals(Assert.java:81)
	at junit.framework.Assert.assertEquals(Assert.java:87)
	at org.joda.time.format.TestPeriodFormatterBuilder.testFormatPrintZeroRarelyFirstMonths(TestPeriodFormatterBuilder.java:958)

testFormatPrintZeroRarelyFirstWeeks(org.joda.time.format.TestPeriodFormatterBuilder)  Time elapsed: 0 sec  <<< FAILURE!
junit.framework.ComparisonFailure: expected:<[0]> but was:<[]>
	at junit.framework.Assert.assertEquals(Assert.java:81)
	at junit.framework.Assert.assertEquals(Assert.java:87)
	at org.joda.time.format.TestPeriodFormatterBuilder.testFormatPrintZeroRarelyFirstWeeks(TestPeriodFormatterBuilder.java:965)

testFormatPrintZeroRarelyFirstDays(org.joda.time.format.TestPeriodFormatterBuilder)  Time elapsed: 0 sec  <<< FAILURE!
junit.framework.ComparisonFailure: expected:<[0]> but was:<[]>
	at junit.framework.Assert.assertEquals(Assert.java:81)
	at junit.framework.Assert.assertEquals(Assert.java:87)
	at org.joda.time.format.TestPeriodFormatterBuilder.testFormatPrintZeroRarelyFirstDays(TestPeriodFormatterBuilder.java:972)

testFormatPrintZeroRarelyFirstHours(org.joda.time.format.TestPeriodFormatterBuilder)  Time elapsed: 0 sec  <<< FAILURE!
junit.framework.ComparisonFailure: expected:<[0]> but was:<[]>
	at junit.framework.Assert.assertEquals(Assert.java:81)
	at junit.framework.Assert.assertEquals(Assert.java:87)
	at org.joda.time.format.TestPeriodFormatterBuilder.testFormatPrintZeroRarelyFirstHours(TestPeriodFormatterBuilder.java:979)

testFormatPrintZeroRarelyFirstMinutes(org.joda.time.format.TestPeriodFormatterBuilder)  Time elapsed: 0 sec  <<< FAILURE!
junit.framework.ComparisonFailure: expected:<[0]> but was:<[]>
	at junit.framework.Assert.assertEquals(Assert.java:81)
	at junit.framework.Assert.assertEquals(Assert.java:87)
	at org.joda.time.format.TestPeriodFormatterBuilder.testFormatPrintZeroRarelyFirstMinutes(TestPeriodFormatterBuilder.java:986)

testFormatPrintZeroRarelyFirstSeconds(org.joda.time.format.TestPeriodFormatterBuilder)  Time elapsed: 0 sec  <<< FAILURE!
junit.framework.ComparisonFailure: expected:<[0]> but was:<[]>
	at junit.framework.Assert.assertEquals(Assert.java:81)
	at junit.framework.Assert.assertEquals(Assert.java:87)
	at org.joda.time.format.TestPeriodFormatterBuilder.testFormatPrintZeroRarelyFirstSeconds(TestPeriodFormatterBuilder.java:993)

testFormatPrintZeroIfSupported(org.joda.time.format.TestPeriodFormatterBuilder)  Time elapsed: 0 sec  <<< FAILURE!
junit.framework.ComparisonFailure: expected:<[1-2-3-4]> but was:<[---]>
	at junit.framework.Assert.assertEquals(Assert.java:81)
	at junit.framework.Assert.assertEquals(Assert.java:87)
	at org.joda.time.format.TestPeriodFormatterBuilder.testFormatPrintZeroIfSupported(TestPeriodFormatterBuilder.java:1004)

testFormatPrintZeroNever(org.joda.time.format.TestPeriodFormatterBuilder)  Time elapsed: 0 sec  <<< FAILURE!
junit.framework.ComparisonFailure: expected:<[1-2-3-4]> but was:<[---]>
	at junit.framework.Assert.assertEquals(Assert.java:81)
	at junit.framework.Assert.assertEquals(Assert.java:87)
	at org.joda.time.format.TestPeriodFormatterBuilder.testFormatPrintZeroNever(TestPeriodFormatterBuilder.java:1054)

testFormatAppend_PrinterParser_Printer_null(org.joda.time.format.TestPeriodFormatterBuilder)  Time elapsed: 0.001 sec  <<< FAILURE!
junit.framework.ComparisonFailure: expected:<[1-2]> but was:<[-]>
	at junit.framework.Assert.assertEquals(Assert.java:81)
	at junit.framework.Assert.assertEquals(Assert.java:87)
	at org.joda.time.format.TestPeriodFormatterBuilder.testFormatAppend_PrinterParser_Printer_null(TestPeriodFormatterBuilder.java:1086)

testFormatAppend_PrinterParser_PrinterParser(org.joda.time.format.TestPeriodFormatterBuilder)  Time elapsed: 0 sec  <<< FAILURE!
junit.framework.ComparisonFailure: expected:<[1-2]> but was:<[-]>
	at junit.framework.Assert.assertEquals(Assert.java:81)
	at junit.framework.Assert.assertEquals(Assert.java:87)
	at org.joda.time.format.TestPeriodFormatterBuilder.testFormatAppend_PrinterParser_PrinterParser(TestPeriodFormatterBuilder.java:1115)

testMonthsAndMinutesAreConsideredSeparateAndCaseIsNotIgnored(org.joda.time.format.TestPeriodFormatterBuilder)  Time elapsed: 0 sec  <<< FAILURE!
junit.framework.ComparisonFailure: expected:<[1M]> but was:<[]>
	at junit.framework.Assert.assertEquals(Assert.java:81)
	at junit.framework.Assert.assertEquals(Assert.java:87)
	at org.joda.time.format.TestPeriodFormatterBuilder.testMonthsAndMinutesAreConsideredSeparateAndCaseIsNotIgnored(TestPeriodFormatterBuilder.java:1178)


Results :

Failed tests: 
  org.joda.time.TestDateTimeZoneCutover#testPeriod ComparisonFailure expected:<P...
  org.joda.time.TestMutablePeriod_Basics#testToString ComparisonFailure expected...
  org.joda.time.TestPeriod_Basics#testToString ComparisonFailure expected:<P[1Y2...
  org.joda.time.TestPeriod_Basics#testToString_PeriodFormatter ComparisonFailure
  org.joda.time.TestPeriod_Basics#testToString_nullPeriodFormatter ComparisonFailure
  org.joda.time.TestStringConvert#testMutablePeriod ComparisonFailure expected:<...
  org.joda.time.TestStringConvert#testPeriod ComparisonFailure expected:<P[1Y2M3...
  org.joda.time.format.TestISOPeriodFormat#testFormatStandard ComparisonFailure ...
  org.joda.time.format.TestISOPeriodFormat#testFormatStandard_negative ComparisonFailure
  org.joda.time.format.TestPeriodFormat#test_getDefault_FormatOneField ComparisonFailure
  org.joda.time.format.TestPeriodFormat#test_getDefault_formatStandard ComparisonFailure
  org.joda.time.format.TestPeriodFormat#test_getDefault_formatTwoFields ComparisonFailure
  org.joda.time.format.TestPeriodFormat#test_wordBased_da_formatMultiple ComparisonFailure
  org.joda.time.format.TestPeriodFormat#test_wordBased_da_formatSinglular ComparisonFailure
  org.joda.time.format.TestPeriodFormat#test_wordBased_de_FormatOneField ComparisonFailure
  org.joda.time.format.TestPeriodFormat#test_wordBased_de_formatStandard ComparisonFailure
  org.joda.time.format.TestPeriodFormat#test_wordBased_de_formatTwoFields ComparisonFailure
  org.joda.time.format.TestPeriodFormat#test_wordBased_default ComparisonFailure
  org.joda.time.format.TestPeriodFormat#test_wordBased_en_from_de ComparisonFailure
  org.joda.time.format.TestPeriodFormat#test_wordBased_en_from_nl ComparisonFailure
  org.joda.time.format.TestPeriodFormat#test_wordBased_en_from_pl ComparisonFailure
  org.joda.time.format.TestPeriodFormat#test_wordBased_en_withLocale_pt ComparisonFailure
  org.joda.time.format.TestPeriodFormat#test_wordBased_es_FormatOneField ComparisonFailure
  org.joda.time.format.TestPeriodFormat#test_wordBased_es_formatStandard ComparisonFailure
  org.joda.time.format.TestPeriodFormat#test_wordBased_es_formatTwoFields ComparisonFailure
  org.joda.time.format.TestPeriodFormat#test_wordBased_fr_FormatOneField ComparisonFailure
  org.joda.time.format.TestPeriodFormat#test_wordBased_fr_formatStandard ComparisonFailure
  org.joda.time.format.TestPeriodFormat#test_wordBased_fr_formatTwoFields ComparisonFailure
  org.joda.time.format.TestPeriodFormat#test_wordBased_fr_from_de ComparisonFailure
  org.joda.time.format.TestPeriodFormat#test_wordBased_fr_from_nl ComparisonFailure
  org.joda.time.format.TestPeriodFormat#test_wordBased_ja_formatMultiple ComparisonFailure
  org.joda.time.format.TestPeriodFormat#test_wordBased_ja_formatSingular ComparisonFailure
  org.joda.time.format.TestPeriodFormat#test_wordBased_nl_FormatOneField ComparisonFailure
  org.joda.time.format.TestPeriodFormat#test_wordBased_nl_formatStandard ComparisonFailure
  org.joda.time.format.TestPeriodFormat#test_wordBased_nl_formatTwoFields ComparisonFailure
  org.joda.time.format.TestPeriodFormat#test_wordBased_pl_FormatOneField ComparisonFailure
  org.joda.time.format.TestPeriodFormat#test_wordBased_pl_formatStandard ComparisonFailure
  org.joda.time.format.TestPeriodFormat#test_wordBased_pl_formatTwoFields ComparisonFailure
  org.joda.time.format.TestPeriodFormat#test_wordBased_pl_from_fr ComparisonFailure
  org.joda.time.format.TestPeriodFormat#test_wordBased_pl_regEx ComparisonFailure
  org.joda.time.format.TestPeriodFormat#test_wordBased_pt_FormatOneField ComparisonFailure
  org.joda.time.format.TestPeriodFormat#test_wordBased_pt_formatStandard ComparisonFailure
  org.joda.time.format.TestPeriodFormat#test_wordBased_pt_formatTwoFields ComparisonFailure
  org.joda.time.format.TestPeriodFormatParsing#testParseNegativeMillis1 ComparisonFailure
  org.joda.time.format.TestPeriodFormatParsing#testParseNegativeMillis2 ComparisonFailure
  org.joda.time.format.TestPeriodFormatter#testPrint_bufferMethods ComparisonFailure
  org.joda.time.format.TestPeriodFormatter#testPrint_simple ComparisonFailure ex...
  org.joda.time.format.TestPeriodFormatter#testPrint_writerMethods ComparisonFailure
  org.joda.time.format.TestPeriodFormatterBuilder#testFormatAppendFormatter ComparisonFailure
  org.joda.time.format.TestPeriodFormatterBuilder#testFormatAppend_PrinterParser_PrinterParser ComparisonFailure
  org.joda.time.format.TestPeriodFormatterBuilder#testFormatAppend_PrinterParser_Printer_null ComparisonFailure
  org.joda.time.format.TestPeriodFormatterBuilder#testFormatDays ComparisonFailure
  org.joda.time.format.TestPeriodFormatterBuilder#testFormatHours ComparisonFailure
  org.joda.time.format.TestPeriodFormatterBuilder#testFormatMillis ComparisonFailure
  org.joda.time.format.TestPeriodFormatterBuilder#testFormatMillis3Digit ComparisonFailure
  org.joda.time.format.TestPeriodFormatterBuilder#testFormatMinDigits ComparisonFailure
  org.joda.time.format.TestPeriodFormatterBuilder#testFormatMinutes ComparisonFailure
  org.joda.time.format.TestPeriodFormatterBuilder#testFormatMonths ComparisonFailure
  org.joda.time.format.TestPeriodFormatterBuilder#testFormatPrefixComposite1 ComparisonFailure
  org.joda.time.format.TestPeriodFormatterBuilder#testFormatPrefixPlural1 ComparisonFailure
  org.joda.time.format.TestPeriodFormatterBuilder#testFormatPrefixPlural2 ComparisonFailure
  org.joda.time.format.TestPeriodFormatterBuilder#testFormatPrefixPlural4IgnoringPrefix ComparisonFailure
  org.joda.time.format.TestPeriodFormatterBuilder#testFormatPrefixRegEx1 ComparisonFailure
  org.joda.time.format.TestPeriodFormatterBuilder#testFormatPrefixRegEx2 ComparisonFailure
  org.joda.time.format.TestPeriodFormatterBuilder#testFormatPrefixRegEx4IgnoringPrefix ComparisonFailure
  org.joda.time.format.TestPeriodFormatterBuilder#testFormatPrefixSimple1 ComparisonFailure
  org.joda.time.format.TestPeriodFormatterBuilder#testFormatPrefixSimple2 ComparisonFailure
  org.joda.time.format.TestPeriodFormatterBuilder#testFormatPrefixSimple4IgnoringPrefix ComparisonFailure
  org.joda.time.format.TestPeriodFormatterBuilder#testFormatPrefixSimple5IgnoringPrefix ComparisonFailure
  org.joda.time.format.TestPeriodFormatterBuilder#testFormatPrefixSimple6IgnoringPrefix ComparisonFailure
  org.joda.time.format.TestPeriodFormatterBuilder#testFormatPrefixSuffix ComparisonFailure
  org.joda.time.format.TestPeriodFormatterBuilder#testFormatPrintZeroDefault ComparisonFailure
  org.joda.time.format.TestPeriodFormatterBuilder#testFormatPrintZeroIfSupported ComparisonFailure
  org.joda.time.format.TestPeriodFormatterBuilder#testFormatPrintZeroNever ComparisonFailure
  org.joda.time.format.TestPeriodFormatterBuilder#testFormatPrintZeroRarelyFirst ComparisonFailure
  org.joda.time.format.TestPeriodFormatterBuilder#testFormatPrintZeroRarelyFirstDays ComparisonFailure
  org.joda.time.format.TestPeriodFormatterBuilder#testFormatPrintZeroRarelyFirstHours ComparisonFailure
  org.joda.time.format.TestPeriodFormatterBuilder#testFormatPrintZeroRarelyFirstMinutes ComparisonFailure
  org.joda.time.format.TestPeriodFormatterBuilder#testFormatPrintZeroRarelyFirstMonths ComparisonFailure
  org.joda.time.format.TestPeriodFormatterBuilder#testFormatPrintZeroRarelyFirstSeconds ComparisonFailure
  org.joda.time.format.TestPeriodFormatterBuilder#testFormatPrintZeroRarelyFirstWeeks ComparisonFailure
  org.joda.time.format.TestPeriodFormatterBuilder#testFormatPrintZeroRarelyFirstYears ComparisonFailure
  org.joda.time.format.TestPeriodFormatterBuilder#testFormatPrintZeroRarelyLast ComparisonFailure
  org.joda.time.format.TestPeriodFormatterBuilder#testFormatSeconds ComparisonFailure
  org.joda.time.format.TestPeriodFormatterBuilder#testFormatSecondsWithMillis ComparisonFailure
  org.joda.time.format.TestPeriodFormatterBuilder#testFormatSecondsWithOptionalMillis ComparisonFailure
  org.joda.time.format.TestPeriodFormatterBuilder#testFormatSeparatorComplex ComparisonFailure
  org.joda.time.format.TestPeriodFormatterBuilder#testFormatSeparatorIfFieldsAfter ComparisonFailure
  org.joda.time.format.TestPeriodFormatterBuilder#testFormatSeparatorIfFieldsBefore ComparisonFailure
  org.joda.time.format.TestPeriodFormatterBuilder#testFormatSeparatorSimple ComparisonFailure
  org.joda.time.format.TestPeriodFormatterBuilder#testFormatSuffixComposite1 ComparisonFailure
  org.joda.time.format.TestPeriodFormatterBuilder#testFormatSuffixComposite5IgnoringAffix ComparisonFailure
  org.joda.time.format.TestPeriodFormatterBuilder#testFormatSuffixPlural1 ComparisonFailure
  org.joda.time.format.TestPeriodFormatterBuilder#testFormatSuffixPlural2 ComparisonFailure
  org.joda.time.format.TestPeriodFormatterBuilder#testFormatSuffixPlural4IgnoringPrefix ComparisonFailure
  org.joda.time.format.TestPeriodFormatterBuilder#testFormatSuffixRegEx1 ComparisonFailure
  org.joda.time.format.TestPeriodFormatterBuilder#testFormatSuffixRegEx2 ComparisonFailure
  org.joda.time.format.TestPeriodFormatterBuilder#testFormatSuffixRegEx5IgnoringAffix ComparisonFailure
  org.joda.time.format.TestPeriodFormatterBuilder#testFormatSuffixSimple1 ComparisonFailure
  org.joda.time.format.TestPeriodFormatterBuilder#testFormatSuffixSimple2 ComparisonFailure
  org.joda.time.format.TestPeriodFormatterBuilder#testFormatWeeks ComparisonFailure
  org.joda.time.format.TestPeriodFormatterBuilder#testFormatYears ComparisonFailure
  org.joda.time.format.TestPeriodFormatterBuilder#testMonthsAndMinutesAreConsideredSeparateAndCaseIsNotIgnored ComparisonFailure
  org.joda.time.format.TestPeriodFormatterBuilder#testPluralAffixParseOrder AssertionFailedError
  org.joda.time.format.TestPeriodFormatterBuilder#testRegExAffixParseOrder AssertionFailedError

Tests run: 4157, Failures: 105, Errors: 0, Skipped: 0

[INFO] ------------------------------------------------------------------------
[INFO] BUILD FAILURE
[INFO] ------------------------------------------------------------------------
[INFO] Total time: 15.995s
[INFO] Finished at: Thu Aug 06 10:47:35 BST 2015
[INFO] Final Memory: 8M/216M
[INFO] ------------------------------------------------------------------------
[ERROR] Failed to execute goal org.apache.maven.plugins:maven-surefire-plugin:2.18.1:test (default-test) on project joda-time: There are test failures.
[ERROR] 
[ERROR] Please refer to /home/perham/Study/LittleDarwin/Cases/joda-time-2.8.1/target/surefire-reports for the individual test results.
[ERROR] -> [Help 1]
[ERROR] 
[ERROR] To see the full stack trace of the errors, re-run Maven with the -e switch.
[ERROR] Re-run Maven using the -X switch to enable full debug logging.
[ERROR] 
[ERROR] For more information about the errors and possible solutions, please read the following articles:
[ERROR] [Help 1] http://cwiki.apache.org/confluence/display/MAVEN/MojoFailureException
