[INFO] Scanning for projects...
[INFO]                                                                         
[INFO] ------------------------------------------------------------------------
[INFO] Building Joda-Time 2.8.1
[INFO] ------------------------------------------------------------------------
[INFO] 
[INFO] --- maven-resources-plugin:2.7:resources (default-resources) @ joda-time ---
[INFO] Using 'UTF-8' encoding to copy filtered resources.
[INFO] Copying 2 resources to META-INF
[INFO] Copying 10 resources
[INFO] 
[INFO] --- maven-compiler-plugin:3.3:compile (default-compile) @ joda-time ---
[INFO] Changes detected - recompiling the module!
[INFO] Compiling 166 source files to /home/perham/Study/LittleDarwin/Cases/joda-time-2.8.1/target/classes
[INFO] 
[INFO] --- exec-maven-plugin:1.4.0:java (compile-tzdb) @ joda-time ---
Writing zoneinfo files
Writing ZoneInfoMap
[INFO] 
[INFO] --- maven-resources-plugin:2.7:testResources (default-testResources) @ joda-time ---
[INFO] Using 'UTF-8' encoding to copy filtered resources.
[INFO] Copying 34 resources
[INFO] 
[INFO] --- maven-compiler-plugin:3.3:testCompile (default-testCompile) @ joda-time ---
[INFO] Nothing to compile - all classes are up to date
[INFO] 
[INFO] --- maven-surefire-plugin:2.18.1:test (default-test) @ joda-time ---
[INFO] Surefire report directory: /home/perham/Study/LittleDarwin/Cases/joda-time-2.8.1/target/surefire-reports

-------------------------------------------------------
 T E S T S
-------------------------------------------------------
Running org.joda.time.TestAllPackages

TestBuddhistChronology.testCalendar

TestCopticChronology.testCalendar

TestEthiopicChronology.testCalendar

TestIslamicChronology.testCalendar

Testing Gregorian chronology over 1000 iterations
100% complete (i=1000)

Testing Julian chronology over 1000 iterations
100% complete (i=1000)
Writing zoneinfo files
Writing ZoneInfoMap
Tests run: 4157, Failures: 38, Errors: 0, Skipped: 0, Time elapsed: 5.448 sec <<< FAILURE! - in org.joda.time.TestAllPackages
testToString_PeriodFormatter(org.joda.time.TestPeriod_Basics)  Time elapsed: 0.01 sec  <<< FAILURE!
junit.framework.ComparisonFailure: expected:<1 year[, 2 months, 3 weeks, 4 days, 5 hours, 6 minutes, 7 seconds and ]8 milliseconds> but was:<1 year[2 months3 weeks4 days5 hours6 minutes7 seconds]8 milliseconds>
	at junit.framework.Assert.assertEquals(Assert.java:81)
	at junit.framework.Assert.assertEquals(Assert.java:87)
	at org.joda.time.TestPeriod_Basics.testToString_PeriodFormatter(TestPeriod_Basics.java:484)

test_wordBased_default(org.joda.time.format.TestPeriodFormat)  Time elapsed: 0.002 sec  <<< FAILURE!
junit.framework.ComparisonFailure: expected:<1 Tag[, 5 Stunden, 6 Minuten, 7 Sekunden und ]8 Millisekunden> but was:<1 Tag[5 Stunden6 Minuten7 Sekunden]8 Millisekunden>
	at junit.framework.Assert.assertEquals(Assert.java:81)
	at junit.framework.Assert.assertEquals(Assert.java:87)
	at org.joda.time.format.TestPeriodFormat.test_wordBased_default(TestPeriodFormat.java:126)

test_wordBased_fr_formatStandard(org.joda.time.format.TestPeriodFormat)  Time elapsed: 0.003 sec  <<< FAILURE!
junit.framework.ComparisonFailure: expected:<1 jour[, 5 heures, 6 minutes, 7 secondes et ]8 millisecondes> but was:<1 jour[5 heures6 minutes7 secondes]8 millisecondes>
	at junit.framework.Assert.assertEquals(Assert.java:81)
	at junit.framework.Assert.assertEquals(Assert.java:87)
	at org.joda.time.format.TestPeriodFormat.test_wordBased_fr_formatStandard(TestPeriodFormat.java:134)

test_wordBased_fr_FormatOneField(org.joda.time.format.TestPeriodFormat)  Time elapsed: 0.001 sec  <<< FAILURE!
junit.framework.ComparisonFailure: expected:<2 jours[]> but was:<2 jours[ et ]>
	at junit.framework.Assert.assertEquals(Assert.java:81)
	at junit.framework.Assert.assertEquals(Assert.java:87)
	at org.joda.time.format.TestPeriodFormat.test_wordBased_fr_FormatOneField(TestPeriodFormat.java:140)

test_wordBased_fr_formatTwoFields(org.joda.time.format.TestPeriodFormat)  Time elapsed: 0 sec  <<< FAILURE!
junit.framework.ComparisonFailure: expected:<2 jours[ et 5 heures]> but was:<2 jours[5 heures et ]>
	at junit.framework.Assert.assertEquals(Assert.java:81)
	at junit.framework.Assert.assertEquals(Assert.java:87)
	at org.joda.time.format.TestPeriodFormat.test_wordBased_fr_formatTwoFields(TestPeriodFormat.java:146)

test_wordBased_pt_formatStandard(org.joda.time.format.TestPeriodFormat)  Time elapsed: 0.002 sec  <<< FAILURE!
junit.framework.ComparisonFailure: expected:<1 dia[, 5 horas, 6 minutos, 7 segundos e ]8 milissegundos> but was:<1 dia[5 horas6 minutos7 segundos]8 milissegundos>
	at junit.framework.Assert.assertEquals(Assert.java:81)
	at junit.framework.Assert.assertEquals(Assert.java:87)
	at org.joda.time.format.TestPeriodFormat.test_wordBased_pt_formatStandard(TestPeriodFormat.java:171)

test_wordBased_pt_FormatOneField(org.joda.time.format.TestPeriodFormat)  Time elapsed: 0.001 sec  <<< FAILURE!
junit.framework.ComparisonFailure: expected:<2 dias[]> but was:<2 dias[ e ]>
	at junit.framework.Assert.assertEquals(Assert.java:81)
	at junit.framework.Assert.assertEquals(Assert.java:87)
	at org.joda.time.format.TestPeriodFormat.test_wordBased_pt_FormatOneField(TestPeriodFormat.java:177)

test_wordBased_pt_formatTwoFields(org.joda.time.format.TestPeriodFormat)  Time elapsed: 0.001 sec  <<< FAILURE!
junit.framework.ComparisonFailure: expected:<2 dias[ e 5 horas]> but was:<2 dias[5 horas e ]>
	at junit.framework.Assert.assertEquals(Assert.java:81)
	at junit.framework.Assert.assertEquals(Assert.java:87)
	at org.joda.time.format.TestPeriodFormat.test_wordBased_pt_formatTwoFields(TestPeriodFormat.java:183)

test_wordBased_es_formatStandard(org.joda.time.format.TestPeriodFormat)  Time elapsed: 0.002 sec  <<< FAILURE!
junit.framework.ComparisonFailure: expected:<1 día[, 5 horas, 6 minutos, 7 segundos y ]8 milisegundos> but was:<1 día[5 horas6 minutos7 segundos]8 milisegundos>
	at junit.framework.Assert.assertEquals(Assert.java:81)
	at junit.framework.Assert.assertEquals(Assert.java:87)
	at org.joda.time.format.TestPeriodFormat.test_wordBased_es_formatStandard(TestPeriodFormat.java:208)

test_wordBased_es_FormatOneField(org.joda.time.format.TestPeriodFormat)  Time elapsed: 0.001 sec  <<< FAILURE!
junit.framework.ComparisonFailure: expected:<2 días[]> but was:<2 días[ y ]>
	at junit.framework.Assert.assertEquals(Assert.java:81)
	at junit.framework.Assert.assertEquals(Assert.java:87)
	at org.joda.time.format.TestPeriodFormat.test_wordBased_es_FormatOneField(TestPeriodFormat.java:214)

test_wordBased_es_formatTwoFields(org.joda.time.format.TestPeriodFormat)  Time elapsed: 0 sec  <<< FAILURE!
junit.framework.ComparisonFailure: expected:<2 días[ y 5 horas]> but was:<2 días[5 horas y ]>
	at junit.framework.Assert.assertEquals(Assert.java:81)
	at junit.framework.Assert.assertEquals(Assert.java:87)
	at org.joda.time.format.TestPeriodFormat.test_wordBased_es_formatTwoFields(TestPeriodFormat.java:220)

test_wordBased_de_formatStandard(org.joda.time.format.TestPeriodFormat)  Time elapsed: 0 sec  <<< FAILURE!
junit.framework.ComparisonFailure: expected:<1 Tag[, 5 Stunden, 6 Minuten, 7 Sekunden und ]8 Millisekunden> but was:<1 Tag[5 Stunden6 Minuten7 Sekunden]8 Millisekunden>
	at junit.framework.Assert.assertEquals(Assert.java:81)
	at junit.framework.Assert.assertEquals(Assert.java:87)
	at org.joda.time.format.TestPeriodFormat.test_wordBased_de_formatStandard(TestPeriodFormat.java:245)

test_wordBased_de_FormatOneField(org.joda.time.format.TestPeriodFormat)  Time elapsed: 0.001 sec  <<< FAILURE!
junit.framework.ComparisonFailure: expected:<2 Tage[]> but was:<2 Tage[ und ]>
	at junit.framework.Assert.assertEquals(Assert.java:81)
	at junit.framework.Assert.assertEquals(Assert.java:87)
	at org.joda.time.format.TestPeriodFormat.test_wordBased_de_FormatOneField(TestPeriodFormat.java:251)

test_wordBased_de_formatTwoFields(org.joda.time.format.TestPeriodFormat)  Time elapsed: 0 sec  <<< FAILURE!
junit.framework.ComparisonFailure: expected:<2 Tage[ und 5 Stunden]> but was:<2 Tage[5 Stunden und ]>
	at junit.framework.Assert.assertEquals(Assert.java:81)
	at junit.framework.Assert.assertEquals(Assert.java:87)
	at org.joda.time.format.TestPeriodFormat.test_wordBased_de_formatTwoFields(TestPeriodFormat.java:257)

test_wordBased_nl_formatStandard(org.joda.time.format.TestPeriodFormat)  Time elapsed: 0.003 sec  <<< FAILURE!
junit.framework.ComparisonFailure: expected:<1 dag[, 5 uur, 6 minuten, 7 seconden en ]8 milliseconden> but was:<1 dag[5 uur6 minuten7 seconden]8 milliseconden>
	at junit.framework.Assert.assertEquals(Assert.java:81)
	at junit.framework.Assert.assertEquals(Assert.java:87)
	at org.joda.time.format.TestPeriodFormat.test_wordBased_nl_formatStandard(TestPeriodFormat.java:282)

test_wordBased_nl_FormatOneField(org.joda.time.format.TestPeriodFormat)  Time elapsed: 0 sec  <<< FAILURE!
junit.framework.ComparisonFailure: expected:<2 dagen[]> but was:<2 dagen[ en ]>
	at junit.framework.Assert.assertEquals(Assert.java:81)
	at junit.framework.Assert.assertEquals(Assert.java:87)
	at org.joda.time.format.TestPeriodFormat.test_wordBased_nl_FormatOneField(TestPeriodFormat.java:288)

test_wordBased_nl_formatTwoFields(org.joda.time.format.TestPeriodFormat)  Time elapsed: 0.001 sec  <<< FAILURE!
junit.framework.ComparisonFailure: expected:<2 dagen[ en 5 uur]> but was:<2 dagen[5 uur en ]>
	at junit.framework.Assert.assertEquals(Assert.java:81)
	at junit.framework.Assert.assertEquals(Assert.java:87)
	at org.joda.time.format.TestPeriodFormat.test_wordBased_nl_formatTwoFields(TestPeriodFormat.java:294)

test_wordBased_da_formatMultiple(org.joda.time.format.TestPeriodFormat)  Time elapsed: 0.003 sec  <<< FAILURE!
junit.framework.ComparisonFailure: expected:<2 år[, 3 måneder, 4 uger, 2 dage, 5 timer, 6 minutter, 7 sekunder og ]8 millisekunder> but was:<2 år[3 måneder4 uger2 dage5 timer6 minutter7 sekunder]8 millisekunder>
	at junit.framework.Assert.assertEquals(Assert.java:81)
	at junit.framework.Assert.assertEquals(Assert.java:87)
	at org.joda.time.format.TestPeriodFormat.test_wordBased_da_formatMultiple(TestPeriodFormat.java:319)

test_wordBased_da_formatSinglular(org.joda.time.format.TestPeriodFormat)  Time elapsed: 0.001 sec  <<< FAILURE!
junit.framework.ComparisonFailure: expected:<1 år[, 1 måned, 1 uge, 1 dag, 1 time, 1 minut, 1 sekund og ]1 millisekund> but was:<1 år[1 måned1 uge1 dag1 time1 minut1 sekund]1 millisekund>
	at junit.framework.Assert.assertEquals(Assert.java:81)
	at junit.framework.Assert.assertEquals(Assert.java:87)
	at org.joda.time.format.TestPeriodFormat.test_wordBased_da_formatSinglular(TestPeriodFormat.java:325)

test_getDefault_formatStandard(org.joda.time.format.TestPeriodFormat)  Time elapsed: 0 sec  <<< FAILURE!
junit.framework.ComparisonFailure: expected:<1 day[, 5 hours, 6 minutes, 7 seconds and ]8 milliseconds> but was:<1 day[5 hours6 minutes7 seconds]8 milliseconds>
	at junit.framework.Assert.assertEquals(Assert.java:81)
	at junit.framework.Assert.assertEquals(Assert.java:87)
	at org.joda.time.format.TestPeriodFormat.test_getDefault_formatStandard(TestPeriodFormat.java:79)

test_getDefault_FormatOneField(org.joda.time.format.TestPeriodFormat)  Time elapsed: 0.001 sec  <<< FAILURE!
junit.framework.ComparisonFailure: expected:<2 days[]> but was:<2 days[ and ]>
	at junit.framework.Assert.assertEquals(Assert.java:81)
	at junit.framework.Assert.assertEquals(Assert.java:87)
	at org.joda.time.format.TestPeriodFormat.test_getDefault_FormatOneField(TestPeriodFormat.java:85)

test_getDefault_formatTwoFields(org.joda.time.format.TestPeriodFormat)  Time elapsed: 0.001 sec  <<< FAILURE!
junit.framework.ComparisonFailure: expected:<2 days[ and 5 hours]> but was:<2 days[5 hours and ]>
	at junit.framework.Assert.assertEquals(Assert.java:81)
	at junit.framework.Assert.assertEquals(Assert.java:87)
	at org.joda.time.format.TestPeriodFormat.test_getDefault_formatTwoFields(TestPeriodFormat.java:91)

test_wordBased_pl_formatStandard(org.joda.time.format.TestPeriodFormat)  Time elapsed: 0.002 sec  <<< FAILURE!
junit.framework.ComparisonFailure: expected:<1 dzień[, 5 godzin, 6 minut, 7 sekund i ]8 milisekund> but was:<1 dzień[5 godzin6 minut7 sekund]8 milisekund>
	at junit.framework.Assert.assertEquals(Assert.java:81)
	at junit.framework.Assert.assertEquals(Assert.java:87)
	at org.joda.time.format.TestPeriodFormat.test_wordBased_pl_formatStandard(TestPeriodFormat.java:380)

test_wordBased_pl_FormatOneField(org.joda.time.format.TestPeriodFormat)  Time elapsed: 0.001 sec  <<< FAILURE!
junit.framework.ComparisonFailure: expected:<2 dni[]> but was:<2 dni[ i ]>
	at junit.framework.Assert.assertEquals(Assert.java:81)
	at junit.framework.Assert.assertEquals(Assert.java:87)
	at org.joda.time.format.TestPeriodFormat.test_wordBased_pl_FormatOneField(TestPeriodFormat.java:386)

test_wordBased_pl_formatTwoFields(org.joda.time.format.TestPeriodFormat)  Time elapsed: 0.002 sec  <<< FAILURE!
junit.framework.ComparisonFailure: expected:<2 dni[ i 5 godzin]> but was:<2 dni[5 godzin i ]>
	at junit.framework.Assert.assertEquals(Assert.java:81)
	at junit.framework.Assert.assertEquals(Assert.java:87)
	at org.joda.time.format.TestPeriodFormat.test_wordBased_pl_formatTwoFields(TestPeriodFormat.java:392)

test_wordBased_pl_regEx(org.joda.time.format.TestPeriodFormat)  Time elapsed: 0.001 sec  <<< FAILURE!
junit.framework.ComparisonFailure: expected:<1 rok[]> but was:<1 rok[ i ]>
	at junit.framework.Assert.assertEquals(Assert.java:81)
	at junit.framework.Assert.assertEquals(Assert.java:87)
	at org.joda.time.format.TestPeriodFormat.test_wordBased_pl_regEx(TestPeriodFormat.java:425)

test_wordBased_fr_from_de(org.joda.time.format.TestPeriodFormat)  Time elapsed: 0.001 sec  <<< FAILURE!
junit.framework.ComparisonFailure: expected:<1 jour[, 5 heures, 6 minutes, 7 secondes et ]8 millisecondes> but was:<1 jour[5 heures6 minutes7 secondes]8 millisecondes>
	at junit.framework.Assert.assertEquals(Assert.java:81)
	at junit.framework.Assert.assertEquals(Assert.java:87)
	at org.joda.time.format.TestPeriodFormat.test_wordBased_fr_from_de(TestPeriodFormat.java:580)

test_wordBased_fr_from_nl(org.joda.time.format.TestPeriodFormat)  Time elapsed: 0 sec  <<< FAILURE!
junit.framework.ComparisonFailure: expected:<1 jour[, 5 heures, 6 minutes, 7 secondes et ]8 millisecondes> but was:<1 jour[5 heures6 minutes7 secondes]8 millisecondes>
	at junit.framework.Assert.assertEquals(Assert.java:81)
	at junit.framework.Assert.assertEquals(Assert.java:87)
	at org.joda.time.format.TestPeriodFormat.test_wordBased_fr_from_nl(TestPeriodFormat.java:586)

test_wordBased_en_from_de(org.joda.time.format.TestPeriodFormat)  Time elapsed: 0.001 sec  <<< FAILURE!
junit.framework.ComparisonFailure: expected:<1 day[, 5 hours, 6 minutes, 7 seconds and ]8 milliseconds> but was:<1 day[5 hours6 minutes7 seconds]8 milliseconds>
	at junit.framework.Assert.assertEquals(Assert.java:81)
	at junit.framework.Assert.assertEquals(Assert.java:87)
	at org.joda.time.format.TestPeriodFormat.test_wordBased_en_from_de(TestPeriodFormat.java:592)

test_wordBased_en_from_nl(org.joda.time.format.TestPeriodFormat)  Time elapsed: 0 sec  <<< FAILURE!
junit.framework.ComparisonFailure: expected:<1 day[, 5 hours, 6 minutes, 7 seconds and ]8 milliseconds> but was:<1 day[5 hours6 minutes7 seconds]8 milliseconds>
	at junit.framework.Assert.assertEquals(Assert.java:81)
	at junit.framework.Assert.assertEquals(Assert.java:87)
	at org.joda.time.format.TestPeriodFormat.test_wordBased_en_from_nl(TestPeriodFormat.java:598)

test_wordBased_en_from_pl(org.joda.time.format.TestPeriodFormat)  Time elapsed: 0.001 sec  <<< FAILURE!
junit.framework.ComparisonFailure: expected:<1 day[, 5 hours, 6 minutes, 7 seconds and ]8 milliseconds> but was:<1 day[5 hours6 minutes7 seconds]8 milliseconds>
	at junit.framework.Assert.assertEquals(Assert.java:81)
	at junit.framework.Assert.assertEquals(Assert.java:87)
	at org.joda.time.format.TestPeriodFormat.test_wordBased_en_from_pl(TestPeriodFormat.java:604)

test_wordBased_pl_from_fr(org.joda.time.format.TestPeriodFormat)  Time elapsed: 0.001 sec  <<< FAILURE!
junit.framework.ComparisonFailure: expected:<1 dzień[, 5 godzin, 6 minut, 7 sekund i ]8 milisekund> but was:<1 dzień[5 godzin6 minut7 sekund]8 milisekund>
	at junit.framework.Assert.assertEquals(Assert.java:81)
	at junit.framework.Assert.assertEquals(Assert.java:87)
	at org.joda.time.format.TestPeriodFormat.test_wordBased_pl_from_fr(TestPeriodFormat.java:610)

test_wordBased_en_withLocale_pt(org.joda.time.format.TestPeriodFormat)  Time elapsed: 0.001 sec  <<< FAILURE!
junit.framework.ComparisonFailure: expected:<2 days[ and 5 hours]> but was:<2 days[5 hours and ]>
	at junit.framework.Assert.assertEquals(Assert.java:81)
	at junit.framework.Assert.assertEquals(Assert.java:87)
	at org.joda.time.format.TestPeriodFormat.test_wordBased_en_withLocale_pt(TestPeriodFormat.java:633)

testFormatAlternateExtended(org.joda.time.format.TestISOPeriodFormat)  Time elapsed: 0 sec  <<< FAILURE!
junit.framework.ComparisonFailure: expected:<P0001[-02-04T05:06:]07.008> but was:<P0001[0204T0506]07.008>
	at junit.framework.Assert.assertEquals(Assert.java:81)
	at junit.framework.Assert.assertEquals(Assert.java:87)
	at org.joda.time.format.TestISOPeriodFormat.testFormatAlternateExtended(TestISOPeriodFormat.java:159)

testFormatAlternateExtendedWithWeeks(org.joda.time.format.TestISOPeriodFormat)  Time elapsed: 0 sec  <<< FAILURE!
junit.framework.ComparisonFailure: expected:<P0001[-W03-04T05:06:]07.008> but was:<P0001[W0304T0506]07.008>
	at junit.framework.Assert.assertEquals(Assert.java:81)
	at junit.framework.Assert.assertEquals(Assert.java:87)
	at org.joda.time.format.TestISOPeriodFormat.testFormatAlternateExtendedWithWeeks(TestISOPeriodFormat.java:195)

testFormatSeparatorSimple(org.joda.time.format.TestPeriodFormatterBuilder)  Time elapsed: 0.001 sec  <<< FAILURE!
junit.framework.ComparisonFailure: expected:<1[T]5> but was:<1[]5>
	at junit.framework.Assert.assertEquals(Assert.java:81)
	at junit.framework.Assert.assertEquals(Assert.java:87)
	at org.joda.time.format.TestPeriodFormatterBuilder.testFormatSeparatorSimple(TestPeriodFormatterBuilder.java:779)

testFormatSeparatorComplex(org.joda.time.format.TestPeriodFormatterBuilder)  Time elapsed: 0.001 sec  <<< FAILURE!
junit.framework.ComparisonFailure: expected:<1[, 5 and 6]> but was:<1[56 and ]>
	at junit.framework.Assert.assertEquals(Assert.java:81)
	at junit.framework.Assert.assertEquals(Assert.java:87)
	at org.joda.time.format.TestPeriodFormatterBuilder.testFormatSeparatorComplex(TestPeriodFormatterBuilder.java:798)

testMonthsAndMinutesAreConsideredSeparateAndCaseIsNotIgnored(org.joda.time.format.TestPeriodFormatterBuilder)  Time elapsed: 0.002 sec  <<< FAILURE!
junit.framework.ComparisonFailure: expected:<1M[]> but was:<1M[ ]>
	at junit.framework.Assert.assertEquals(Assert.java:81)
	at junit.framework.Assert.assertEquals(Assert.java:87)
	at org.joda.time.format.TestPeriodFormatterBuilder.testMonthsAndMinutesAreConsideredSeparateAndCaseIsNotIgnored(TestPeriodFormatterBuilder.java:1178)


Results :

Failed tests: 
  org.joda.time.TestPeriod_Basics#testToString_PeriodFormatter ComparisonFailure
  org.joda.time.format.TestISOPeriodFormat#testFormatAlternateExtended ComparisonFailure
  org.joda.time.format.TestISOPeriodFormat#testFormatAlternateExtendedWithWeeks ComparisonFailure
  org.joda.time.format.TestPeriodFormat#test_getDefault_FormatOneField ComparisonFailure
  org.joda.time.format.TestPeriodFormat#test_getDefault_formatStandard ComparisonFailure
  org.joda.time.format.TestPeriodFormat#test_getDefault_formatTwoFields ComparisonFailure
  org.joda.time.format.TestPeriodFormat#test_wordBased_da_formatMultiple ComparisonFailure
  org.joda.time.format.TestPeriodFormat#test_wordBased_da_formatSinglular ComparisonFailure
  org.joda.time.format.TestPeriodFormat#test_wordBased_de_FormatOneField ComparisonFailure
  org.joda.time.format.TestPeriodFormat#test_wordBased_de_formatStandard ComparisonFailure
  org.joda.time.format.TestPeriodFormat#test_wordBased_de_formatTwoFields ComparisonFailure
  org.joda.time.format.TestPeriodFormat#test_wordBased_default ComparisonFailure
  org.joda.time.format.TestPeriodFormat#test_wordBased_en_from_de ComparisonFailure
  org.joda.time.format.TestPeriodFormat#test_wordBased_en_from_nl ComparisonFailure
  org.joda.time.format.TestPeriodFormat#test_wordBased_en_from_pl ComparisonFailure
  org.joda.time.format.TestPeriodFormat#test_wordBased_en_withLocale_pt ComparisonFailure
  org.joda.time.format.TestPeriodFormat#test_wordBased_es_FormatOneField ComparisonFailure
  org.joda.time.format.TestPeriodFormat#test_wordBased_es_formatStandard ComparisonFailure
  org.joda.time.format.TestPeriodFormat#test_wordBased_es_formatTwoFields ComparisonFailure
  org.joda.time.format.TestPeriodFormat#test_wordBased_fr_FormatOneField ComparisonFailure
  org.joda.time.format.TestPeriodFormat#test_wordBased_fr_formatStandard ComparisonFailure
  org.joda.time.format.TestPeriodFormat#test_wordBased_fr_formatTwoFields ComparisonFailure
  org.joda.time.format.TestPeriodFormat#test_wordBased_fr_from_de ComparisonFailure
  org.joda.time.format.TestPeriodFormat#test_wordBased_fr_from_nl ComparisonFailure
  org.joda.time.format.TestPeriodFormat#test_wordBased_nl_FormatOneField ComparisonFailure
  org.joda.time.format.TestPeriodFormat#test_wordBased_nl_formatStandard ComparisonFailure
  org.joda.time.format.TestPeriodFormat#test_wordBased_nl_formatTwoFields ComparisonFailure
  org.joda.time.format.TestPeriodFormat#test_wordBased_pl_FormatOneField ComparisonFailure
  org.joda.time.format.TestPeriodFormat#test_wordBased_pl_formatStandard ComparisonFailure
  org.joda.time.format.TestPeriodFormat#test_wordBased_pl_formatTwoFields ComparisonFailure
  org.joda.time.format.TestPeriodFormat#test_wordBased_pl_from_fr ComparisonFailure
  org.joda.time.format.TestPeriodFormat#test_wordBased_pl_regEx ComparisonFailure
  org.joda.time.format.TestPeriodFormat#test_wordBased_pt_FormatOneField ComparisonFailure
  org.joda.time.format.TestPeriodFormat#test_wordBased_pt_formatStandard ComparisonFailure
  org.joda.time.format.TestPeriodFormat#test_wordBased_pt_formatTwoFields ComparisonFailure
  org.joda.time.format.TestPeriodFormatterBuilder#testFormatSeparatorComplex ComparisonFailure
  org.joda.time.format.TestPeriodFormatterBuilder#testFormatSeparatorSimple ComparisonFailure
  org.joda.time.format.TestPeriodFormatterBuilder#testMonthsAndMinutesAreConsideredSeparateAndCaseIsNotIgnored ComparisonFailure

Tests run: 4157, Failures: 38, Errors: 0, Skipped: 0

[INFO] ------------------------------------------------------------------------
[INFO] BUILD FAILURE
[INFO] ------------------------------------------------------------------------
[INFO] Total time: 16.511s
[INFO] Finished at: Thu Aug 06 10:39:39 BST 2015
[INFO] Final Memory: 9M/209M
[INFO] ------------------------------------------------------------------------
[ERROR] Failed to execute goal org.apache.maven.plugins:maven-surefire-plugin:2.18.1:test (default-test) on project joda-time: There are test failures.
[ERROR] 
[ERROR] Please refer to /home/perham/Study/LittleDarwin/Cases/joda-time-2.8.1/target/surefire-reports for the individual test results.
[ERROR] -> [Help 1]
[ERROR] 
[ERROR] To see the full stack trace of the errors, re-run Maven with the -e switch.
[ERROR] Re-run Maven using the -X switch to enable full debug logging.
[ERROR] 
[ERROR] For more information about the errors and possible solutions, please read the following articles:
[ERROR] [Help 1] http://cwiki.apache.org/confluence/display/MAVEN/MojoFailureException
