[INFO] Scanning for projects...
[INFO]                                                                         
[INFO] ------------------------------------------------------------------------
[INFO] Building Joda-Time 2.8.1
[INFO] ------------------------------------------------------------------------
[INFO] 
[INFO] --- maven-resources-plugin:2.7:resources (default-resources) @ joda-time ---
[INFO] Using 'UTF-8' encoding to copy filtered resources.
[INFO] Copying 2 resources to META-INF
[INFO] Copying 10 resources
[INFO] 
[INFO] --- maven-compiler-plugin:3.3:compile (default-compile) @ joda-time ---
[INFO] Changes detected - recompiling the module!
[INFO] Compiling 166 source files to /home/perham/Study/LittleDarwin/Cases/joda-time-2.8.1/target/classes
[INFO] 
[INFO] --- exec-maven-plugin:1.4.0:java (compile-tzdb) @ joda-time ---
Writing zoneinfo files
Writing ZoneInfoMap
[INFO] 
[INFO] --- maven-resources-plugin:2.7:testResources (default-testResources) @ joda-time ---
[INFO] Using 'UTF-8' encoding to copy filtered resources.
[INFO] Copying 34 resources
[INFO] 
[INFO] --- maven-compiler-plugin:3.3:testCompile (default-testCompile) @ joda-time ---
[INFO] Nothing to compile - all classes are up to date
[INFO] 
[INFO] --- maven-surefire-plugin:2.18.1:test (default-test) @ joda-time ---
[INFO] Surefire report directory: /home/perham/Study/LittleDarwin/Cases/joda-time-2.8.1/target/surefire-reports

-------------------------------------------------------
 T E S T S
-------------------------------------------------------
Running org.joda.time.TestAllPackages

TestBuddhistChronology.testCalendar

TestCopticChronology.testCalendar

TestEthiopicChronology.testCalendar

TestIslamicChronology.testCalendar

Testing Gregorian chronology over 1000 iterations
100% complete (i=1000)

Testing Julian chronology over 1000 iterations
100% complete (i=1000)
Writing zoneinfo files
Writing ZoneInfoMap
Tests run: 4157, Failures: 1, Errors: 8, Skipped: 0, Time elapsed: 5.306 sec <<< FAILURE! - in org.joda.time.TestAllPackages
testToString_PeriodFormatter(org.joda.time.TestPeriod_Basics)  Time elapsed: 0.009 sec  <<< FAILURE!
junit.framework.ComparisonFailure: expected:<[1 year, 2 months, 3 weeks, 4 days, 5 hours, 6 minutes, 7 seconds and 8 milliseconds]> but was:<[P1Y2M3W4DT5H6M7.008S]>
	at junit.framework.Assert.assertEquals(Assert.java:81)
	at junit.framework.Assert.assertEquals(Assert.java:87)
	at org.joda.time.TestPeriod_Basics.testToString_PeriodFormatter(TestPeriod_Basics.java:484)

test_wordBased_pl_formatTwoFields(org.joda.time.format.TestPeriodFormat)  Time elapsed: 0.008 sec  <<< ERROR!
java.lang.NullPointerException
	at org.joda.time.format.TestPeriodFormat.test_wordBased_pl_formatTwoFields(TestPeriodFormat.java:392)

test_wordBased_fr_from_de(org.joda.time.format.TestPeriodFormat)  Time elapsed: 0.003 sec  <<< ERROR!
java.lang.NullPointerException
	at org.joda.time.format.TestPeriodFormat.test_wordBased_fr_from_de(TestPeriodFormat.java:580)

test_wordBased_localeValue(org.joda.time.format.TestPeriodFormat)  Time elapsed: 0.002 sec  <<< ERROR!
java.lang.NullPointerException
	at org.joda.time.format.TestPeriodFormat.test_wordBased_localeValue(TestPeriodFormat.java:621)

test_wordBased_en_withLocale_pt(org.joda.time.format.TestPeriodFormat)  Time elapsed: 0.004 sec  <<< ERROR!
java.lang.NullPointerException
	at org.joda.time.format.PeriodFormat$DynamicWordBased.getPrinter(PeriodFormat.java:80)
	at org.joda.time.format.PeriodFormat$DynamicWordBased.calculatePrintedLength(PeriodFormat.java:77)
	at org.joda.time.format.PeriodFormatter.print(PeriodFormatter.java:244)
	at org.joda.time.format.TestPeriodFormat.test_wordBased_en_withLocale_pt(TestPeriodFormat.java:638)

test_wordBased_es_formatStandard(org.joda.time.format.TestPeriodFormat)  Time elapsed: 0.002 sec  <<< ERROR!
java.lang.NullPointerException
	at org.joda.time.format.TestPeriodFormat.test_wordBased_es_formatStandard(TestPeriodFormat.java:208)

test_wordBased_nl_formatStandard(org.joda.time.format.TestPeriodFormat)  Time elapsed: 0.004 sec  <<< ERROR!
java.lang.NullPointerException
	at org.joda.time.format.TestPeriodFormat.test_wordBased_nl_formatStandard(TestPeriodFormat.java:282)

test_wordBased_da_formatMultiple(org.joda.time.format.TestPeriodFormat)  Time elapsed: 0.008 sec  <<< ERROR!
java.lang.NullPointerException
	at org.joda.time.format.TestPeriodFormat.test_wordBased_da_formatMultiple(TestPeriodFormat.java:319)

test_wordBased_ja_formatMultiple(org.joda.time.format.TestPeriodFormat)  Time elapsed: 0 sec  <<< ERROR!
java.lang.NullPointerException
	at org.joda.time.format.TestPeriodFormat.test_wordBased_ja_formatMultiple(TestPeriodFormat.java:338)


Results :

Failed tests: 
  org.joda.time.TestPeriod_Basics#testToString_PeriodFormatter ComparisonFailure
Tests in error: 
  org.joda.time.format.TestPeriodFormat#test_wordBased_da_formatMultiple NullPointerException
  org.joda.time.format.TestPeriodFormat#test_wordBased_en_withLocale_pt NullPointerException
  org.joda.time.format.TestPeriodFormat#test_wordBased_es_formatStandard NullPointerException
  org.joda.time.format.TestPeriodFormat#test_wordBased_fr_from_de NullPointerException
  org.joda.time.format.TestPeriodFormat#test_wordBased_ja_formatMultiple NullPointerException
  org.joda.time.format.TestPeriodFormat#test_wordBased_localeValue NullPointerException
  org.joda.time.format.TestPeriodFormat#test_wordBased_nl_formatStandard NullPointerException
  org.joda.time.format.TestPeriodFormat#test_wordBased_pl_formatTwoFields NullPointerException

Tests run: 4157, Failures: 1, Errors: 8, Skipped: 0

[INFO] ------------------------------------------------------------------------
[INFO] BUILD FAILURE
[INFO] ------------------------------------------------------------------------
[INFO] Total time: 15.707s
[INFO] Finished at: Thu Aug 06 09:57:31 BST 2015
[INFO] Final Memory: 9M/213M
[INFO] ------------------------------------------------------------------------
[ERROR] Failed to execute goal org.apache.maven.plugins:maven-surefire-plugin:2.18.1:test (default-test) on project joda-time: There are test failures.
[ERROR] 
[ERROR] Please refer to /home/perham/Study/LittleDarwin/Cases/joda-time-2.8.1/target/surefire-reports for the individual test results.
[ERROR] -> [Help 1]
[ERROR] 
[ERROR] To see the full stack trace of the errors, re-run Maven with the -e switch.
[ERROR] Re-run Maven using the -X switch to enable full debug logging.
[ERROR] 
[ERROR] For more information about the errors and possible solutions, please read the following articles:
[ERROR] [Help 1] http://cwiki.apache.org/confluence/display/MAVEN/MojoFailureException
