[INFO] Scanning for projects...
[INFO]                                                                         
[INFO] ------------------------------------------------------------------------
[INFO] Building Joda-Time 2.8.1
[INFO] ------------------------------------------------------------------------
[INFO] 
[INFO] --- maven-resources-plugin:2.7:resources (default-resources) @ joda-time ---
[INFO] Using 'UTF-8' encoding to copy filtered resources.
[INFO] Copying 2 resources to META-INF
[INFO] Copying 10 resources
[INFO] 
[INFO] --- maven-compiler-plugin:3.3:compile (default-compile) @ joda-time ---
[INFO] Changes detected - recompiling the module!
[INFO] Compiling 166 source files to /home/perham/Study/LittleDarwin/Cases/joda-time-2.8.1/target/classes
[INFO] 
[INFO] --- exec-maven-plugin:1.4.0:java (compile-tzdb) @ joda-time ---
Writing zoneinfo files
Writing ZoneInfoMap
[INFO] 
[INFO] --- maven-resources-plugin:2.7:testResources (default-testResources) @ joda-time ---
[INFO] Using 'UTF-8' encoding to copy filtered resources.
[INFO] Copying 34 resources
[INFO] 
[INFO] --- maven-compiler-plugin:3.3:testCompile (default-testCompile) @ joda-time ---
[INFO] Nothing to compile - all classes are up to date
[INFO] 
[INFO] --- maven-surefire-plugin:2.18.1:test (default-test) @ joda-time ---
[INFO] Surefire report directory: /home/perham/Study/LittleDarwin/Cases/joda-time-2.8.1/target/surefire-reports

-------------------------------------------------------
 T E S T S
-------------------------------------------------------
Running org.joda.time.TestAllPackages

TestBuddhistChronology.testCalendar

TestCopticChronology.testCalendar

TestEthiopicChronology.testCalendar

TestIslamicChronology.testCalendar

Testing Gregorian chronology over 1000 iterations
100% complete (i=1000)

Testing Julian chronology over 1000 iterations
100% complete (i=1000)
Writing zoneinfo files
Writing ZoneInfoMap
Tests run: 4157, Failures: 3, Errors: 24, Skipped: 0, Time elapsed: 5.31 sec <<< FAILURE! - in org.joda.time.TestAllPackages
testToString(org.joda.time.TestMonthDay_Basics)  Time elapsed: 0.014 sec  <<< ERROR!
java.lang.IllegalArgumentException: No valid ISO8601 format for fields because Time was truncated: []
	at org.joda.time.format.ISODateTimeFormat.time(ISODateTimeFormat.java:98)
	at org.joda.time.format.ISODateTimeFormat.forFields(ISODateTimeFormat.java:29)
	at org.joda.time.MonthDay.toString(MonthDay.java:786)
	at org.joda.time.TestMonthDay_Basics.testToString(TestMonthDay_Basics.java:789)

testToString_String(org.joda.time.TestMonthDay_Basics)  Time elapsed: 0.001 sec  <<< ERROR!
java.lang.IllegalArgumentException: No valid ISO8601 format for fields because Time was truncated: []
	at org.joda.time.format.ISODateTimeFormat.time(ISODateTimeFormat.java:98)
	at org.joda.time.format.ISODateTimeFormat.forFields(ISODateTimeFormat.java:29)
	at org.joda.time.MonthDay.toString(MonthDay.java:786)
	at org.joda.time.MonthDay.toString(MonthDay.java:797)
	at org.joda.time.TestMonthDay_Basics.testToString_String(TestMonthDay_Basics.java:796)

testToString_String_Locale(org.joda.time.TestMonthDay_Basics)  Time elapsed: 0.001 sec  <<< ERROR!
java.lang.IllegalArgumentException: No valid ISO8601 format for fields because Time was truncated: []
	at org.joda.time.format.ISODateTimeFormat.time(ISODateTimeFormat.java:98)
	at org.joda.time.format.ISODateTimeFormat.forFields(ISODateTimeFormat.java:29)
	at org.joda.time.MonthDay.toString(MonthDay.java:786)
	at org.joda.time.MonthDay.toString(MonthDay.java:811)
	at org.joda.time.TestMonthDay_Basics.testToString_String_Locale(TestMonthDay_Basics.java:804)

testToString_DTFormatter(org.joda.time.TestMonthDay_Basics)  Time elapsed: 0.002 sec  <<< ERROR!
java.lang.IllegalArgumentException: No valid ISO8601 format for fields because Time was truncated: []
	at org.joda.time.format.ISODateTimeFormat.time(ISODateTimeFormat.java:98)
	at org.joda.time.format.ISODateTimeFormat.forFields(ISODateTimeFormat.java:29)
	at org.joda.time.MonthDay.toString(MonthDay.java:786)
	at org.joda.time.base.AbstractPartial.toString(AbstractPartial.java:410)
	at org.joda.time.TestMonthDay_Basics.testToString_DTFormatter(TestMonthDay_Basics.java:813)

testMonthDay(org.joda.time.TestStringConvert)  Time elapsed: 0.002 sec  <<< ERROR!
java.lang.IllegalArgumentException: No valid ISO8601 format for fields because Time was truncated: []
	at org.joda.time.format.ISODateTimeFormat.time(ISODateTimeFormat.java:98)
	at org.joda.time.format.ISODateTimeFormat.forFields(ISODateTimeFormat.java:29)
	at org.joda.time.MonthDay.toString(MonthDay.java:786)
	at sun.reflect.NativeMethodAccessorImpl.invoke0(Native Method)
	at sun.reflect.NativeMethodAccessorImpl.invoke(NativeMethodAccessorImpl.java:57)
	at sun.reflect.DelegatingMethodAccessorImpl.invoke(DelegatingMethodAccessorImpl.java:43)
	at java.lang.reflect.Method.invoke(Method.java:606)
	at org.joda.convert.ReflectionStringConverter.convertToString(ReflectionStringConverter.java:63)
	at org.joda.convert.StringConvert.convertToString(StringConvert.java:124)
	at org.joda.time.TestStringConvert.testMonthDay(TestStringConvert.java:104)

testMonthDay_leapDay(org.joda.time.TestStringConvert)  Time elapsed: 0 sec  <<< ERROR!
java.lang.IllegalArgumentException: No valid ISO8601 format for fields because Time was truncated: []
	at org.joda.time.format.ISODateTimeFormat.time(ISODateTimeFormat.java:98)
	at org.joda.time.format.ISODateTimeFormat.forFields(ISODateTimeFormat.java:29)
	at org.joda.time.MonthDay.toString(MonthDay.java:786)
	at sun.reflect.NativeMethodAccessorImpl.invoke0(Native Method)
	at sun.reflect.NativeMethodAccessorImpl.invoke(NativeMethodAccessorImpl.java:57)
	at sun.reflect.DelegatingMethodAccessorImpl.invoke(DelegatingMethodAccessorImpl.java:43)
	at java.lang.reflect.Method.invoke(Method.java:606)
	at org.joda.convert.ReflectionStringConverter.convertToString(ReflectionStringConverter.java:63)
	at org.joda.convert.StringConvert.convertToString(StringConvert.java:124)
	at org.joda.time.TestStringConvert.testMonthDay_leapDay(TestStringConvert.java:111)

testForFields_calBased_YM(org.joda.time.format.TestISODateTimeFormat_Fields)  Time elapsed: 0.001 sec  <<< ERROR!
java.lang.IllegalArgumentException: No valid ISO8601 format for fields because Time was truncated: []
	at org.joda.time.format.ISODateTimeFormat.time(ISODateTimeFormat.java:98)
	at org.joda.time.format.ISODateTimeFormat.forFields(ISODateTimeFormat.java:29)
	at org.joda.time.format.TestISODateTimeFormat_Fields.testForFields_calBased_YM(TestISODateTimeFormat_Fields.java:235)

testForFields_calBased_MD(org.joda.time.format.TestISODateTimeFormat_Fields)  Time elapsed: 0.001 sec  <<< ERROR!
java.lang.IllegalArgumentException: No valid ISO8601 format for fields because Time was truncated: []
	at org.joda.time.format.ISODateTimeFormat.time(ISODateTimeFormat.java:98)
	at org.joda.time.format.ISODateTimeFormat.forFields(ISODateTimeFormat.java:29)
	at org.joda.time.format.TestISODateTimeFormat_Fields.testForFields_calBased_MD(TestISODateTimeFormat_Fields.java:263)

testForFields_weekBased_YWD(org.joda.time.format.TestISODateTimeFormat_Fields)  Time elapsed: 0 sec  <<< ERROR!
java.lang.IllegalArgumentException: No valid ISO8601 format for fields because Time was truncated: []
	at org.joda.time.format.ISODateTimeFormat.time(ISODateTimeFormat.java:98)
	at org.joda.time.format.ISODateTimeFormat.forFields(ISODateTimeFormat.java:29)
	at org.joda.time.format.TestISODateTimeFormat_Fields.testForFields_weekBased_YWD(TestISODateTimeFormat_Fields.java:324)

testForFields_weekBased_Y(org.joda.time.format.TestISODateTimeFormat_Fields)  Time elapsed: 0.001 sec  <<< ERROR!
java.lang.IllegalArgumentException: No valid ISO8601 format for fields because Time was truncated: []
	at org.joda.time.format.ISODateTimeFormat.time(ISODateTimeFormat.java:98)
	at org.joda.time.format.ISODateTimeFormat.forFields(ISODateTimeFormat.java:29)
	at org.joda.time.format.TestISODateTimeFormat_Fields.testForFields_weekBased_Y(TestISODateTimeFormat_Fields.java:351)

testForFields_weekBased_W(org.joda.time.format.TestISODateTimeFormat_Fields)  Time elapsed: 0.001 sec  <<< ERROR!
java.lang.IllegalArgumentException: No valid ISO8601 format for fields because Time was truncated: []
	at org.joda.time.format.ISODateTimeFormat.time(ISODateTimeFormat.java:98)
	at org.joda.time.format.ISODateTimeFormat.forFields(ISODateTimeFormat.java:29)
	at org.joda.time.format.TestISODateTimeFormat_Fields.testForFields_weekBased_W(TestISODateTimeFormat_Fields.java:378)

testForFields_weekBased_D(org.joda.time.format.TestISODateTimeFormat_Fields)  Time elapsed: 0 sec  <<< ERROR!
java.lang.IllegalArgumentException: No valid ISO8601 format for fields because Time was truncated: []
	at org.joda.time.format.ISODateTimeFormat.time(ISODateTimeFormat.java:98)
	at org.joda.time.format.ISODateTimeFormat.forFields(ISODateTimeFormat.java:29)
	at org.joda.time.format.TestISODateTimeFormat_Fields.testForFields_weekBased_D(TestISODateTimeFormat_Fields.java:405)

testForFields_weekBased_YW(org.joda.time.format.TestISODateTimeFormat_Fields)  Time elapsed: 0.001 sec  <<< ERROR!
java.lang.IllegalArgumentException: No valid ISO8601 format for fields because Time was truncated: []
	at org.joda.time.format.ISODateTimeFormat.time(ISODateTimeFormat.java:98)
	at org.joda.time.format.ISODateTimeFormat.forFields(ISODateTimeFormat.java:29)
	at org.joda.time.format.TestISODateTimeFormat_Fields.testForFields_weekBased_YW(TestISODateTimeFormat_Fields.java:433)

testForFields_weekBased_WD(org.joda.time.format.TestISODateTimeFormat_Fields)  Time elapsed: 0 sec  <<< ERROR!
java.lang.IllegalArgumentException: No valid ISO8601 format for fields because Time was truncated: []
	at org.joda.time.format.ISODateTimeFormat.time(ISODateTimeFormat.java:98)
	at org.joda.time.format.ISODateTimeFormat.forFields(ISODateTimeFormat.java:29)
	at org.joda.time.format.TestISODateTimeFormat_Fields.testForFields_weekBased_WD(TestISODateTimeFormat_Fields.java:461)

testForFields_ordinalBased_YD(org.joda.time.format.TestISODateTimeFormat_Fields)  Time elapsed: 0.001 sec  <<< ERROR!
java.lang.IllegalArgumentException: No valid ISO8601 format for fields because Time was truncated: []
	at org.joda.time.format.ISODateTimeFormat.time(ISODateTimeFormat.java:98)
	at org.joda.time.format.ISODateTimeFormat.forFields(ISODateTimeFormat.java:29)
	at org.joda.time.format.TestISODateTimeFormat_Fields.testForFields_ordinalBased_YD(TestISODateTimeFormat_Fields.java:521)

testForFields_ordinalBased_Y(org.joda.time.format.TestISODateTimeFormat_Fields)  Time elapsed: 0.001 sec  <<< ERROR!
java.lang.IllegalArgumentException: No valid ISO8601 format for fields because Time was truncated: []
	at org.joda.time.format.ISODateTimeFormat.time(ISODateTimeFormat.java:98)
	at org.joda.time.format.ISODateTimeFormat.forFields(ISODateTimeFormat.java:29)
	at org.joda.time.format.TestISODateTimeFormat_Fields.testForFields_ordinalBased_Y(TestISODateTimeFormat_Fields.java:548)

testForFields_ordinalBased_D(org.joda.time.format.TestISODateTimeFormat_Fields)  Time elapsed: 0 sec  <<< ERROR!
java.lang.IllegalArgumentException: No valid ISO8601 format for fields because Time was truncated: []
	at org.joda.time.format.ISODateTimeFormat.time(ISODateTimeFormat.java:98)
	at org.joda.time.format.ISODateTimeFormat.forFields(ISODateTimeFormat.java:29)
	at org.joda.time.format.TestISODateTimeFormat_Fields.testForFields_ordinalBased_D(TestISODateTimeFormat_Fields.java:575)

testForFields_calBased_YMD(org.joda.time.format.TestISODateTimeFormat_Fields)  Time elapsed: 0.001 sec  <<< ERROR!
java.lang.IllegalArgumentException: No valid ISO8601 format for fields because Time was truncated: []
	at org.joda.time.format.ISODateTimeFormat.time(ISODateTimeFormat.java:98)
	at org.joda.time.format.ISODateTimeFormat.forFields(ISODateTimeFormat.java:29)
	at org.joda.time.format.TestISODateTimeFormat_Fields.testForFields_calBased_YMD(TestISODateTimeFormat_Fields.java:82)

testForFields_calBased_YMD_unmodifiable(org.joda.time.format.TestISODateTimeFormat_Fields)  Time elapsed: 0 sec  <<< ERROR!
java.lang.IllegalArgumentException: No valid ISO8601 format for fields because Time was truncated: []
	at org.joda.time.format.ISODateTimeFormat.time(ISODateTimeFormat.java:98)
	at org.joda.time.format.ISODateTimeFormat.forFields(ISODateTimeFormat.java:29)
	at org.joda.time.format.TestISODateTimeFormat_Fields.testForFields_calBased_YMD_unmodifiable(TestISODateTimeFormat_Fields.java:111)

testForFields_calBased_YMD_duplicates(org.joda.time.format.TestISODateTimeFormat_Fields)  Time elapsed: 0.001 sec  <<< ERROR!
java.lang.IllegalArgumentException: No valid ISO8601 format for fields because Time was truncated: []
	at org.joda.time.format.ISODateTimeFormat.time(ISODateTimeFormat.java:98)
	at org.joda.time.format.ISODateTimeFormat.forFields(ISODateTimeFormat.java:29)
	at org.joda.time.format.TestISODateTimeFormat_Fields.testForFields_calBased_YMD_duplicates(TestISODateTimeFormat_Fields.java:136)

testForFields_calBased_Y(org.joda.time.format.TestISODateTimeFormat_Fields)  Time elapsed: 0 sec  <<< ERROR!
java.lang.IllegalArgumentException: No valid ISO8601 format for fields because Time was truncated: []
	at org.joda.time.format.ISODateTimeFormat.time(ISODateTimeFormat.java:98)
	at org.joda.time.format.ISODateTimeFormat.forFields(ISODateTimeFormat.java:29)
	at org.joda.time.format.TestISODateTimeFormat_Fields.testForFields_calBased_Y(TestISODateTimeFormat_Fields.java:153)

testForFields_calBased_M(org.joda.time.format.TestISODateTimeFormat_Fields)  Time elapsed: 0.001 sec  <<< ERROR!
java.lang.IllegalArgumentException: No valid ISO8601 format for fields because Time was truncated: []
	at org.joda.time.format.ISODateTimeFormat.time(ISODateTimeFormat.java:98)
	at org.joda.time.format.ISODateTimeFormat.forFields(ISODateTimeFormat.java:29)
	at org.joda.time.format.TestISODateTimeFormat_Fields.testForFields_calBased_M(TestISODateTimeFormat_Fields.java:180)

testForFields_calBased_D(org.joda.time.format.TestISODateTimeFormat_Fields)  Time elapsed: 0 sec  <<< ERROR!
java.lang.IllegalArgumentException: No valid ISO8601 format for fields because Time was truncated: []
	at org.joda.time.format.ISODateTimeFormat.time(ISODateTimeFormat.java:98)
	at org.joda.time.format.ISODateTimeFormat.forFields(ISODateTimeFormat.java:29)
	at org.joda.time.format.TestISODateTimeFormat_Fields.testForFields_calBased_D(TestISODateTimeFormat_Fields.java:207)

testForFields_time_H(org.joda.time.format.TestISODateTimeFormat_Fields)  Time elapsed: 0.001 sec  <<< ERROR!
java.lang.IllegalArgumentException: No valid format for fields: [hourOfDay]
	at org.joda.time.format.ISODateTimeFormat.forFields(ISODateTimeFormat.java:30)
	at org.joda.time.format.TestISODateTimeFormat_Fields.testForFields_time_H(TestISODateTimeFormat_Fields.java:691)

testForFields_datetime_YMDH(org.joda.time.format.TestISODateTimeFormat_Fields)  Time elapsed: 0.002 sec  <<< FAILURE!
junit.framework.ComparisonFailure: expected:<2005-06-25[T12]> but was:<2005-06-25[]>
	at junit.framework.Assert.assertEquals(Assert.java:81)
	at junit.framework.Assert.assertEquals(Assert.java:87)
	at org.joda.time.format.TestISODateTimeFormat_Fields.testForFields_datetime_YMDH(TestISODateTimeFormat_Fields.java:1044)

testForFields_datetime_DH(org.joda.time.format.TestISODateTimeFormat_Fields)  Time elapsed: 0 sec  <<< FAILURE!
junit.framework.ComparisonFailure: expected:<---25[T12]> but was:<---25[]>
	at junit.framework.Assert.assertEquals(Assert.java:81)
	at junit.framework.Assert.assertEquals(Assert.java:87)
	at org.joda.time.format.TestISODateTimeFormat_Fields.testForFields_datetime_DH(TestISODateTimeFormat_Fields.java:1072)

testForFields_datetime_YH(org.joda.time.format.TestISODateTimeFormat_Fields)  Time elapsed: 0.001 sec  <<< FAILURE!
junit.framework.ComparisonFailure: expected:<2005[T12]> but was:<2005[]>
	at junit.framework.Assert.assertEquals(Assert.java:81)
	at junit.framework.Assert.assertEquals(Assert.java:87)
	at org.joda.time.format.TestISODateTimeFormat_Fields.testForFields_datetime_YH(TestISODateTimeFormat_Fields.java:1100)


Results :

Failed tests: 
  org.joda.time.format.TestISODateTimeFormat_Fields#testForFields_datetime_DH ComparisonFailure
  org.joda.time.format.TestISODateTimeFormat_Fields#testForFields_datetime_YH ComparisonFailure
  org.joda.time.format.TestISODateTimeFormat_Fields#testForFields_datetime_YMDH ComparisonFailure
Tests in error: 
  org.joda.time.TestMonthDay_Basics#testToString IllegalArgumentException No val...
  org.joda.time.TestMonthDay_Basics#testToString_DTFormatter IllegalArgumentException
  org.joda.time.TestMonthDay_Basics#testToString_String IllegalArgumentException
  org.joda.time.TestMonthDay_Basics#testToString_String_Locale IllegalArgumentException
  org.joda.time.TestStringConvert#testMonthDay IllegalArgumentException No valid...
  org.joda.time.TestStringConvert#testMonthDay_leapDay IllegalArgumentException ...
  org.joda.time.format.TestISODateTimeFormat_Fields#testForFields_calBased_D IllegalArgumentException
  org.joda.time.format.TestISODateTimeFormat_Fields#testForFields_calBased_M IllegalArgumentException
  org.joda.time.format.TestISODateTimeFormat_Fields#testForFields_calBased_MD IllegalArgumentException
  org.joda.time.format.TestISODateTimeFormat_Fields#testForFields_calBased_Y IllegalArgumentException
  org.joda.time.format.TestISODateTimeFormat_Fields#testForFields_calBased_YM IllegalArgumentException
  org.joda.time.format.TestISODateTimeFormat_Fields#testForFields_calBased_YMD IllegalArgumentException
  org.joda.time.format.TestISODateTimeFormat_Fields#testForFields_calBased_YMD_duplicates IllegalArgumentException
  org.joda.time.format.TestISODateTimeFormat_Fields#testForFields_calBased_YMD_unmodifiable IllegalArgumentException
  org.joda.time.format.TestISODateTimeFormat_Fields#testForFields_ordinalBased_D IllegalArgumentException
  org.joda.time.format.TestISODateTimeFormat_Fields#testForFields_ordinalBased_Y IllegalArgumentException
  org.joda.time.format.TestISODateTimeFormat_Fields#testForFields_ordinalBased_YD IllegalArgumentException
  org.joda.time.format.TestISODateTimeFormat_Fields#testForFields_time_H IllegalArgumentException
  org.joda.time.format.TestISODateTimeFormat_Fields#testForFields_weekBased_D IllegalArgumentException
  org.joda.time.format.TestISODateTimeFormat_Fields#testForFields_weekBased_W IllegalArgumentException
  org.joda.time.format.TestISODateTimeFormat_Fields#testForFields_weekBased_WD IllegalArgumentException
  org.joda.time.format.TestISODateTimeFormat_Fields#testForFields_weekBased_Y IllegalArgumentException
  org.joda.time.format.TestISODateTimeFormat_Fields#testForFields_weekBased_YW IllegalArgumentException
  org.joda.time.format.TestISODateTimeFormat_Fields#testForFields_weekBased_YWD IllegalArgumentException

Tests run: 4157, Failures: 3, Errors: 24, Skipped: 0

[INFO] ------------------------------------------------------------------------
[INFO] BUILD FAILURE
[INFO] ------------------------------------------------------------------------
[INFO] Total time: 16.080s
[INFO] Finished at: Thu Aug 06 09:54:04 BST 2015
[INFO] Final Memory: 8M/216M
[INFO] ------------------------------------------------------------------------
[ERROR] Failed to execute goal org.apache.maven.plugins:maven-surefire-plugin:2.18.1:test (default-test) on project joda-time: There are test failures.
[ERROR] 
[ERROR] Please refer to /home/perham/Study/LittleDarwin/Cases/joda-time-2.8.1/target/surefire-reports for the individual test results.
[ERROR] -> [Help 1]
[ERROR] 
[ERROR] To see the full stack trace of the errors, re-run Maven with the -e switch.
[ERROR] Re-run Maven using the -X switch to enable full debug logging.
[ERROR] 
[ERROR] For more information about the errors and possible solutions, please read the following articles:
[ERROR] [Help 1] http://cwiki.apache.org/confluence/display/MAVEN/MojoFailureException
