[INFO] Scanning for projects...
[INFO]                                                                         
[INFO] ------------------------------------------------------------------------
[INFO] Building Joda-Time 2.8.1
[INFO] ------------------------------------------------------------------------
[INFO] 
[INFO] --- maven-resources-plugin:2.7:resources (default-resources) @ joda-time ---
[INFO] Using 'UTF-8' encoding to copy filtered resources.
[INFO] Copying 2 resources to META-INF
[INFO] Copying 10 resources
[INFO] 
[INFO] --- maven-compiler-plugin:3.3:compile (default-compile) @ joda-time ---
[INFO] Changes detected - recompiling the module!
[INFO] Compiling 166 source files to /home/perham/Study/LittleDarwin/Cases/joda-time-2.8.1/target/classes
[INFO] 
[INFO] --- exec-maven-plugin:1.4.0:java (compile-tzdb) @ joda-time ---
Writing zoneinfo files
Writing ZoneInfoMap
[INFO] 
[INFO] --- maven-resources-plugin:2.7:testResources (default-testResources) @ joda-time ---
[INFO] Using 'UTF-8' encoding to copy filtered resources.
[INFO] Copying 34 resources
[INFO] 
[INFO] --- maven-compiler-plugin:3.3:testCompile (default-testCompile) @ joda-time ---
[INFO] Nothing to compile - all classes are up to date
[INFO] 
[INFO] --- maven-surefire-plugin:2.18.1:test (default-test) @ joda-time ---
[INFO] Surefire report directory: /home/perham/Study/LittleDarwin/Cases/joda-time-2.8.1/target/surefire-reports

-------------------------------------------------------
 T E S T S
-------------------------------------------------------
Running org.joda.time.TestAllPackages

TestBuddhistChronology.testCalendar

TestCopticChronology.testCalendar

TestEthiopicChronology.testCalendar

TestIslamicChronology.testCalendar

Testing Gregorian chronology over 1000 iterations
100% complete (i=1000)

Testing Julian chronology over 1000 iterations
100% complete (i=1000)
Writing zoneinfo files
Writing ZoneInfoMap
Tests run: 4157, Failures: 0, Errors: 19, Skipped: 0, Time elapsed: 5.531 sec <<< FAILURE! - in org.joda.time.TestAllPackages
testParse_noFormatter(org.joda.time.TestLocalTime_Constructors)  Time elapsed: 0.002 sec  <<< ERROR!
java.lang.NullPointerException
	at org.joda.time.LocalTime.parse(LocalTime.java:175)
	at org.joda.time.LocalTime.parse(LocalTime.java:164)
	at org.joda.time.TestLocalTime_Constructors.testParse_noFormatter(TestLocalTime_Constructors.java:113)

testConstructor_ObjectString1(org.joda.time.TestLocalTime_Constructors)  Time elapsed: 0.001 sec  <<< ERROR!
java.lang.NullPointerException
	at org.joda.time.convert.StringConverter.getPartialValues(StringConverter.java:84)
	at org.joda.time.LocalTime.<init>(LocalTime.java:435)
	at org.joda.time.LocalTime.<init>(LocalTime.java:383)
	at org.joda.time.TestLocalTime_Constructors.testConstructor_ObjectString1(TestLocalTime_Constructors.java:363)

testConstructor_ObjectString2(org.joda.time.TestLocalTime_Constructors)  Time elapsed: 0.001 sec  <<< ERROR!
java.lang.NullPointerException
	at org.joda.time.convert.StringConverter.getPartialValues(StringConverter.java:84)
	at org.joda.time.LocalTime.<init>(LocalTime.java:435)
	at org.joda.time.LocalTime.<init>(LocalTime.java:383)
	at org.joda.time.TestLocalTime_Constructors.testConstructor_ObjectString2(TestLocalTime_Constructors.java:392)

testConstructor_ObjectString3(org.joda.time.TestLocalTime_Constructors)  Time elapsed: 0.001 sec  <<< ERROR!
java.lang.NullPointerException
	at org.joda.time.convert.StringConverter.getPartialValues(StringConverter.java:84)
	at org.joda.time.LocalTime.<init>(LocalTime.java:435)
	at org.joda.time.LocalTime.<init>(LocalTime.java:383)
	at org.joda.time.TestLocalTime_Constructors.testConstructor_ObjectString3(TestLocalTime_Constructors.java:401)

testConstructor_ObjectString4(org.joda.time.TestLocalTime_Constructors)  Time elapsed: 0.001 sec  <<< ERROR!
java.lang.NullPointerException
	at org.joda.time.convert.StringConverter.getPartialValues(StringConverter.java:84)
	at org.joda.time.LocalTime.<init>(LocalTime.java:435)
	at org.joda.time.LocalTime.<init>(LocalTime.java:383)
	at org.joda.time.TestLocalTime_Constructors.testConstructor_ObjectString4(TestLocalTime_Constructors.java:410)

testConstructor_ObjectStringEx1(org.joda.time.TestLocalTime_Constructors)  Time elapsed: 0.002 sec  <<< ERROR!
java.lang.NullPointerException
	at org.joda.time.convert.StringConverter.getPartialValues(StringConverter.java:84)
	at org.joda.time.LocalTime.<init>(LocalTime.java:435)
	at org.joda.time.LocalTime.<init>(LocalTime.java:383)
	at org.joda.time.TestLocalTime_Constructors.testConstructor_ObjectStringEx1(TestLocalTime_Constructors.java:420)

testConstructor_ObjectStringEx2(org.joda.time.TestLocalTime_Constructors)  Time elapsed: 0.001 sec  <<< ERROR!
java.lang.NullPointerException
	at org.joda.time.convert.StringConverter.getPartialValues(StringConverter.java:84)
	at org.joda.time.LocalTime.<init>(LocalTime.java:435)
	at org.joda.time.LocalTime.<init>(LocalTime.java:383)
	at org.joda.time.TestLocalTime_Constructors.testConstructor_ObjectStringEx2(TestLocalTime_Constructors.java:427)

testConstructor_ObjectStringEx3(org.joda.time.TestLocalTime_Constructors)  Time elapsed: 0.001 sec  <<< ERROR!
java.lang.NullPointerException
	at org.joda.time.convert.StringConverter.getPartialValues(StringConverter.java:84)
	at org.joda.time.LocalTime.<init>(LocalTime.java:435)
	at org.joda.time.LocalTime.<init>(LocalTime.java:383)
	at org.joda.time.TestLocalTime_Constructors.testConstructor_ObjectStringEx3(TestLocalTime_Constructors.java:434)

testConstructor_ObjectStringEx4(org.joda.time.TestLocalTime_Constructors)  Time elapsed: 0.001 sec  <<< ERROR!
java.lang.NullPointerException
	at org.joda.time.convert.StringConverter.getPartialValues(StringConverter.java:84)
	at org.joda.time.LocalTime.<init>(LocalTime.java:435)
	at org.joda.time.LocalTime.<init>(LocalTime.java:383)
	at org.joda.time.TestLocalTime_Constructors.testConstructor_ObjectStringEx4(TestLocalTime_Constructors.java:441)

testConstructor_ObjectStringEx5(org.joda.time.TestLocalTime_Constructors)  Time elapsed: 0 sec  <<< ERROR!
java.lang.NullPointerException
	at org.joda.time.convert.StringConverter.getPartialValues(StringConverter.java:84)
	at org.joda.time.LocalTime.<init>(LocalTime.java:435)
	at org.joda.time.LocalTime.<init>(LocalTime.java:383)
	at org.joda.time.TestLocalTime_Constructors.testConstructor_ObjectStringEx5(TestLocalTime_Constructors.java:448)

testConstructor_ObjectStringEx6(org.joda.time.TestLocalTime_Constructors)  Time elapsed: 0 sec  <<< ERROR!
java.lang.NullPointerException
	at org.joda.time.convert.StringConverter.getPartialValues(StringConverter.java:84)
	at org.joda.time.LocalTime.<init>(LocalTime.java:435)
	at org.joda.time.LocalTime.<init>(LocalTime.java:383)
	at org.joda.time.TestLocalTime_Constructors.testConstructor_ObjectStringEx6(TestLocalTime_Constructors.java:455)

testConstructor_Object2_Chronology(org.joda.time.TestLocalTime_Constructors)  Time elapsed: 0 sec  <<< ERROR!
java.lang.NullPointerException
	at org.joda.time.convert.StringConverter.getPartialValues(StringConverter.java:84)
	at org.joda.time.LocalTime.<init>(LocalTime.java:435)
	at org.joda.time.LocalTime.<init>(LocalTime.java:383)
	at org.joda.time.TestLocalTime_Constructors.testConstructor_Object2_Chronology(TestLocalTime_Constructors.java:570)

testConstructor_ObjectString1Tokyo(org.joda.time.TestLocalTime_Constructors)  Time elapsed: 0 sec  <<< ERROR!
java.lang.NullPointerException
	at org.joda.time.convert.StringConverter.getPartialValues(StringConverter.java:84)
	at org.joda.time.LocalTime.<init>(LocalTime.java:435)
	at org.joda.time.LocalTime.<init>(LocalTime.java:383)
	at org.joda.time.TestLocalTime_Constructors.testConstructor_ObjectString1Tokyo(TestLocalTime_Constructors.java:373)

testConstructor_ObjectString1NewYork(org.joda.time.TestLocalTime_Constructors)  Time elapsed: 0.001 sec  <<< ERROR!
java.lang.NullPointerException
	at org.joda.time.convert.StringConverter.getPartialValues(StringConverter.java:84)
	at org.joda.time.LocalTime.<init>(LocalTime.java:435)
	at org.joda.time.LocalTime.<init>(LocalTime.java:383)
	at org.joda.time.TestLocalTime_Constructors.testConstructor_ObjectString1NewYork(TestLocalTime_Constructors.java:383)

testConstructor_ObjectString_DateTimeZoneLondon(org.joda.time.TestLocalTime_Constructors)  Time elapsed: 0.001 sec  <<< ERROR!
java.lang.NullPointerException
	at org.joda.time.convert.StringConverter.getPartialValues(StringConverter.java:84)
	at org.joda.time.LocalTime.<init>(LocalTime.java:409)
	at org.joda.time.TestLocalTime_Constructors.testConstructor_ObjectString_DateTimeZoneLondon(TestLocalTime_Constructors.java:511)

testConstructor_ObjectString_DateTimeZoneTokyo(org.joda.time.TestLocalTime_Constructors)  Time elapsed: 0.001 sec  <<< ERROR!
java.lang.NullPointerException
	at org.joda.time.convert.StringConverter.getPartialValues(StringConverter.java:84)
	at org.joda.time.LocalTime.<init>(LocalTime.java:409)
	at org.joda.time.TestLocalTime_Constructors.testConstructor_ObjectString_DateTimeZoneTokyo(TestLocalTime_Constructors.java:517)

testConstructor_ObjectString_DateTimeZoneNewYork(org.joda.time.TestLocalTime_Constructors)  Time elapsed: 0.001 sec  <<< ERROR!
java.lang.NullPointerException
	at org.joda.time.convert.StringConverter.getPartialValues(StringConverter.java:84)
	at org.joda.time.LocalTime.<init>(LocalTime.java:409)
	at org.joda.time.TestLocalTime_Constructors.testConstructor_ObjectString_DateTimeZoneNewYork(TestLocalTime_Constructors.java:524)

testLocalTime(org.joda.time.TestStringConvert)  Time elapsed: 0.001 sec  <<< ERROR!
java.lang.NullPointerException
	at org.joda.time.LocalTime.parse(LocalTime.java:175)
	at org.joda.time.LocalTime.parse(LocalTime.java:164)
	at sun.reflect.NativeMethodAccessorImpl.invoke0(Native Method)
	at sun.reflect.NativeMethodAccessorImpl.invoke(NativeMethodAccessorImpl.java:57)
	at sun.reflect.DelegatingMethodAccessorImpl.invoke(DelegatingMethodAccessorImpl.java:43)
	at java.lang.reflect.Method.invoke(Method.java:606)
	at org.joda.convert.MethodsStringConverter.convertFromString(MethodsStringConverter.java:70)
	at org.joda.convert.StringConvert.convertFromString(StringConvert.java:163)
	at org.joda.time.TestStringConvert.testLocalTime(TestStringConvert.java:92)

test_localTimeParser(org.joda.time.format.TestISODateTimeFormatParsing)  Time elapsed: 0.001 sec  <<< ERROR!
java.lang.NullPointerException
	at org.joda.time.format.TestISODateTimeFormatParsing.test_localTimeParser(TestISODateTimeFormatParsing.java:199)


Results :

Tests in error: 
  org.joda.time.TestLocalTime_Constructors#testConstructor_Object2_Chronology NullPointerException
  org.joda.time.TestLocalTime_Constructors#testConstructor_ObjectString1 NullPointerException
  org.joda.time.TestLocalTime_Constructors#testConstructor_ObjectString1NewYork NullPointerException
  org.joda.time.TestLocalTime_Constructors#testConstructor_ObjectString1Tokyo NullPointerException
  org.joda.time.TestLocalTime_Constructors#testConstructor_ObjectString2 NullPointerException
  org.joda.time.TestLocalTime_Constructors#testConstructor_ObjectString3 NullPointerException
  org.joda.time.TestLocalTime_Constructors#testConstructor_ObjectString4 NullPointerException
  org.joda.time.TestLocalTime_Constructors#testConstructor_ObjectStringEx1 NullPointerException
  org.joda.time.TestLocalTime_Constructors#testConstructor_ObjectStringEx2 NullPointerException
  org.joda.time.TestLocalTime_Constructors#testConstructor_ObjectStringEx3 NullPointerException
  org.joda.time.TestLocalTime_Constructors#testConstructor_ObjectStringEx4 NullPointerException
  org.joda.time.TestLocalTime_Constructors#testConstructor_ObjectStringEx5 NullPointerException
  org.joda.time.TestLocalTime_Constructors#testConstructor_ObjectStringEx6 NullPointerException
  org.joda.time.TestLocalTime_Constructors#testConstructor_ObjectString_DateTimeZoneLondon NullPointerException
  org.joda.time.TestLocalTime_Constructors#testConstructor_ObjectString_DateTimeZoneNewYork NullPointerException
  org.joda.time.TestLocalTime_Constructors#testConstructor_ObjectString_DateTimeZoneTokyo NullPointerException
  org.joda.time.TestLocalTime_Constructors#testParse_noFormatter NullPointerException
  org.joda.time.TestStringConvert#testLocalTime NullPointerException
  org.joda.time.format.TestISODateTimeFormatParsing#test_localTimeParser NullPointerException

Tests run: 4157, Failures: 0, Errors: 19, Skipped: 0

[INFO] ------------------------------------------------------------------------
[INFO] BUILD FAILURE
[INFO] ------------------------------------------------------------------------
[INFO] Total time: 15.754s
[INFO] Finished at: Thu Aug 06 09:41:41 BST 2015
[INFO] Final Memory: 9M/213M
[INFO] ------------------------------------------------------------------------
[ERROR] Failed to execute goal org.apache.maven.plugins:maven-surefire-plugin:2.18.1:test (default-test) on project joda-time: There are test failures.
[ERROR] 
[ERROR] Please refer to /home/perham/Study/LittleDarwin/Cases/joda-time-2.8.1/target/surefire-reports for the individual test results.
[ERROR] -> [Help 1]
[ERROR] 
[ERROR] To see the full stack trace of the errors, re-run Maven with the -e switch.
[ERROR] Re-run Maven using the -X switch to enable full debug logging.
[ERROR] 
[ERROR] For more information about the errors and possible solutions, please read the following articles:
[ERROR] [Help 1] http://cwiki.apache.org/confluence/display/MAVEN/MojoFailureException
