[INFO] Scanning for projects...
[INFO]                                                                         
[INFO] ------------------------------------------------------------------------
[INFO] Building Joda-Time 2.8.1
[INFO] ------------------------------------------------------------------------
[INFO] 
[INFO] --- maven-resources-plugin:2.7:resources (default-resources) @ joda-time ---
[INFO] Using 'UTF-8' encoding to copy filtered resources.
[INFO] Copying 2 resources to META-INF
[INFO] Copying 10 resources
[INFO] 
[INFO] --- maven-compiler-plugin:3.3:compile (default-compile) @ joda-time ---
[INFO] Changes detected - recompiling the module!
[INFO] Compiling 166 source files to /home/perham/Study/LittleDarwin/Cases/joda-time-2.8.1/target/classes
[INFO] 
[INFO] --- exec-maven-plugin:1.4.0:java (compile-tzdb) @ joda-time ---
Writing zoneinfo files
Writing ZoneInfoMap
[INFO] 
[INFO] --- maven-resources-plugin:2.7:testResources (default-testResources) @ joda-time ---
[INFO] Using 'UTF-8' encoding to copy filtered resources.
[INFO] Copying 34 resources
[INFO] 
[INFO] --- maven-compiler-plugin:3.3:testCompile (default-testCompile) @ joda-time ---
[INFO] Nothing to compile - all classes are up to date
[INFO] 
[INFO] --- maven-surefire-plugin:2.18.1:test (default-test) @ joda-time ---
[INFO] Surefire report directory: /home/perham/Study/LittleDarwin/Cases/joda-time-2.8.1/target/surefire-reports

-------------------------------------------------------
 T E S T S
-------------------------------------------------------
Running org.joda.time.TestAllPackages

TestBuddhistChronology.testCalendar

TestCopticChronology.testCalendar

TestEthiopicChronology.testCalendar

TestIslamicChronology.testCalendar

Testing Gregorian chronology over 1000 iterations
100% complete (i=1000)

Testing Julian chronology over 1000 iterations
100% complete (i=1000)
Writing zoneinfo files
Writing ZoneInfoMap
Tests run: 4157, Failures: 3, Errors: 107, Skipped: 0, Time elapsed: 5.535 sec <<< FAILURE! - in org.joda.time.TestAllPackages
testConstructor_ObjectStringEx1(org.joda.time.TestDateTime_Constructors)  Time elapsed: 0.005 sec  <<< ERROR!
java.lang.StringIndexOutOfBoundsException: String index out of range: 34
	at java.lang.String.substring(String.java:1907)
	at org.joda.time.format.FormatUtils.createErrorMessage(FormatUtils.java:128)
	at org.joda.time.format.DateTimeParserBucket.doParseMillis(DateTimeParserBucket.java:187)
	at org.joda.time.format.DateTimeFormatter.parseMillis(DateTimeFormatter.java:780)
	at org.joda.time.convert.StringConverter.getInstantMillis(StringConverter.java:65)
	at org.joda.time.base.BaseDateTime.<init>(BaseDateTime.java:175)
	at org.joda.time.DateTime.<init>(DateTime.java:257)
	at org.joda.time.TestDateTime_Constructors.testConstructor_ObjectStringEx1(TestDateTime_Constructors.java:460)

testConstructor_ObjectStringEx2(org.joda.time.TestDateTime_Constructors)  Time elapsed: 0.001 sec  <<< ERROR!
java.lang.StringIndexOutOfBoundsException: String index out of range: 34
	at java.lang.String.substring(String.java:1907)
	at org.joda.time.format.FormatUtils.createErrorMessage(FormatUtils.java:128)
	at org.joda.time.format.DateTimeParserBucket.doParseMillis(DateTimeParserBucket.java:187)
	at org.joda.time.format.DateTimeFormatter.parseMillis(DateTimeFormatter.java:780)
	at org.joda.time.convert.StringConverter.getInstantMillis(StringConverter.java:65)
	at org.joda.time.base.BaseDateTime.<init>(BaseDateTime.java:175)
	at org.joda.time.DateTime.<init>(DateTime.java:257)
	at org.joda.time.TestDateTime_Constructors.testConstructor_ObjectStringEx2(TestDateTime_Constructors.java:469)

testConstructor_ObjectStringEx1(org.joda.time.TestLocalDateTime_Constructors)  Time elapsed: 0 sec  <<< ERROR!
java.lang.StringIndexOutOfBoundsException: String index out of range: 42
	at java.lang.String.substring(String.java:1907)
	at org.joda.time.format.FormatUtils.createErrorMessage(FormatUtils.java:128)
	at org.joda.time.format.DateTimeParserBucket.doParseMillis(DateTimeParserBucket.java:187)
	at org.joda.time.format.DateTimeFormatter.parseMillis(DateTimeFormatter.java:780)
	at org.joda.time.convert.StringConverter.getPartialValues(StringConverter.java:87)
	at org.joda.time.LocalDateTime.<init>(LocalDateTime.java:414)
	at org.joda.time.LocalDateTime.<init>(LocalDateTime.java:358)
	at org.joda.time.TestLocalDateTime_Constructors.testConstructor_ObjectStringEx1(TestLocalDateTime_Constructors.java:429)

testConstructor_ObjectStringEx2(org.joda.time.TestLocalDateTime_Constructors)  Time elapsed: 0.001 sec  <<< ERROR!
java.lang.StringIndexOutOfBoundsException: String index out of range: 55
	at java.lang.String.substring(String.java:1907)
	at org.joda.time.format.FormatUtils.createErrorMessage(FormatUtils.java:128)
	at org.joda.time.format.DateTimeParserBucket.doParseMillis(DateTimeParserBucket.java:187)
	at org.joda.time.format.DateTimeFormatter.parseMillis(DateTimeFormatter.java:780)
	at org.joda.time.convert.StringConverter.getPartialValues(StringConverter.java:87)
	at org.joda.time.LocalDateTime.<init>(LocalDateTime.java:414)
	at org.joda.time.LocalDateTime.<init>(LocalDateTime.java:358)
	at org.joda.time.TestLocalDateTime_Constructors.testConstructor_ObjectStringEx2(TestLocalDateTime_Constructors.java:436)

testConstructor_ObjectStringEx3(org.joda.time.TestLocalDateTime_Constructors)  Time elapsed: 0.001 sec  <<< ERROR!
java.lang.StringIndexOutOfBoundsException: String index out of range: 32
	at java.lang.String.substring(String.java:1907)
	at org.joda.time.format.FormatUtils.createErrorMessage(FormatUtils.java:128)
	at org.joda.time.format.DateTimeParserBucket.doParseMillis(DateTimeParserBucket.java:187)
	at org.joda.time.format.DateTimeFormatter.parseMillis(DateTimeFormatter.java:780)
	at org.joda.time.convert.StringConverter.getPartialValues(StringConverter.java:87)
	at org.joda.time.LocalDateTime.<init>(LocalDateTime.java:414)
	at org.joda.time.LocalDateTime.<init>(LocalDateTime.java:358)
	at org.joda.time.TestLocalDateTime_Constructors.testConstructor_ObjectStringEx3(TestLocalDateTime_Constructors.java:443)

testConstructor_ObjectStringEx4(org.joda.time.TestLocalDateTime_Constructors)  Time elapsed: 0.001 sec  <<< ERROR!
java.lang.StringIndexOutOfBoundsException: String index out of range: 32
	at java.lang.String.substring(String.java:1907)
	at org.joda.time.format.FormatUtils.createErrorMessage(FormatUtils.java:128)
	at org.joda.time.format.DateTimeParserBucket.doParseMillis(DateTimeParserBucket.java:187)
	at org.joda.time.format.DateTimeFormatter.parseMillis(DateTimeFormatter.java:780)
	at org.joda.time.convert.StringConverter.getPartialValues(StringConverter.java:87)
	at org.joda.time.LocalDateTime.<init>(LocalDateTime.java:414)
	at org.joda.time.LocalDateTime.<init>(LocalDateTime.java:358)
	at org.joda.time.TestLocalDateTime_Constructors.testConstructor_ObjectStringEx4(TestLocalDateTime_Constructors.java:450)

testConstructor_ObjectStringEx5(org.joda.time.TestLocalDateTime_Constructors)  Time elapsed: 0 sec  <<< ERROR!
java.lang.StringIndexOutOfBoundsException: String index out of range: 34
	at java.lang.String.substring(String.java:1907)
	at org.joda.time.format.FormatUtils.createErrorMessage(FormatUtils.java:128)
	at org.joda.time.format.DateTimeParserBucket.doParseMillis(DateTimeParserBucket.java:187)
	at org.joda.time.format.DateTimeFormatter.parseMillis(DateTimeFormatter.java:780)
	at org.joda.time.convert.StringConverter.getPartialValues(StringConverter.java:87)
	at org.joda.time.LocalDateTime.<init>(LocalDateTime.java:414)
	at org.joda.time.LocalDateTime.<init>(LocalDateTime.java:358)
	at org.joda.time.TestLocalDateTime_Constructors.testConstructor_ObjectStringEx5(TestLocalDateTime_Constructors.java:457)

testConstructor_ObjectStringEx6(org.joda.time.TestLocalDateTime_Constructors)  Time elapsed: 0.001 sec  <<< ERROR!
java.lang.StringIndexOutOfBoundsException: String index out of range: 34
	at java.lang.String.substring(String.java:1907)
	at org.joda.time.format.FormatUtils.createErrorMessage(FormatUtils.java:128)
	at org.joda.time.format.DateTimeParserBucket.doParseMillis(DateTimeParserBucket.java:187)
	at org.joda.time.format.DateTimeFormatter.parseMillis(DateTimeFormatter.java:780)
	at org.joda.time.convert.StringConverter.getPartialValues(StringConverter.java:87)
	at org.joda.time.LocalDateTime.<init>(LocalDateTime.java:414)
	at org.joda.time.LocalDateTime.<init>(LocalDateTime.java:358)
	at org.joda.time.TestLocalDateTime_Constructors.testConstructor_ObjectStringEx6(TestLocalDateTime_Constructors.java:464)

testConstructor_ObjectStringEx1(org.joda.time.TestLocalDate_Constructors)  Time elapsed: 0.001 sec  <<< ERROR!
java.lang.StringIndexOutOfBoundsException: String index out of range: 42
	at java.lang.String.substring(String.java:1907)
	at org.joda.time.format.FormatUtils.createErrorMessage(FormatUtils.java:128)
	at org.joda.time.format.DateTimeParserBucket.doParseMillis(DateTimeParserBucket.java:187)
	at org.joda.time.format.DateTimeFormatter.parseMillis(DateTimeFormatter.java:780)
	at org.joda.time.convert.StringConverter.getPartialValues(StringConverter.java:87)
	at org.joda.time.LocalDate.<init>(LocalDate.java:419)
	at org.joda.time.LocalDate.<init>(LocalDate.java:363)
	at org.joda.time.TestLocalDate_Constructors.testConstructor_ObjectStringEx1(TestLocalDate_Constructors.java:358)

testConstructor_ObjectStringEx2(org.joda.time.TestLocalDate_Constructors)  Time elapsed: 0.001 sec  <<< ERROR!
java.lang.StringIndexOutOfBoundsException: String index out of range: 42
	at java.lang.String.substring(String.java:1907)
	at org.joda.time.format.FormatUtils.createErrorMessage(FormatUtils.java:128)
	at org.joda.time.format.DateTimeParserBucket.doParseMillis(DateTimeParserBucket.java:187)
	at org.joda.time.format.DateTimeFormatter.parseMillis(DateTimeFormatter.java:780)
	at org.joda.time.convert.StringConverter.getPartialValues(StringConverter.java:87)
	at org.joda.time.LocalDate.<init>(LocalDate.java:419)
	at org.joda.time.LocalDate.<init>(LocalDate.java:363)
	at org.joda.time.TestLocalDate_Constructors.testConstructor_ObjectStringEx2(TestLocalDate_Constructors.java:365)

testConstructor_ObjectStringEx7(org.joda.time.TestLocalDate_Constructors)  Time elapsed: 0 sec  <<< ERROR!
java.lang.StringIndexOutOfBoundsException: String index out of range: 34
	at java.lang.String.substring(String.java:1907)
	at org.joda.time.format.FormatUtils.createErrorMessage(FormatUtils.java:128)
	at org.joda.time.format.DateTimeParserBucket.doParseMillis(DateTimeParserBucket.java:187)
	at org.joda.time.format.DateTimeFormatter.parseMillis(DateTimeFormatter.java:780)
	at org.joda.time.convert.StringConverter.getPartialValues(StringConverter.java:87)
	at org.joda.time.LocalDate.<init>(LocalDate.java:419)
	at org.joda.time.LocalDate.<init>(LocalDate.java:363)
	at org.joda.time.TestLocalDate_Constructors.testConstructor_ObjectStringEx7(TestLocalDate_Constructors.java:400)

testConstructor_ObjectStringEx3(org.joda.time.TestLocalDate_Constructors)  Time elapsed: 0.001 sec  <<< ERROR!
java.lang.StringIndexOutOfBoundsException: String index out of range: 42
	at java.lang.String.substring(String.java:1907)
	at org.joda.time.format.FormatUtils.createErrorMessage(FormatUtils.java:128)
	at org.joda.time.format.DateTimeParserBucket.doParseMillis(DateTimeParserBucket.java:187)
	at org.joda.time.format.DateTimeFormatter.parseMillis(DateTimeFormatter.java:780)
	at org.joda.time.convert.StringConverter.getPartialValues(StringConverter.java:87)
	at org.joda.time.LocalDate.<init>(LocalDate.java:419)
	at org.joda.time.LocalDate.<init>(LocalDate.java:363)
	at org.joda.time.TestLocalDate_Constructors.testConstructor_ObjectStringEx3(TestLocalDate_Constructors.java:372)

testConstructor_ObjectStringEx4(org.joda.time.TestLocalDate_Constructors)  Time elapsed: 0 sec  <<< ERROR!
java.lang.StringIndexOutOfBoundsException: String index out of range: 32
	at java.lang.String.substring(String.java:1907)
	at org.joda.time.format.FormatUtils.createErrorMessage(FormatUtils.java:128)
	at org.joda.time.format.DateTimeParserBucket.doParseMillis(DateTimeParserBucket.java:187)
	at org.joda.time.format.DateTimeFormatter.parseMillis(DateTimeFormatter.java:780)
	at org.joda.time.convert.StringConverter.getPartialValues(StringConverter.java:87)
	at org.joda.time.LocalDate.<init>(LocalDate.java:419)
	at org.joda.time.LocalDate.<init>(LocalDate.java:363)
	at org.joda.time.TestLocalDate_Constructors.testConstructor_ObjectStringEx4(TestLocalDate_Constructors.java:379)

testConstructor_ObjectStringEx5(org.joda.time.TestLocalDate_Constructors)  Time elapsed: 0.001 sec  <<< ERROR!
java.lang.StringIndexOutOfBoundsException: String index out of range: 32
	at java.lang.String.substring(String.java:1907)
	at org.joda.time.format.FormatUtils.createErrorMessage(FormatUtils.java:128)
	at org.joda.time.format.DateTimeParserBucket.doParseMillis(DateTimeParserBucket.java:187)
	at org.joda.time.format.DateTimeFormatter.parseMillis(DateTimeFormatter.java:780)
	at org.joda.time.convert.StringConverter.getPartialValues(StringConverter.java:87)
	at org.joda.time.LocalDate.<init>(LocalDate.java:419)
	at org.joda.time.LocalDate.<init>(LocalDate.java:363)
	at org.joda.time.TestLocalDate_Constructors.testConstructor_ObjectStringEx5(TestLocalDate_Constructors.java:386)

testConstructor_ObjectStringEx6(org.joda.time.TestLocalDate_Constructors)  Time elapsed: 0.001 sec  <<< ERROR!
java.lang.StringIndexOutOfBoundsException: String index out of range: 34
	at java.lang.String.substring(String.java:1907)
	at org.joda.time.format.FormatUtils.createErrorMessage(FormatUtils.java:128)
	at org.joda.time.format.DateTimeParserBucket.doParseMillis(DateTimeParserBucket.java:187)
	at org.joda.time.format.DateTimeFormatter.parseMillis(DateTimeFormatter.java:780)
	at org.joda.time.convert.StringConverter.getPartialValues(StringConverter.java:87)
	at org.joda.time.LocalDate.<init>(LocalDate.java:419)
	at org.joda.time.LocalDate.<init>(LocalDate.java:363)
	at org.joda.time.TestLocalDate_Constructors.testConstructor_ObjectStringEx6(TestLocalDate_Constructors.java:393)

testConstructor_ObjectStringEx1(org.joda.time.TestLocalTime_Constructors)  Time elapsed: 0.001 sec  <<< ERROR!
java.lang.StringIndexOutOfBoundsException: String index out of range: 34
	at java.lang.String.substring(String.java:1907)
	at org.joda.time.format.FormatUtils.createErrorMessage(FormatUtils.java:128)
	at org.joda.time.format.DateTimeParserBucket.doParseMillis(DateTimeParserBucket.java:187)
	at org.joda.time.format.DateTimeFormatter.parseMillis(DateTimeFormatter.java:780)
	at org.joda.time.convert.StringConverter.getPartialValues(StringConverter.java:87)
	at org.joda.time.LocalTime.<init>(LocalTime.java:435)
	at org.joda.time.LocalTime.<init>(LocalTime.java:383)
	at org.joda.time.TestLocalTime_Constructors.testConstructor_ObjectStringEx1(TestLocalTime_Constructors.java:420)

testConstructor_ObjectStringEx2(org.joda.time.TestLocalTime_Constructors)  Time elapsed: 0 sec  <<< ERROR!
java.lang.StringIndexOutOfBoundsException: String index out of range: 34
	at java.lang.String.substring(String.java:1907)
	at org.joda.time.format.FormatUtils.createErrorMessage(FormatUtils.java:128)
	at org.joda.time.format.DateTimeParserBucket.doParseMillis(DateTimeParserBucket.java:187)
	at org.joda.time.format.DateTimeFormatter.parseMillis(DateTimeFormatter.java:780)
	at org.joda.time.convert.StringConverter.getPartialValues(StringConverter.java:87)
	at org.joda.time.LocalTime.<init>(LocalTime.java:435)
	at org.joda.time.LocalTime.<init>(LocalTime.java:383)
	at org.joda.time.TestLocalTime_Constructors.testConstructor_ObjectStringEx2(TestLocalTime_Constructors.java:427)

testConstructor_Object2_Chronology(org.joda.time.TestLocalTime_Constructors)  Time elapsed: 0 sec  <<< ERROR!
java.lang.StringIndexOutOfBoundsException: String index out of range: 35
	at java.lang.String.substring(String.java:1907)
	at org.joda.time.format.FormatUtils.createErrorMessage(FormatUtils.java:128)
	at org.joda.time.format.DateTimeParserBucket.doParseMillis(DateTimeParserBucket.java:187)
	at org.joda.time.format.DateTimeFormatter.parseMillis(DateTimeFormatter.java:780)
	at org.joda.time.convert.StringConverter.getPartialValues(StringConverter.java:87)
	at org.joda.time.LocalTime.<init>(LocalTime.java:435)
	at org.joda.time.LocalTime.<init>(LocalTime.java:383)
	at org.joda.time.TestLocalTime_Constructors.testConstructor_Object2_Chronology(TestLocalTime_Constructors.java:577)

testConstructor_ObjectStringEx3(org.joda.time.TestLocalTime_Constructors)  Time elapsed: 0 sec  <<< ERROR!
java.lang.StringIndexOutOfBoundsException: String index out of range: 34
	at java.lang.String.substring(String.java:1907)
	at org.joda.time.format.FormatUtils.createErrorMessage(FormatUtils.java:128)
	at org.joda.time.format.DateTimeParserBucket.doParseMillis(DateTimeParserBucket.java:187)
	at org.joda.time.format.DateTimeFormatter.parseMillis(DateTimeFormatter.java:780)
	at org.joda.time.convert.StringConverter.getPartialValues(StringConverter.java:87)
	at org.joda.time.LocalTime.<init>(LocalTime.java:435)
	at org.joda.time.LocalTime.<init>(LocalTime.java:383)
	at org.joda.time.TestLocalTime_Constructors.testConstructor_ObjectStringEx3(TestLocalTime_Constructors.java:434)

testConstructor_ObjectStringEx4(org.joda.time.TestLocalTime_Constructors)  Time elapsed: 0.001 sec  <<< ERROR!
java.lang.StringIndexOutOfBoundsException: String index out of range: 34
	at java.lang.String.substring(String.java:1907)
	at org.joda.time.format.FormatUtils.createErrorMessage(FormatUtils.java:128)
	at org.joda.time.format.DateTimeParserBucket.doParseMillis(DateTimeParserBucket.java:187)
	at org.joda.time.format.DateTimeFormatter.parseMillis(DateTimeFormatter.java:780)
	at org.joda.time.convert.StringConverter.getPartialValues(StringConverter.java:87)
	at org.joda.time.LocalTime.<init>(LocalTime.java:435)
	at org.joda.time.LocalTime.<init>(LocalTime.java:383)
	at org.joda.time.TestLocalTime_Constructors.testConstructor_ObjectStringEx4(TestLocalTime_Constructors.java:441)

testConstructor_ObjectStringEx5(org.joda.time.TestLocalTime_Constructors)  Time elapsed: 0 sec  <<< ERROR!
java.lang.StringIndexOutOfBoundsException: String index out of range: 45
	at java.lang.String.substring(String.java:1907)
	at org.joda.time.format.FormatUtils.createErrorMessage(FormatUtils.java:128)
	at org.joda.time.format.DateTimeParserBucket.doParseMillis(DateTimeParserBucket.java:187)
	at org.joda.time.format.DateTimeFormatter.parseMillis(DateTimeFormatter.java:780)
	at org.joda.time.convert.StringConverter.getPartialValues(StringConverter.java:87)
	at org.joda.time.LocalTime.<init>(LocalTime.java:435)
	at org.joda.time.LocalTime.<init>(LocalTime.java:383)
	at org.joda.time.TestLocalTime_Constructors.testConstructor_ObjectStringEx5(TestLocalTime_Constructors.java:448)

testConstructor_ObjectStringEx6(org.joda.time.TestLocalTime_Constructors)  Time elapsed: 0.001 sec  <<< ERROR!
java.lang.StringIndexOutOfBoundsException: String index out of range: 44
	at java.lang.String.substring(String.java:1907)
	at org.joda.time.format.FormatUtils.createErrorMessage(FormatUtils.java:128)
	at org.joda.time.format.DateTimeParserBucket.doParseMillis(DateTimeParserBucket.java:187)
	at org.joda.time.format.DateTimeFormatter.parseMillis(DateTimeFormatter.java:780)
	at org.joda.time.convert.StringConverter.getPartialValues(StringConverter.java:87)
	at org.joda.time.LocalTime.<init>(LocalTime.java:435)
	at org.joda.time.LocalTime.<init>(LocalTime.java:383)
	at org.joda.time.TestLocalTime_Constructors.testConstructor_ObjectStringEx6(TestLocalTime_Constructors.java:455)

testConstructor_ObjectStringEx1(org.joda.time.TestTimeOfDay_Constructors)  Time elapsed: 0 sec  <<< ERROR!
java.lang.StringIndexOutOfBoundsException: String index out of range: 34
	at java.lang.String.substring(String.java:1907)
	at org.joda.time.format.FormatUtils.createErrorMessage(FormatUtils.java:128)
	at org.joda.time.format.DateTimeParserBucket.doParseMillis(DateTimeParserBucket.java:187)
	at org.joda.time.format.DateTimeFormatter.parseMillis(DateTimeFormatter.java:780)
	at org.joda.time.convert.StringConverter.getPartialValues(StringConverter.java:87)
	at org.joda.time.base.BasePartial.<init>(BasePartial.java:163)
	at org.joda.time.TimeOfDay.<init>(TimeOfDay.java:277)
	at org.joda.time.TestTimeOfDay_Constructors.testConstructor_ObjectStringEx1(TestTimeOfDay_Constructors.java:420)

testConstructor_ObjectStringEx2(org.joda.time.TestTimeOfDay_Constructors)  Time elapsed: 0.001 sec  <<< ERROR!
java.lang.StringIndexOutOfBoundsException: String index out of range: 34
	at java.lang.String.substring(String.java:1907)
	at org.joda.time.format.FormatUtils.createErrorMessage(FormatUtils.java:128)
	at org.joda.time.format.DateTimeParserBucket.doParseMillis(DateTimeParserBucket.java:187)
	at org.joda.time.format.DateTimeFormatter.parseMillis(DateTimeFormatter.java:780)
	at org.joda.time.convert.StringConverter.getPartialValues(StringConverter.java:87)
	at org.joda.time.base.BasePartial.<init>(BasePartial.java:163)
	at org.joda.time.TimeOfDay.<init>(TimeOfDay.java:277)
	at org.joda.time.TestTimeOfDay_Constructors.testConstructor_ObjectStringEx2(TestTimeOfDay_Constructors.java:427)

testConstructor2_Object_Chronology(org.joda.time.TestTimeOfDay_Constructors)  Time elapsed: 0 sec  <<< ERROR!
java.lang.StringIndexOutOfBoundsException: String index out of range: 35
	at java.lang.String.substring(String.java:1907)
	at org.joda.time.format.FormatUtils.createErrorMessage(FormatUtils.java:128)
	at org.joda.time.format.DateTimeParserBucket.doParseMillis(DateTimeParserBucket.java:187)
	at org.joda.time.format.DateTimeFormatter.parseMillis(DateTimeFormatter.java:780)
	at org.joda.time.convert.StringConverter.getPartialValues(StringConverter.java:87)
	at org.joda.time.base.BasePartial.<init>(BasePartial.java:163)
	at org.joda.time.TimeOfDay.<init>(TimeOfDay.java:277)
	at org.joda.time.TestTimeOfDay_Constructors.testConstructor2_Object_Chronology(TestTimeOfDay_Constructors.java:471)

testConstructor_ObjectStringEx3(org.joda.time.TestTimeOfDay_Constructors)  Time elapsed: 0 sec  <<< ERROR!
java.lang.StringIndexOutOfBoundsException: String index out of range: 34
	at java.lang.String.substring(String.java:1907)
	at org.joda.time.format.FormatUtils.createErrorMessage(FormatUtils.java:128)
	at org.joda.time.format.DateTimeParserBucket.doParseMillis(DateTimeParserBucket.java:187)
	at org.joda.time.format.DateTimeFormatter.parseMillis(DateTimeFormatter.java:780)
	at org.joda.time.convert.StringConverter.getPartialValues(StringConverter.java:87)
	at org.joda.time.base.BasePartial.<init>(BasePartial.java:163)
	at org.joda.time.TimeOfDay.<init>(TimeOfDay.java:277)
	at org.joda.time.TestTimeOfDay_Constructors.testConstructor_ObjectStringEx3(TestTimeOfDay_Constructors.java:434)

testConstructor_ObjectStringEx4(org.joda.time.TestTimeOfDay_Constructors)  Time elapsed: 0.001 sec  <<< ERROR!
java.lang.StringIndexOutOfBoundsException: String index out of range: 34
	at java.lang.String.substring(String.java:1907)
	at org.joda.time.format.FormatUtils.createErrorMessage(FormatUtils.java:128)
	at org.joda.time.format.DateTimeParserBucket.doParseMillis(DateTimeParserBucket.java:187)
	at org.joda.time.format.DateTimeFormatter.parseMillis(DateTimeFormatter.java:780)
	at org.joda.time.convert.StringConverter.getPartialValues(StringConverter.java:87)
	at org.joda.time.base.BasePartial.<init>(BasePartial.java:163)
	at org.joda.time.TimeOfDay.<init>(TimeOfDay.java:277)
	at org.joda.time.TestTimeOfDay_Constructors.testConstructor_ObjectStringEx4(TestTimeOfDay_Constructors.java:441)

testConstructor_ObjectStringEx1(org.joda.time.TestYearMonthDay_Constructors)  Time elapsed: 0 sec  <<< ERROR!
java.lang.StringIndexOutOfBoundsException: String index out of range: 32
	at java.lang.String.substring(String.java:1907)
	at org.joda.time.format.FormatUtils.createErrorMessage(FormatUtils.java:128)
	at org.joda.time.format.DateTimeParserBucket.doParseMillis(DateTimeParserBucket.java:187)
	at org.joda.time.format.DateTimeFormatter.parseMillis(DateTimeFormatter.java:780)
	at org.joda.time.convert.StringConverter.getPartialValues(StringConverter.java:87)
	at org.joda.time.base.BasePartial.<init>(BasePartial.java:163)
	at org.joda.time.YearMonthDay.<init>(YearMonthDay.java:231)
	at org.joda.time.TestYearMonthDay_Constructors.testConstructor_ObjectStringEx1(TestYearMonthDay_Constructors.java:291)

testConstructor_ObjectStringEx2(org.joda.time.TestYearMonthDay_Constructors)  Time elapsed: 0 sec  <<< ERROR!
java.lang.StringIndexOutOfBoundsException: String index out of range: 32
	at java.lang.String.substring(String.java:1907)
	at org.joda.time.format.FormatUtils.createErrorMessage(FormatUtils.java:128)
	at org.joda.time.format.DateTimeParserBucket.doParseMillis(DateTimeParserBucket.java:187)
	at org.joda.time.format.DateTimeFormatter.parseMillis(DateTimeFormatter.java:780)
	at org.joda.time.convert.StringConverter.getPartialValues(StringConverter.java:87)
	at org.joda.time.base.BasePartial.<init>(BasePartial.java:163)
	at org.joda.time.YearMonthDay.<init>(YearMonthDay.java:231)
	at org.joda.time.TestYearMonthDay_Constructors.testConstructor_ObjectStringEx2(TestYearMonthDay_Constructors.java:300)

testConstructor_ObjectStringEx3(org.joda.time.TestYearMonthDay_Constructors)  Time elapsed: 0 sec  <<< ERROR!
java.lang.StringIndexOutOfBoundsException: String index out of range: 34
	at java.lang.String.substring(String.java:1907)
	at org.joda.time.format.FormatUtils.createErrorMessage(FormatUtils.java:128)
	at org.joda.time.format.DateTimeParserBucket.doParseMillis(DateTimeParserBucket.java:187)
	at org.joda.time.format.DateTimeFormatter.parseMillis(DateTimeFormatter.java:780)
	at org.joda.time.convert.StringConverter.getPartialValues(StringConverter.java:87)
	at org.joda.time.base.BasePartial.<init>(BasePartial.java:163)
	at org.joda.time.YearMonthDay.<init>(YearMonthDay.java:231)
	at org.joda.time.TestYearMonthDay_Constructors.testConstructor_ObjectStringEx3(TestYearMonthDay_Constructors.java:309)

testConstructor_ObjectStringEx4(org.joda.time.TestYearMonthDay_Constructors)  Time elapsed: 0 sec  <<< ERROR!
java.lang.StringIndexOutOfBoundsException: String index out of range: 34
	at java.lang.String.substring(String.java:1907)
	at org.joda.time.format.FormatUtils.createErrorMessage(FormatUtils.java:128)
	at org.joda.time.format.DateTimeParserBucket.doParseMillis(DateTimeParserBucket.java:187)
	at org.joda.time.format.DateTimeFormatter.parseMillis(DateTimeFormatter.java:780)
	at org.joda.time.convert.StringConverter.getPartialValues(StringConverter.java:87)
	at org.joda.time.base.BasePartial.<init>(BasePartial.java:163)
	at org.joda.time.YearMonthDay.<init>(YearMonthDay.java:231)
	at org.joda.time.TestYearMonthDay_Constructors.testConstructor_ObjectStringEx4(TestYearMonthDay_Constructors.java:318)

testConstructor_ObjectStringEx1(org.joda.time.TestYearMonth_Constructors)  Time elapsed: 0.001 sec  <<< ERROR!
java.lang.StringIndexOutOfBoundsException: String index out of range: 32
	at java.lang.String.substring(String.java:1907)
	at org.joda.time.format.FormatUtils.createErrorMessage(FormatUtils.java:128)
	at org.joda.time.format.DateTimeParserBucket.doParseMillis(DateTimeParserBucket.java:187)
	at org.joda.time.format.DateTimeFormatter.parseMillis(DateTimeFormatter.java:780)
	at org.joda.time.convert.StringConverter.getPartialValues(StringConverter.java:87)
	at org.joda.time.base.BasePartial.<init>(BasePartial.java:163)
	at org.joda.time.YearMonth.<init>(YearMonth.java:289)
	at org.joda.time.TestYearMonth_Constructors.testConstructor_ObjectStringEx1(TestYearMonth_Constructors.java:268)

testConstructor_ObjectStringEx2(org.joda.time.TestYearMonth_Constructors)  Time elapsed: 0 sec  <<< ERROR!
java.lang.StringIndexOutOfBoundsException: String index out of range: 32
	at java.lang.String.substring(String.java:1907)
	at org.joda.time.format.FormatUtils.createErrorMessage(FormatUtils.java:128)
	at org.joda.time.format.DateTimeParserBucket.doParseMillis(DateTimeParserBucket.java:187)
	at org.joda.time.format.DateTimeFormatter.parseMillis(DateTimeFormatter.java:780)
	at org.joda.time.convert.StringConverter.getPartialValues(StringConverter.java:87)
	at org.joda.time.base.BasePartial.<init>(BasePartial.java:163)
	at org.joda.time.YearMonth.<init>(YearMonth.java:289)
	at org.joda.time.TestYearMonth_Constructors.testConstructor_ObjectStringEx2(TestYearMonth_Constructors.java:277)

testConstructor_ObjectStringEx3(org.joda.time.TestYearMonth_Constructors)  Time elapsed: 0.001 sec  <<< ERROR!
java.lang.StringIndexOutOfBoundsException: String index out of range: 34
	at java.lang.String.substring(String.java:1907)
	at org.joda.time.format.FormatUtils.createErrorMessage(FormatUtils.java:128)
	at org.joda.time.format.DateTimeParserBucket.doParseMillis(DateTimeParserBucket.java:187)
	at org.joda.time.format.DateTimeFormatter.parseMillis(DateTimeFormatter.java:780)
	at org.joda.time.convert.StringConverter.getPartialValues(StringConverter.java:87)
	at org.joda.time.base.BasePartial.<init>(BasePartial.java:163)
	at org.joda.time.YearMonth.<init>(YearMonth.java:289)
	at org.joda.time.TestYearMonth_Constructors.testConstructor_ObjectStringEx3(TestYearMonth_Constructors.java:286)

testConstructor_ObjectStringEx4(org.joda.time.TestYearMonth_Constructors)  Time elapsed: 0 sec  <<< ERROR!
java.lang.StringIndexOutOfBoundsException: String index out of range: 34
	at java.lang.String.substring(String.java:1907)
	at org.joda.time.format.FormatUtils.createErrorMessage(FormatUtils.java:128)
	at org.joda.time.format.DateTimeParserBucket.doParseMillis(DateTimeParserBucket.java:187)
	at org.joda.time.format.DateTimeFormatter.parseMillis(DateTimeFormatter.java:780)
	at org.joda.time.convert.StringConverter.getPartialValues(StringConverter.java:87)
	at org.joda.time.base.BasePartial.<init>(BasePartial.java:163)
	at org.joda.time.YearMonth.<init>(YearMonth.java:289)
	at org.joda.time.TestYearMonth_Constructors.testConstructor_ObjectStringEx4(TestYearMonth_Constructors.java:295)

testConstructor_ObjectStringEx1(org.joda.time.TestMonthDay_Constructors)  Time elapsed: 0 sec  <<< ERROR!
java.lang.StringIndexOutOfBoundsException: String index out of range: 32
	at java.lang.String.substring(String.java:1907)
	at org.joda.time.format.FormatUtils.createErrorMessage(FormatUtils.java:128)
	at org.joda.time.format.DateTimeParserBucket.doParseMillis(DateTimeParserBucket.java:187)
	at org.joda.time.format.DateTimeFormatter.parseMillis(DateTimeFormatter.java:780)
	at org.joda.time.convert.StringConverter.getPartialValues(StringConverter.java:87)
	at org.joda.time.base.BasePartial.<init>(BasePartial.java:163)
	at org.joda.time.MonthDay.<init>(MonthDay.java:297)
	at org.joda.time.TestMonthDay_Constructors.testConstructor_ObjectStringEx1(TestMonthDay_Constructors.java:268)

testConstructor_ObjectStringEx2(org.joda.time.TestMonthDay_Constructors)  Time elapsed: 0.001 sec  <<< ERROR!
java.lang.StringIndexOutOfBoundsException: String index out of range: 32
	at java.lang.String.substring(String.java:1907)
	at org.joda.time.format.FormatUtils.createErrorMessage(FormatUtils.java:128)
	at org.joda.time.format.DateTimeParserBucket.doParseMillis(DateTimeParserBucket.java:187)
	at org.joda.time.format.DateTimeFormatter.parseMillis(DateTimeFormatter.java:780)
	at org.joda.time.convert.StringConverter.getPartialValues(StringConverter.java:87)
	at org.joda.time.base.BasePartial.<init>(BasePartial.java:163)
	at org.joda.time.MonthDay.<init>(MonthDay.java:297)
	at org.joda.time.TestMonthDay_Constructors.testConstructor_ObjectStringEx2(TestMonthDay_Constructors.java:277)

testConstructor_ObjectStringEx3(org.joda.time.TestMonthDay_Constructors)  Time elapsed: 0 sec  <<< ERROR!
java.lang.StringIndexOutOfBoundsException: String index out of range: 34
	at java.lang.String.substring(String.java:1907)
	at org.joda.time.format.FormatUtils.createErrorMessage(FormatUtils.java:128)
	at org.joda.time.format.DateTimeParserBucket.doParseMillis(DateTimeParserBucket.java:187)
	at org.joda.time.format.DateTimeFormatter.parseMillis(DateTimeFormatter.java:780)
	at org.joda.time.convert.StringConverter.getPartialValues(StringConverter.java:87)
	at org.joda.time.base.BasePartial.<init>(BasePartial.java:163)
	at org.joda.time.MonthDay.<init>(MonthDay.java:297)
	at org.joda.time.TestMonthDay_Constructors.testConstructor_ObjectStringEx3(TestMonthDay_Constructors.java:286)

testConstructor_ObjectStringEx4(org.joda.time.TestMonthDay_Constructors)  Time elapsed: 0 sec  <<< ERROR!
java.lang.StringIndexOutOfBoundsException: String index out of range: 34
	at java.lang.String.substring(String.java:1907)
	at org.joda.time.format.FormatUtils.createErrorMessage(FormatUtils.java:128)
	at org.joda.time.format.DateTimeParserBucket.doParseMillis(DateTimeParserBucket.java:187)
	at org.joda.time.format.DateTimeFormatter.parseMillis(DateTimeFormatter.java:780)
	at org.joda.time.convert.StringConverter.getPartialValues(StringConverter.java:87)
	at org.joda.time.base.BasePartial.<init>(BasePartial.java:163)
	at org.joda.time.MonthDay.<init>(MonthDay.java:297)
	at org.joda.time.TestMonthDay_Constructors.testConstructor_ObjectStringEx4(TestMonthDay_Constructors.java:295)

testInvalidObj(org.joda.time.TestDateTimeComparator)  Time elapsed: 0 sec  <<< ERROR!
java.lang.StringIndexOutOfBoundsException: String index out of range: 32
	at java.lang.String.substring(String.java:1907)
	at org.joda.time.format.FormatUtils.createErrorMessage(FormatUtils.java:128)
	at org.joda.time.format.DateTimeParserBucket.doParseMillis(DateTimeParserBucket.java:187)
	at org.joda.time.format.DateTimeFormatter.parseMillis(DateTimeFormatter.java:780)
	at org.joda.time.convert.StringConverter.getInstantMillis(StringConverter.java:65)
	at org.joda.time.DateTimeComparator.compare(DateTimeComparator.java:194)
	at org.joda.time.TestDateTimeComparator.testInvalidObj(TestDateTimeComparator.java:893)

testForID_String(org.joda.time.TestDateTimeZone)  Time elapsed: 0 sec  <<< ERROR!
java.lang.StringIndexOutOfBoundsException: String index out of range: 32
	at java.lang.String.substring(String.java:1907)
	at org.joda.time.format.FormatUtils.createErrorMessage(FormatUtils.java:128)
	at org.joda.time.format.DateTimeParserBucket.doParseMillis(DateTimeParserBucket.java:187)
	at org.joda.time.format.DateTimeFormatter.parseMillis(DateTimeFormatter.java:780)
	at org.joda.time.DateTimeZone.parseOffset(DateTimeZone.java:612)
	at org.joda.time.DateTimeZone.forID(DateTimeZone.java:221)
	at org.joda.time.TestDateTimeZone.testForID_String(TestDateTimeZone.java:235)

testGetInstantMillisInvalid(org.joda.time.convert.TestStringConverter)  Time elapsed: 0 sec  <<< ERROR!
java.lang.StringIndexOutOfBoundsException: String index out of range: 32
	at java.lang.String.substring(String.java:1907)
	at org.joda.time.format.FormatUtils.createErrorMessage(FormatUtils.java:128)
	at org.joda.time.format.DateTimeParserBucket.doParseMillis(DateTimeParserBucket.java:187)
	at org.joda.time.format.DateTimeFormatter.parseMillis(DateTimeFormatter.java:780)
	at org.joda.time.convert.StringConverter.getInstantMillis(StringConverter.java:65)
	at org.joda.time.convert.TestStringConverter.testGetInstantMillisInvalid(TestStringConverter.java:177)

testSetIntoPeriod_Object8(org.joda.time.convert.TestStringConverter)  Time elapsed: 0 sec  <<< ERROR!
java.lang.StringIndexOutOfBoundsException: String index out of range: 32
	at java.lang.String.substring(String.java:1907)
	at org.joda.time.format.FormatUtils.createErrorMessage(FormatUtils.java:128)
	at org.joda.time.format.PeriodFormatter.parseMutablePeriod(PeriodFormatter.java:330)
	at org.joda.time.convert.StringConverter.setInto(StringConverter.java:169)
	at org.joda.time.convert.TestStringConverter.testSetIntoPeriod_Object8(TestStringConverter.java:450)

testParseLocalDateTime_simple(org.joda.time.format.TestDateTimeFormatter)  Time elapsed: 0.002 sec  <<< ERROR!
java.lang.StringIndexOutOfBoundsException: String index out of range: 32
	at java.lang.String.substring(String.java:1907)
	at org.joda.time.format.FormatUtils.createErrorMessage(FormatUtils.java:128)
	at org.joda.time.format.DateTimeFormatter.parseDateTime(DateTimeFormatter.java:899)
	at org.joda.time.format.TestDateTimeFormatter.testParseLocalDateTime_simple(TestDateTimeFormatter.java:514)

testParseDateTime_simple(org.joda.time.format.TestDateTimeFormatter)  Time elapsed: 0.001 sec  <<< ERROR!
java.lang.StringIndexOutOfBoundsException: String index out of range: 32
	at java.lang.String.substring(String.java:1907)
	at org.joda.time.format.FormatUtils.createErrorMessage(FormatUtils.java:128)
	at org.joda.time.format.DateTimeFormatter.parseDateTime(DateTimeFormatter.java:899)
	at org.joda.time.format.TestDateTimeFormatter.testParseDateTime_simple(TestDateTimeFormatter.java:547)

testParseMutableDateTime_simple(org.joda.time.format.TestDateTimeFormatter)  Time elapsed: 0.001 sec  <<< ERROR!
java.lang.StringIndexOutOfBoundsException: String index out of range: 32
	at java.lang.String.substring(String.java:1907)
	at org.joda.time.format.FormatUtils.createErrorMessage(FormatUtils.java:128)
	at org.joda.time.format.DateTimeFormatter.parseMutableDateTime(DateTimeFormatter.java:944)
	at org.joda.time.format.TestDateTimeFormatter.testParseMutableDateTime_simple(TestDateTimeFormatter.java:642)

testParseLocalDate_simple(org.joda.time.format.TestDateTimeFormatter)  Time elapsed: 0 sec  <<< ERROR!
java.lang.StringIndexOutOfBoundsException: String index out of range: 32
	at java.lang.String.substring(String.java:1907)
	at org.joda.time.format.FormatUtils.createErrorMessage(FormatUtils.java:128)
	at org.joda.time.format.DateTimeFormatter.parseDateTime(DateTimeFormatter.java:899)
	at org.joda.time.format.TestDateTimeFormatter.testParseLocalDate_simple(TestDateTimeFormatter.java:371)

testParseLocalTime_simple(org.joda.time.format.TestDateTimeFormatter)  Time elapsed: 0.001 sec  <<< ERROR!
java.lang.StringIndexOutOfBoundsException: String index out of range: 32
	at java.lang.String.substring(String.java:1907)
	at org.joda.time.format.FormatUtils.createErrorMessage(FormatUtils.java:128)
	at org.joda.time.format.DateTimeFormatter.parseDateTime(DateTimeFormatter.java:899)
	at org.joda.time.format.TestDateTimeFormatter.testParseLocalTime_simple(TestDateTimeFormatter.java:501)

testFormat_shortBasicParse(org.joda.time.format.TestDateTimeFormat)  Time elapsed: 0 sec  <<< ERROR!
java.lang.StringIndexOutOfBoundsException: String index out of range: 38
	at java.lang.String.substring(String.java:1907)
	at org.joda.time.format.FormatUtils.createErrorMessage(FormatUtils.java:128)
	at org.joda.time.format.DateTimeFormatter.parseDateTime(DateTimeFormatter.java:899)
	at org.joda.time.format.TestDateTimeFormat.testFormat_shortBasicParse(TestDateTimeFormat.java:856)

testFormatParse_textYear_UK(org.joda.time.format.TestDateTimeFormat)  Time elapsed: 0 sec  <<< ERROR!
java.lang.StringIndexOutOfBoundsException: String index out of range: 33
	at java.lang.String.substring(String.java:1907)
	at org.joda.time.format.FormatUtils.createErrorMessage(FormatUtils.java:128)
	at org.joda.time.format.DateTimeFormatter.parseDateTime(DateTimeFormatter.java:899)
	at org.joda.time.format.TestDateTimeFormat.testFormatParse_textYear_UK(TestDateTimeFormat.java:1085)

testFormatParse_textYear_France(org.joda.time.format.TestDateTimeFormat)  Time elapsed: 0 sec  <<< ERROR!
java.lang.StringIndexOutOfBoundsException: String index out of range: 33
	at java.lang.String.substring(String.java:1907)
	at org.joda.time.format.FormatUtils.createErrorMessage(FormatUtils.java:128)
	at org.joda.time.format.DateTimeFormatter.parseDateTime(DateTimeFormatter.java:899)
	at org.joda.time.format.TestDateTimeFormat.testFormatParse_textYear_France(TestDateTimeFormat.java:1102)

testFormat_yearOfEra_twoDigit(org.joda.time.format.TestDateTimeFormat)  Time elapsed: 0 sec  <<< ERROR!
java.lang.StringIndexOutOfBoundsException: String index out of range: 32
	at java.lang.String.substring(String.java:1907)
	at org.joda.time.format.FormatUtils.createErrorMessage(FormatUtils.java:128)
	at org.joda.time.format.DateTimeFormatter.parseDateTime(DateTimeFormatter.java:899)
	at org.joda.time.format.TestDateTimeFormat.testFormat_yearOfEra_twoDigit(TestDateTimeFormat.java:165)

testFormat_year(org.joda.time.format.TestDateTimeFormat)  Time elapsed: 0.001 sec  <<< ERROR!
java.lang.StringIndexOutOfBoundsException: String index out of range: 32
	at java.lang.String.substring(String.java:1907)
	at org.joda.time.format.FormatUtils.createErrorMessage(FormatUtils.java:128)
	at org.joda.time.format.DateTimeFormatter.parseDateTime(DateTimeFormatter.java:899)
	at org.joda.time.format.TestDateTimeFormat.testFormat_year(TestDateTimeFormat.java:225)

testFormat_year_twoDigit(org.joda.time.format.TestDateTimeFormat)  Time elapsed: 0 sec  <<< ERROR!
java.lang.StringIndexOutOfBoundsException: String index out of range: 32
	at java.lang.String.substring(String.java:1907)
	at org.joda.time.format.FormatUtils.createErrorMessage(FormatUtils.java:128)
	at org.joda.time.format.DateTimeFormatter.parseDateTime(DateTimeFormatter.java:899)
	at org.joda.time.format.TestDateTimeFormat.testFormat_year_twoDigit(TestDateTimeFormat.java:257)

testFormat_weekyearOfEra_twoDigit(org.joda.time.format.TestDateTimeFormat)  Time elapsed: 0 sec  <<< ERROR!
java.lang.StringIndexOutOfBoundsException: String index out of range: 32
	at java.lang.String.substring(String.java:1907)
	at org.joda.time.format.FormatUtils.createErrorMessage(FormatUtils.java:128)
	at org.joda.time.format.DateTimeFormatter.parseDateTime(DateTimeFormatter.java:899)
	at org.joda.time.format.TestDateTimeFormat.testFormat_weekyearOfEra_twoDigit(TestDateTimeFormat.java:402)

test_dateParser(org.joda.time.format.TestISODateTimeFormatParsing)  Time elapsed: 0.001 sec  <<< ERROR!
java.lang.StringIndexOutOfBoundsException: String index out of range: 42
	at java.lang.String.substring(String.java:1907)
	at org.joda.time.format.FormatUtils.createErrorMessage(FormatUtils.java:128)
	at org.joda.time.format.DateTimeParserBucket.doParseMillis(DateTimeParserBucket.java:187)
	at org.joda.time.format.DateTimeFormatter.parseMillis(DateTimeFormatter.java:780)
	at org.joda.time.format.TestISODateTimeFormatParsing.assertParse(TestISODateTimeFormatParsing.java:831)
	at org.joda.time.format.TestISODateTimeFormatParsing.test_dateParser(TestISODateTimeFormatParsing.java:78)

test_localDateParser(org.joda.time.format.TestISODateTimeFormatParsing)  Time elapsed: 0.001 sec  <<< ERROR!
java.lang.StringIndexOutOfBoundsException: String index out of range: 42
	at java.lang.String.substring(String.java:1907)
	at org.joda.time.format.FormatUtils.createErrorMessage(FormatUtils.java:128)
	at org.joda.time.format.DateTimeParserBucket.doParseMillis(DateTimeParserBucket.java:187)
	at org.joda.time.format.DateTimeFormatter.parseMillis(DateTimeFormatter.java:780)
	at org.joda.time.format.TestISODateTimeFormatParsing.assertParse(TestISODateTimeFormatParsing.java:831)
	at org.joda.time.format.TestISODateTimeFormatParsing.test_localDateParser(TestISODateTimeFormatParsing.java:105)

test_dateElementParser(org.joda.time.format.TestISODateTimeFormatParsing)  Time elapsed: 0.002 sec  <<< ERROR!
java.lang.StringIndexOutOfBoundsException: String index out of range: 42
	at java.lang.String.substring(String.java:1907)
	at org.joda.time.format.FormatUtils.createErrorMessage(FormatUtils.java:128)
	at org.joda.time.format.DateTimeParserBucket.doParseMillis(DateTimeParserBucket.java:187)
	at org.joda.time.format.DateTimeFormatter.parseMillis(DateTimeFormatter.java:780)
	at org.joda.time.format.TestISODateTimeFormatParsing.assertParse(TestISODateTimeFormatParsing.java:831)
	at org.joda.time.format.TestISODateTimeFormatParsing.test_dateElementParser(TestISODateTimeFormatParsing.java:138)

test_timeParser(org.joda.time.format.TestISODateTimeFormatParsing)  Time elapsed: 0 sec  <<< ERROR!
java.lang.StringIndexOutOfBoundsException: String index out of range: 34
	at java.lang.String.substring(String.java:1907)
	at org.joda.time.format.FormatUtils.createErrorMessage(FormatUtils.java:128)
	at org.joda.time.format.DateTimeParserBucket.doParseMillis(DateTimeParserBucket.java:187)
	at org.joda.time.format.DateTimeFormatter.parseMillis(DateTimeFormatter.java:780)
	at org.joda.time.format.TestISODateTimeFormatParsing.assertParse(TestISODateTimeFormatParsing.java:831)
	at org.joda.time.format.TestISODateTimeFormatParsing.test_timeParser(TestISODateTimeFormatParsing.java:166)

test_localTimeParser(org.joda.time.format.TestISODateTimeFormatParsing)  Time elapsed: 0 sec  <<< ERROR!
java.lang.StringIndexOutOfBoundsException: String index out of range: 34
	at java.lang.String.substring(String.java:1907)
	at org.joda.time.format.FormatUtils.createErrorMessage(FormatUtils.java:128)
	at org.joda.time.format.DateTimeParserBucket.doParseMillis(DateTimeParserBucket.java:187)
	at org.joda.time.format.DateTimeFormatter.parseMillis(DateTimeFormatter.java:780)
	at org.joda.time.format.TestISODateTimeFormatParsing.assertParse(TestISODateTimeFormatParsing.java:831)
	at org.joda.time.format.TestISODateTimeFormatParsing.test_localTimeParser(TestISODateTimeFormatParsing.java:200)

test_timeElementParser(org.joda.time.format.TestISODateTimeFormatParsing)  Time elapsed: 0.001 sec  <<< ERROR!
java.lang.StringIndexOutOfBoundsException: String index out of range: 34
	at java.lang.String.substring(String.java:1907)
	at org.joda.time.format.FormatUtils.createErrorMessage(FormatUtils.java:128)
	at org.joda.time.format.DateTimeParserBucket.doParseMillis(DateTimeParserBucket.java:187)
	at org.joda.time.format.DateTimeFormatter.parseMillis(DateTimeFormatter.java:780)
	at org.joda.time.format.TestISODateTimeFormatParsing.assertParse(TestISODateTimeFormatParsing.java:831)
	at org.joda.time.format.TestISODateTimeFormatParsing.test_timeElementParser(TestISODateTimeFormatParsing.java:233)

test_dateTimeParser(org.joda.time.format.TestISODateTimeFormatParsing)  Time elapsed: 0.002 sec  <<< ERROR!
java.lang.StringIndexOutOfBoundsException: String index out of range: 34
	at java.lang.String.substring(String.java:1907)
	at org.joda.time.format.FormatUtils.createErrorMessage(FormatUtils.java:128)
	at org.joda.time.format.DateTimeParserBucket.doParseMillis(DateTimeParserBucket.java:187)
	at org.joda.time.format.DateTimeFormatter.parseMillis(DateTimeFormatter.java:780)
	at org.joda.time.format.TestISODateTimeFormatParsing.assertParse(TestISODateTimeFormatParsing.java:831)
	at org.joda.time.format.TestISODateTimeFormatParsing.test_dateTimeParser(TestISODateTimeFormatParsing.java:286)

test_dateOptionalTimeParser(org.joda.time.format.TestISODateTimeFormatParsing)  Time elapsed: 0.002 sec  <<< ERROR!
java.lang.StringIndexOutOfBoundsException: String index out of range: 32
	at java.lang.String.substring(String.java:1907)
	at org.joda.time.format.FormatUtils.createErrorMessage(FormatUtils.java:128)
	at org.joda.time.format.DateTimeParserBucket.doParseMillis(DateTimeParserBucket.java:187)
	at org.joda.time.format.DateTimeFormatter.parseMillis(DateTimeFormatter.java:780)
	at org.joda.time.format.TestISODateTimeFormatParsing.assertParse(TestISODateTimeFormatParsing.java:831)
	at org.joda.time.format.TestISODateTimeFormatParsing.test_dateOptionalTimeParser(TestISODateTimeFormatParsing.java:311)

test_localDateOptionalTimeParser(org.joda.time.format.TestISODateTimeFormatParsing)  Time elapsed: 0 sec  <<< ERROR!
java.lang.StringIndexOutOfBoundsException: String index out of range: 42
	at java.lang.String.substring(String.java:1907)
	at org.joda.time.format.FormatUtils.createErrorMessage(FormatUtils.java:128)
	at org.joda.time.format.DateTimeParserBucket.doParseMillis(DateTimeParserBucket.java:187)
	at org.joda.time.format.DateTimeFormatter.parseMillis(DateTimeFormatter.java:780)
	at org.joda.time.format.TestISODateTimeFormatParsing.assertParse(TestISODateTimeFormatParsing.java:831)
	at org.joda.time.format.TestISODateTimeFormatParsing.test_localDateOptionalTimeParser(TestISODateTimeFormatParsing.java:331)

test_date(org.joda.time.format.TestISODateTimeFormatParsing)  Time elapsed: 0.001 sec  <<< ERROR!
java.lang.StringIndexOutOfBoundsException: String index out of range: 40
	at java.lang.String.substring(String.java:1907)
	at org.joda.time.format.FormatUtils.createErrorMessage(FormatUtils.java:128)
	at org.joda.time.format.DateTimeParserBucket.doParseMillis(DateTimeParserBucket.java:187)
	at org.joda.time.format.DateTimeFormatter.parseMillis(DateTimeFormatter.java:780)
	at org.joda.time.format.TestISODateTimeFormatParsing.assertParse(TestISODateTimeFormatParsing.java:831)
	at org.joda.time.format.TestISODateTimeFormatParsing.test_date(TestISODateTimeFormatParsing.java:364)

test_time(org.joda.time.format.TestISODateTimeFormatParsing)  Time elapsed: 0.001 sec  <<< ERROR!
java.lang.StringIndexOutOfBoundsException: String index out of range: 37
	at java.lang.String.substring(String.java:1907)
	at org.joda.time.format.FormatUtils.createErrorMessage(FormatUtils.java:128)
	at org.joda.time.format.DateTimeParserBucket.doParseMillis(DateTimeParserBucket.java:187)
	at org.joda.time.format.DateTimeFormatter.parseMillis(DateTimeFormatter.java:780)
	at org.joda.time.format.TestISODateTimeFormatParsing.assertParse(TestISODateTimeFormatParsing.java:831)
	at org.joda.time.format.TestISODateTimeFormatParsing.test_time(TestISODateTimeFormatParsing.java:380)

test_tTime(org.joda.time.format.TestISODateTimeFormatParsing)  Time elapsed: 0 sec  <<< ERROR!
java.lang.StringIndexOutOfBoundsException: String index out of range: 38
	at java.lang.String.substring(String.java:1907)
	at org.joda.time.format.FormatUtils.createErrorMessage(FormatUtils.java:128)
	at org.joda.time.format.DateTimeParserBucket.doParseMillis(DateTimeParserBucket.java:187)
	at org.joda.time.format.DateTimeFormatter.parseMillis(DateTimeFormatter.java:780)
	at org.joda.time.format.TestISODateTimeFormatParsing.assertParse(TestISODateTimeFormatParsing.java:831)
	at org.joda.time.format.TestISODateTimeFormatParsing.test_tTime(TestISODateTimeFormatParsing.java:407)

test_timeNoMillis(org.joda.time.format.TestISODateTimeFormatParsing)  Time elapsed: 0 sec  <<< ERROR!
java.lang.StringIndexOutOfBoundsException: String index out of range: 37
	at java.lang.String.substring(String.java:1907)
	at org.joda.time.format.FormatUtils.createErrorMessage(FormatUtils.java:128)
	at org.joda.time.format.DateTimeParserBucket.doParseMillis(DateTimeParserBucket.java:187)
	at org.joda.time.format.DateTimeFormatter.parseMillis(DateTimeFormatter.java:780)
	at org.joda.time.format.TestISODateTimeFormatParsing.assertParse(TestISODateTimeFormatParsing.java:831)
	at org.joda.time.format.TestISODateTimeFormatParsing.test_timeNoMillis(TestISODateTimeFormatParsing.java:392)

test_tTimeNoMillis(org.joda.time.format.TestISODateTimeFormatParsing)  Time elapsed: 0.001 sec  <<< ERROR!
java.lang.StringIndexOutOfBoundsException: String index out of range: 38
	at java.lang.String.substring(String.java:1907)
	at org.joda.time.format.FormatUtils.createErrorMessage(FormatUtils.java:128)
	at org.joda.time.format.DateTimeParserBucket.doParseMillis(DateTimeParserBucket.java:187)
	at org.joda.time.format.DateTimeFormatter.parseMillis(DateTimeFormatter.java:780)
	at org.joda.time.format.TestISODateTimeFormatParsing.assertParse(TestISODateTimeFormatParsing.java:831)
	at org.joda.time.format.TestISODateTimeFormatParsing.test_tTimeNoMillis(TestISODateTimeFormatParsing.java:419)

test_dateTime(org.joda.time.format.TestISODateTimeFormatParsing)  Time elapsed: 0.001 sec  <<< ERROR!
java.lang.StringIndexOutOfBoundsException: String index out of range: 40
	at java.lang.String.substring(String.java:1907)
	at org.joda.time.format.FormatUtils.createErrorMessage(FormatUtils.java:128)
	at org.joda.time.format.DateTimeParserBucket.doParseMillis(DateTimeParserBucket.java:187)
	at org.joda.time.format.DateTimeFormatter.parseMillis(DateTimeFormatter.java:780)
	at org.joda.time.format.TestISODateTimeFormatParsing.assertParse(TestISODateTimeFormatParsing.java:831)
	at org.joda.time.format.TestISODateTimeFormatParsing.test_dateTime(TestISODateTimeFormatParsing.java:437)

test_dateTimeNoMillis(org.joda.time.format.TestISODateTimeFormatParsing)  Time elapsed: 0.001 sec  <<< ERROR!
java.lang.StringIndexOutOfBoundsException: String index out of range: 40
	at java.lang.String.substring(String.java:1907)
	at org.joda.time.format.FormatUtils.createErrorMessage(FormatUtils.java:128)
	at org.joda.time.format.DateTimeParserBucket.doParseMillis(DateTimeParserBucket.java:187)
	at org.joda.time.format.DateTimeFormatter.parseMillis(DateTimeFormatter.java:780)
	at org.joda.time.format.TestISODateTimeFormatParsing.assertParse(TestISODateTimeFormatParsing.java:831)
	at org.joda.time.format.TestISODateTimeFormatParsing.test_dateTimeNoMillis(TestISODateTimeFormatParsing.java:459)

test_ordinalDate(org.joda.time.format.TestISODateTimeFormatParsing)  Time elapsed: 0.001 sec  <<< ERROR!
java.lang.StringIndexOutOfBoundsException: String index out of range: 37
	at java.lang.String.substring(String.java:1907)
	at org.joda.time.format.FormatUtils.createErrorMessage(FormatUtils.java:128)
	at org.joda.time.format.DateTimeParserBucket.doParseMillis(DateTimeParserBucket.java:187)
	at org.joda.time.format.DateTimeFormatter.parseMillis(DateTimeFormatter.java:780)
	at org.joda.time.format.TestISODateTimeFormatParsing.assertParse(TestISODateTimeFormatParsing.java:831)
	at org.joda.time.format.TestISODateTimeFormatParsing.test_ordinalDate(TestISODateTimeFormatParsing.java:478)

test_ordinalDateTime(org.joda.time.format.TestISODateTimeFormatParsing)  Time elapsed: 0.001 sec  <<< ERROR!
java.lang.StringIndexOutOfBoundsException: String index out of range: 37
	at java.lang.String.substring(String.java:1907)
	at org.joda.time.format.FormatUtils.createErrorMessage(FormatUtils.java:128)
	at org.joda.time.format.DateTimeParserBucket.doParseMillis(DateTimeParserBucket.java:187)
	at org.joda.time.format.DateTimeFormatter.parseMillis(DateTimeFormatter.java:780)
	at org.joda.time.format.TestISODateTimeFormatParsing.assertParse(TestISODateTimeFormatParsing.java:831)
	at org.joda.time.format.TestISODateTimeFormatParsing.test_ordinalDateTime(TestISODateTimeFormatParsing.java:493)

test_ordinalDateTimeNoMillis(org.joda.time.format.TestISODateTimeFormatParsing)  Time elapsed: 0 sec  <<< ERROR!
java.lang.StringIndexOutOfBoundsException: String index out of range: 37
	at java.lang.String.substring(String.java:1907)
	at org.joda.time.format.FormatUtils.createErrorMessage(FormatUtils.java:128)
	at org.joda.time.format.DateTimeParserBucket.doParseMillis(DateTimeParserBucket.java:187)
	at org.joda.time.format.DateTimeFormatter.parseMillis(DateTimeFormatter.java:780)
	at org.joda.time.format.TestISODateTimeFormatParsing.assertParse(TestISODateTimeFormatParsing.java:831)
	at org.joda.time.format.TestISODateTimeFormatParsing.test_ordinalDateTimeNoMillis(TestISODateTimeFormatParsing.java:509)

test_weekDate(org.joda.time.format.TestISODateTimeFormatParsing)  Time elapsed: 0.001 sec  <<< ERROR!
java.lang.StringIndexOutOfBoundsException: String index out of range: 38
	at java.lang.String.substring(String.java:1907)
	at org.joda.time.format.FormatUtils.createErrorMessage(FormatUtils.java:128)
	at org.joda.time.format.DateTimeParserBucket.doParseMillis(DateTimeParserBucket.java:187)
	at org.joda.time.format.DateTimeFormatter.parseMillis(DateTimeFormatter.java:780)
	at org.joda.time.format.TestISODateTimeFormatParsing.assertParse(TestISODateTimeFormatParsing.java:831)
	at org.joda.time.format.TestISODateTimeFormatParsing.test_weekDate(TestISODateTimeFormatParsing.java:522)

test_weekDateTime(org.joda.time.format.TestISODateTimeFormatParsing)  Time elapsed: 0.001 sec  <<< ERROR!
java.lang.StringIndexOutOfBoundsException: String index out of range: 41
	at java.lang.String.substring(String.java:1907)
	at org.joda.time.format.FormatUtils.createErrorMessage(FormatUtils.java:128)
	at org.joda.time.format.DateTimeParserBucket.doParseMillis(DateTimeParserBucket.java:187)
	at org.joda.time.format.DateTimeFormatter.parseMillis(DateTimeFormatter.java:780)
	at org.joda.time.format.TestISODateTimeFormatParsing.assertParse(TestISODateTimeFormatParsing.java:831)
	at org.joda.time.format.TestISODateTimeFormatParsing.test_weekDateTime(TestISODateTimeFormatParsing.java:539)

test_weekDateTimeNoMillis(org.joda.time.format.TestISODateTimeFormatParsing)  Time elapsed: 0.001 sec  <<< ERROR!
java.lang.StringIndexOutOfBoundsException: String index out of range: 41
	at java.lang.String.substring(String.java:1907)
	at org.joda.time.format.FormatUtils.createErrorMessage(FormatUtils.java:128)
	at org.joda.time.format.DateTimeParserBucket.doParseMillis(DateTimeParserBucket.java:187)
	at org.joda.time.format.DateTimeFormatter.parseMillis(DateTimeFormatter.java:780)
	at org.joda.time.format.TestISODateTimeFormatParsing.assertParse(TestISODateTimeFormatParsing.java:831)
	at org.joda.time.format.TestISODateTimeFormatParsing.test_weekDateTimeNoMillis(TestISODateTimeFormatParsing.java:556)

test_basicDate(org.joda.time.format.TestISODateTimeFormatParsing)  Time elapsed: 0.001 sec  <<< ERROR!
java.lang.StringIndexOutOfBoundsException: String index out of range: 39
	at java.lang.String.substring(String.java:1907)
	at org.joda.time.format.FormatUtils.createErrorMessage(FormatUtils.java:128)
	at org.joda.time.format.DateTimeParserBucket.doParseMillis(DateTimeParserBucket.java:187)
	at org.joda.time.format.DateTimeFormatter.parseMillis(DateTimeFormatter.java:780)
	at org.joda.time.format.TestISODateTimeFormatParsing.assertParse(TestISODateTimeFormatParsing.java:831)
	at org.joda.time.format.TestISODateTimeFormatParsing.test_basicDate(TestISODateTimeFormatParsing.java:572)

test_basicTime(org.joda.time.format.TestISODateTimeFormatParsing)  Time elapsed: 0.001 sec  <<< ERROR!
java.lang.StringIndexOutOfBoundsException: String index out of range: 37
	at java.lang.String.substring(String.java:1907)
	at org.joda.time.format.FormatUtils.createErrorMessage(FormatUtils.java:128)
	at org.joda.time.format.DateTimeParserBucket.doParseMillis(DateTimeParserBucket.java:187)
	at org.joda.time.format.DateTimeFormatter.parseMillis(DateTimeFormatter.java:780)
	at org.joda.time.format.TestISODateTimeFormatParsing.assertParse(TestISODateTimeFormatParsing.java:831)
	at org.joda.time.format.TestISODateTimeFormatParsing.test_basicTime(TestISODateTimeFormatParsing.java:586)

test_basicTimeNoMillis(org.joda.time.format.TestISODateTimeFormatParsing)  Time elapsed: 0 sec  <<< ERROR!
java.lang.StringIndexOutOfBoundsException: String index out of range: 37
	at java.lang.String.substring(String.java:1907)
	at org.joda.time.format.FormatUtils.createErrorMessage(FormatUtils.java:128)
	at org.joda.time.format.DateTimeParserBucket.doParseMillis(DateTimeParserBucket.java:187)
	at org.joda.time.format.DateTimeFormatter.parseMillis(DateTimeFormatter.java:780)
	at org.joda.time.format.TestISODateTimeFormatParsing.assertParse(TestISODateTimeFormatParsing.java:831)
	at org.joda.time.format.TestISODateTimeFormatParsing.test_basicTimeNoMillis(TestISODateTimeFormatParsing.java:598)

test_basicTTime(org.joda.time.format.TestISODateTimeFormatParsing)  Time elapsed: 0.001 sec  <<< ERROR!
java.lang.StringIndexOutOfBoundsException: String index out of range: 38
	at java.lang.String.substring(String.java:1907)
	at org.joda.time.format.FormatUtils.createErrorMessage(FormatUtils.java:128)
	at org.joda.time.format.DateTimeParserBucket.doParseMillis(DateTimeParserBucket.java:187)
	at org.joda.time.format.DateTimeFormatter.parseMillis(DateTimeFormatter.java:780)
	at org.joda.time.format.TestISODateTimeFormatParsing.assertParse(TestISODateTimeFormatParsing.java:831)
	at org.joda.time.format.TestISODateTimeFormatParsing.test_basicTTime(TestISODateTimeFormatParsing.java:613)

test_basicTTimeNoMillis(org.joda.time.format.TestISODateTimeFormatParsing)  Time elapsed: 0 sec  <<< ERROR!
java.lang.StringIndexOutOfBoundsException: String index out of range: 38
	at java.lang.String.substring(String.java:1907)
	at org.joda.time.format.FormatUtils.createErrorMessage(FormatUtils.java:128)
	at org.joda.time.format.DateTimeParserBucket.doParseMillis(DateTimeParserBucket.java:187)
	at org.joda.time.format.DateTimeFormatter.parseMillis(DateTimeFormatter.java:780)
	at org.joda.time.format.TestISODateTimeFormatParsing.assertParse(TestISODateTimeFormatParsing.java:831)
	at org.joda.time.format.TestISODateTimeFormatParsing.test_basicTTimeNoMillis(TestISODateTimeFormatParsing.java:625)

test_basicDateTime(org.joda.time.format.TestISODateTimeFormatParsing)  Time elapsed: 0.001 sec  <<< ERROR!
java.lang.StringIndexOutOfBoundsException: String index out of range: 39
	at java.lang.String.substring(String.java:1907)
	at org.joda.time.format.FormatUtils.createErrorMessage(FormatUtils.java:128)
	at org.joda.time.format.DateTimeParserBucket.doParseMillis(DateTimeParserBucket.java:187)
	at org.joda.time.format.DateTimeFormatter.parseMillis(DateTimeFormatter.java:780)
	at org.joda.time.format.TestISODateTimeFormatParsing.assertParse(TestISODateTimeFormatParsing.java:831)
	at org.joda.time.format.TestISODateTimeFormatParsing.test_basicDateTime(TestISODateTimeFormatParsing.java:640)

test_basicDateTimeNoMillis(org.joda.time.format.TestISODateTimeFormatParsing)  Time elapsed: 0.001 sec  <<< ERROR!
java.lang.StringIndexOutOfBoundsException: String index out of range: 39
	at java.lang.String.substring(String.java:1907)
	at org.joda.time.format.FormatUtils.createErrorMessage(FormatUtils.java:128)
	at org.joda.time.format.DateTimeParserBucket.doParseMillis(DateTimeParserBucket.java:187)
	at org.joda.time.format.DateTimeFormatter.parseMillis(DateTimeFormatter.java:780)
	at org.joda.time.format.TestISODateTimeFormatParsing.assertParse(TestISODateTimeFormatParsing.java:831)
	at org.joda.time.format.TestISODateTimeFormatParsing.test_basicDateTimeNoMillis(TestISODateTimeFormatParsing.java:659)

test_basicOrdinalDate(org.joda.time.format.TestISODateTimeFormatParsing)  Time elapsed: 0.001 sec  <<< ERROR!
java.lang.StringIndexOutOfBoundsException: String index out of range: 38
	at java.lang.String.substring(String.java:1907)
	at org.joda.time.format.FormatUtils.createErrorMessage(FormatUtils.java:128)
	at org.joda.time.format.DateTimeParserBucket.doParseMillis(DateTimeParserBucket.java:187)
	at org.joda.time.format.DateTimeFormatter.parseMillis(DateTimeFormatter.java:780)
	at org.joda.time.format.TestISODateTimeFormatParsing.assertParse(TestISODateTimeFormatParsing.java:831)
	at org.joda.time.format.TestISODateTimeFormatParsing.test_basicOrdinalDate(TestISODateTimeFormatParsing.java:677)

test_basicOrdinalDateTime(org.joda.time.format.TestISODateTimeFormatParsing)  Time elapsed: 0.001 sec  <<< ERROR!
java.lang.StringIndexOutOfBoundsException: String index out of range: 38
	at java.lang.String.substring(String.java:1907)
	at org.joda.time.format.FormatUtils.createErrorMessage(FormatUtils.java:128)
	at org.joda.time.format.DateTimeParserBucket.doParseMillis(DateTimeParserBucket.java:187)
	at org.joda.time.format.DateTimeFormatter.parseMillis(DateTimeFormatter.java:780)
	at org.joda.time.format.TestISODateTimeFormatParsing.assertParse(TestISODateTimeFormatParsing.java:831)
	at org.joda.time.format.TestISODateTimeFormatParsing.test_basicOrdinalDateTime(TestISODateTimeFormatParsing.java:690)

test_basicOrdinalDateTimeNoMillis(org.joda.time.format.TestISODateTimeFormatParsing)  Time elapsed: 0 sec  <<< ERROR!
java.lang.StringIndexOutOfBoundsException: String index out of range: 38
	at java.lang.String.substring(String.java:1907)
	at org.joda.time.format.FormatUtils.createErrorMessage(FormatUtils.java:128)
	at org.joda.time.format.DateTimeParserBucket.doParseMillis(DateTimeParserBucket.java:187)
	at org.joda.time.format.DateTimeFormatter.parseMillis(DateTimeFormatter.java:780)
	at org.joda.time.format.TestISODateTimeFormatParsing.assertParse(TestISODateTimeFormatParsing.java:831)
	at org.joda.time.format.TestISODateTimeFormatParsing.test_basicOrdinalDateTimeNoMillis(TestISODateTimeFormatParsing.java:708)

test_basicWeekDate(org.joda.time.format.TestISODateTimeFormatParsing)  Time elapsed: 0.001 sec  <<< ERROR!
java.lang.StringIndexOutOfBoundsException: String index out of range: 39
	at java.lang.String.substring(String.java:1907)
	at org.joda.time.format.FormatUtils.createErrorMessage(FormatUtils.java:128)
	at org.joda.time.format.DateTimeParserBucket.doParseMillis(DateTimeParserBucket.java:187)
	at org.joda.time.format.DateTimeFormatter.parseMillis(DateTimeFormatter.java:780)
	at org.joda.time.format.TestISODateTimeFormatParsing.assertParse(TestISODateTimeFormatParsing.java:831)
	at org.joda.time.format.TestISODateTimeFormatParsing.test_basicWeekDate(TestISODateTimeFormatParsing.java:725)

test_basicWeekDateTime(org.joda.time.format.TestISODateTimeFormatParsing)  Time elapsed: 0.001 sec  <<< ERROR!
java.lang.StringIndexOutOfBoundsException: String index out of range: 39
	at java.lang.String.substring(String.java:1907)
	at org.joda.time.format.FormatUtils.createErrorMessage(FormatUtils.java:128)
	at org.joda.time.format.DateTimeParserBucket.doParseMillis(DateTimeParserBucket.java:187)
	at org.joda.time.format.DateTimeFormatter.parseMillis(DateTimeFormatter.java:780)
	at org.joda.time.format.TestISODateTimeFormatParsing.assertParse(TestISODateTimeFormatParsing.java:831)
	at org.joda.time.format.TestISODateTimeFormatParsing.test_basicWeekDateTime(TestISODateTimeFormatParsing.java:738)

test_basicWeekDateTimeNoMillis(org.joda.time.format.TestISODateTimeFormatParsing)  Time elapsed: 0.001 sec  <<< ERROR!
java.lang.StringIndexOutOfBoundsException: String index out of range: 39
	at java.lang.String.substring(String.java:1907)
	at org.joda.time.format.FormatUtils.createErrorMessage(FormatUtils.java:128)
	at org.joda.time.format.DateTimeParserBucket.doParseMillis(DateTimeParserBucket.java:187)
	at org.joda.time.format.DateTimeFormatter.parseMillis(DateTimeFormatter.java:780)
	at org.joda.time.format.TestISODateTimeFormatParsing.assertParse(TestISODateTimeFormatParsing.java:831)
	at org.joda.time.format.TestISODateTimeFormatParsing.test_basicWeekDateTimeNoMillis(TestISODateTimeFormatParsing.java:752)

test_hourMinute(org.joda.time.format.TestISODateTimeFormatParsing)  Time elapsed: 0 sec  <<< ERROR!
java.lang.StringIndexOutOfBoundsException: String index out of range: 37
	at java.lang.String.substring(String.java:1907)
	at org.joda.time.format.FormatUtils.createErrorMessage(FormatUtils.java:128)
	at org.joda.time.format.DateTimeParserBucket.doParseMillis(DateTimeParserBucket.java:187)
	at org.joda.time.format.DateTimeFormatter.parseMillis(DateTimeFormatter.java:780)
	at org.joda.time.format.TestISODateTimeFormatParsing.assertParse(TestISODateTimeFormatParsing.java:831)
	at org.joda.time.format.TestISODateTimeFormatParsing.test_hourMinute(TestISODateTimeFormatParsing.java:769)

test_hourMinuteSecond(org.joda.time.format.TestISODateTimeFormatParsing)  Time elapsed: 0.001 sec  <<< ERROR!
java.lang.StringIndexOutOfBoundsException: String index out of range: 40
	at java.lang.String.substring(String.java:1907)
	at org.joda.time.format.FormatUtils.createErrorMessage(FormatUtils.java:128)
	at org.joda.time.format.DateTimeParserBucket.doParseMillis(DateTimeParserBucket.java:187)
	at org.joda.time.format.DateTimeFormatter.parseMillis(DateTimeFormatter.java:780)
	at org.joda.time.format.TestISODateTimeFormatParsing.assertParse(TestISODateTimeFormatParsing.java:831)
	at org.joda.time.format.TestISODateTimeFormatParsing.test_hourMinuteSecond(TestISODateTimeFormatParsing.java:784)

test_hourMinuteSecondMillis(org.joda.time.format.TestISODateTimeFormatParsing)  Time elapsed: 0.001 sec  <<< ERROR!
java.lang.StringIndexOutOfBoundsException: String index out of range: 44
	at java.lang.String.substring(String.java:1907)
	at org.joda.time.format.FormatUtils.createErrorMessage(FormatUtils.java:128)
	at org.joda.time.format.DateTimeParserBucket.doParseMillis(DateTimeParserBucket.java:187)
	at org.joda.time.format.DateTimeFormatter.parseMillis(DateTimeFormatter.java:780)
	at org.joda.time.format.TestISODateTimeFormatParsing.assertParse(TestISODateTimeFormatParsing.java:831)
	at org.joda.time.format.TestISODateTimeFormatParsing.test_hourMinuteSecondMillis(TestISODateTimeFormatParsing.java:801)

test_hourMinuteSecondFraction(org.joda.time.format.TestISODateTimeFormatParsing)  Time elapsed: 0.001 sec  <<< ERROR!
java.lang.StringIndexOutOfBoundsException: String index out of range: 37
	at java.lang.String.substring(String.java:1907)
	at org.joda.time.format.FormatUtils.createErrorMessage(FormatUtils.java:128)
	at org.joda.time.format.DateTimeParserBucket.doParseMillis(DateTimeParserBucket.java:187)
	at org.joda.time.format.DateTimeFormatter.parseMillis(DateTimeFormatter.java:780)
	at org.joda.time.format.TestISODateTimeFormatParsing.assertParse(TestISODateTimeFormatParsing.java:831)
	at org.joda.time.format.TestISODateTimeFormatParsing.test_hourMinuteSecondFraction(TestISODateTimeFormatParsing.java:817)

test_appendFixedDecimal(org.joda.time.format.TestDateTimeFormatterBuilder)  Time elapsed: 0.001 sec  <<< ERROR!
java.lang.StringIndexOutOfBoundsException: String index out of range: 32
	at java.lang.String.substring(String.java:1907)
	at org.joda.time.format.FormatUtils.createErrorMessage(FormatUtils.java:128)
	at org.joda.time.format.DateTimeFormatter.parseDateTime(DateTimeFormatter.java:899)
	at org.joda.time.format.TestDateTimeFormatterBuilder.test_appendFixedDecimal(TestDateTimeFormatterBuilder.java:255)

test_appendFixedSignedDecimal(org.joda.time.format.TestDateTimeFormatterBuilder)  Time elapsed: 0.001 sec  <<< ERROR!
java.lang.StringIndexOutOfBoundsException: String index out of range: 36
	at java.lang.String.substring(String.java:1907)
	at org.joda.time.format.FormatUtils.createErrorMessage(FormatUtils.java:128)
	at org.joda.time.format.DateTimeFormatter.parseDateTime(DateTimeFormatter.java:899)
	at org.joda.time.format.TestDateTimeFormatterBuilder.test_appendFixedSignedDecimal(TestDateTimeFormatterBuilder.java:314)

test_appendTimeZoneOffset_invalidText(org.joda.time.format.TestDateTimeFormatterBuilder)  Time elapsed: 0.001 sec  <<< ERROR!
java.lang.StringIndexOutOfBoundsException: String index out of range: 32
	at java.lang.String.substring(String.java:1907)
	at org.joda.time.format.FormatUtils.createErrorMessage(FormatUtils.java:128)
	at org.joda.time.format.DateTimeFormatter.parseDateTime(DateTimeFormatter.java:899)
	at org.joda.time.format.TestDateTimeFormatterBuilder.test_appendTimeZoneOffset_invalidText(TestDateTimeFormatterBuilder.java:377)

test_appendTimeZoneId(org.joda.time.format.TestDateTimeFormatterBuilder)  Time elapsed: 0.002 sec  <<< ERROR!
java.lang.StringIndexOutOfBoundsException: String index out of range: 32
	at java.lang.String.substring(String.java:1907)
	at org.joda.time.format.FormatUtils.createErrorMessage(FormatUtils.java:128)
	at org.joda.time.format.DateTimeFormatter.parseDateTime(DateTimeFormatter.java:899)
	at org.joda.time.format.TestDateTimeFormatterBuilder.test_appendTimeZoneId(TestDateTimeFormatterBuilder.java:401)

test_printParseShortNameWithLookup(org.joda.time.format.TestDateTimeFormatterBuilder)  Time elapsed: 0.001 sec  <<< ERROR!
java.lang.StringIndexOutOfBoundsException: String index out of range: 49
	at java.lang.String.substring(String.java:1907)
	at org.joda.time.format.FormatUtils.createErrorMessage(FormatUtils.java:128)
	at org.joda.time.format.DateTimeFormatter.parseDateTime(DateTimeFormatter.java:899)
	at org.joda.time.format.TestDateTimeFormatterBuilder.test_printParseShortNameWithLookup(TestDateTimeFormatterBuilder.java:591)

test_printParseShortNameWithAutoLookup(org.joda.time.format.TestDateTimeFormatterBuilder)  Time elapsed: 0.002 sec  <<< ERROR!
java.lang.StringIndexOutOfBoundsException: String index out of range: 49
	at java.lang.String.substring(String.java:1907)
	at org.joda.time.format.FormatUtils.createErrorMessage(FormatUtils.java:128)
	at org.joda.time.format.DateTimeFormatter.parseDateTime(DateTimeFormatter.java:899)
	at org.joda.time.format.TestDateTimeFormatterBuilder.test_printParseShortNameWithAutoLookup(TestDateTimeFormatterBuilder.java:622)

test_printParseLongNameWithLookup(org.joda.time.format.TestDateTimeFormatterBuilder)  Time elapsed: 0 sec  <<< ERROR!
java.lang.StringIndexOutOfBoundsException: String index out of range: 49
	at java.lang.String.substring(String.java:1907)
	at org.joda.time.format.FormatUtils.createErrorMessage(FormatUtils.java:128)
	at org.joda.time.format.DateTimeFormatter.parseDateTime(DateTimeFormatter.java:899)
	at org.joda.time.format.TestDateTimeFormatterBuilder.test_printParseLongNameWithLookup(TestDateTimeFormatterBuilder.java:665)

testParsePeriod_simple(org.joda.time.format.TestPeriodFormatter)  Time elapsed: 0 sec  <<< ERROR!
java.lang.StringIndexOutOfBoundsException: String index out of range: 32
	at java.lang.String.substring(String.java:1907)
	at org.joda.time.format.FormatUtils.createErrorMessage(FormatUtils.java:128)
	at org.joda.time.format.PeriodFormatter.parseMutablePeriod(PeriodFormatter.java:330)
	at org.joda.time.format.PeriodFormatter.parsePeriod(PeriodFormatter.java:308)
	at org.joda.time.format.TestPeriodFormatter.testParsePeriod_simple(TestPeriodFormatter.java:192)

testParseMutablePeriod_simple(org.joda.time.format.TestPeriodFormatter)  Time elapsed: 0.001 sec  <<< ERROR!
java.lang.StringIndexOutOfBoundsException: String index out of range: 32
	at java.lang.String.substring(String.java:1907)
	at org.joda.time.format.FormatUtils.createErrorMessage(FormatUtils.java:128)
	at org.joda.time.format.PeriodFormatter.parseMutablePeriod(PeriodFormatter.java:330)
	at org.joda.time.format.TestPeriodFormatter.testParseMutablePeriod_simple(TestPeriodFormatter.java:212)

test_getDefault_checkRedundantSeparator(org.joda.time.format.TestPeriodFormat)  Time elapsed: 0.001 sec  <<< FAILURE!
junit.framework.AssertionFailedError: expected:<class java.lang.IllegalArgumentException> but was:<class java.lang.StringIndexOutOfBoundsException>
	at junit.framework.Assert.fail(Assert.java:47)
	at junit.framework.Assert.failNotEquals(Assert.java:280)
	at junit.framework.Assert.assertEquals(Assert.java:64)
	at junit.framework.Assert.assertEquals(Assert.java:71)
	at org.joda.time.format.TestPeriodFormat.test_getDefault_checkRedundantSeparator(TestPeriodFormat.java:112)

test_wordBased_ja_checkRedundantSeparator(org.joda.time.format.TestPeriodFormat)  Time elapsed: 0 sec  <<< FAILURE!
junit.framework.AssertionFailedError: expected:<class java.lang.IllegalArgumentException> but was:<class java.lang.StringIndexOutOfBoundsException>
	at junit.framework.Assert.fail(Assert.java:47)
	at junit.framework.Assert.failNotEquals(Assert.java:280)
	at junit.framework.Assert.assertEquals(Assert.java:64)
	at junit.framework.Assert.assertEquals(Assert.java:71)
	at org.joda.time.format.TestPeriodFormat.test_wordBased_ja_checkRedundantSeparator(TestPeriodFormat.java:371)

test_wordBased_pl_checkRedundantSeparator(org.joda.time.format.TestPeriodFormat)  Time elapsed: 0 sec  <<< FAILURE!
junit.framework.AssertionFailedError: expected:<class java.lang.IllegalArgumentException> but was:<class java.lang.StringIndexOutOfBoundsException>
	at junit.framework.Assert.fail(Assert.java:47)
	at junit.framework.Assert.failNotEquals(Assert.java:280)
	at junit.framework.Assert.assertEquals(Assert.java:64)
	at junit.framework.Assert.assertEquals(Assert.java:71)
	at org.joda.time.format.TestPeriodFormat.test_wordBased_pl_checkRedundantSeparator(TestPeriodFormat.java:413)

testParseStandardFail1(org.joda.time.format.TestISOPeriodFormatParsing)  Time elapsed: 0 sec  <<< ERROR!
java.lang.StringIndexOutOfBoundsException: String index out of range: 35
	at java.lang.String.substring(String.java:1907)
	at org.joda.time.format.FormatUtils.createErrorMessage(FormatUtils.java:128)
	at org.joda.time.format.PeriodFormatter.parseMutablePeriod(PeriodFormatter.java:330)
	at org.joda.time.format.PeriodFormatter.parsePeriod(PeriodFormatter.java:308)
	at org.joda.time.format.TestISOPeriodFormatParsing.testParseStandardFail1(TestISOPeriodFormatParsing.java:172)

testParseStandardFail2(org.joda.time.format.TestISOPeriodFormatParsing)  Time elapsed: 0.001 sec  <<< ERROR!
java.lang.StringIndexOutOfBoundsException: String index out of range: 33
	at java.lang.String.substring(String.java:1907)
	at org.joda.time.format.FormatUtils.createErrorMessage(FormatUtils.java:128)
	at org.joda.time.format.PeriodFormatter.parseMutablePeriod(PeriodFormatter.java:330)
	at org.joda.time.format.PeriodFormatter.parsePeriod(PeriodFormatter.java:308)
	at org.joda.time.format.TestISOPeriodFormatParsing.testParseStandardFail2(TestISOPeriodFormatParsing.java:181)

testParseStandardFail3(org.joda.time.format.TestISOPeriodFormatParsing)  Time elapsed: 0 sec  <<< ERROR!
java.lang.StringIndexOutOfBoundsException: String index out of range: 34
	at java.lang.String.substring(String.java:1907)
	at org.joda.time.format.FormatUtils.createErrorMessage(FormatUtils.java:128)
	at org.joda.time.format.PeriodFormatter.parseMutablePeriod(PeriodFormatter.java:330)
	at org.joda.time.format.PeriodFormatter.parsePeriod(PeriodFormatter.java:308)
	at org.joda.time.format.TestISOPeriodFormatParsing.testParseStandardFail3(TestISOPeriodFormatParsing.java:190)

testParseStandardFail4(org.joda.time.format.TestISOPeriodFormatParsing)  Time elapsed: 0.001 sec  <<< ERROR!
java.lang.StringIndexOutOfBoundsException: String index out of range: 33
	at java.lang.String.substring(String.java:1907)
	at org.joda.time.format.FormatUtils.createErrorMessage(FormatUtils.java:128)
	at org.joda.time.format.PeriodFormatter.parseMutablePeriod(PeriodFormatter.java:330)
	at org.joda.time.format.PeriodFormatter.parsePeriod(PeriodFormatter.java:308)
	at org.joda.time.format.TestISOPeriodFormatParsing.testParseStandardFail4(TestISOPeriodFormatParsing.java:199)


Results :

Failed tests: 
  org.joda.time.format.TestPeriodFormat#test_getDefault_checkRedundantSeparator AssertionFailedError
  org.joda.time.format.TestPeriodFormat#test_wordBased_ja_checkRedundantSeparator AssertionFailedError
  org.joda.time.format.TestPeriodFormat#test_wordBased_pl_checkRedundantSeparator AssertionFailedError
Tests in error: 
  org.joda.time.TestDateTimeComparator#testInvalidObj StringIndexOutOfBoundsException
  org.joda.time.TestDateTimeZone#testForID_String StringIndexOutOfBoundsException
  org.joda.time.TestDateTime_Constructors#testConstructor_ObjectStringEx1 StringIndexOutOfBoundsException
  org.joda.time.TestDateTime_Constructors#testConstructor_ObjectStringEx2 StringIndexOutOfBoundsException
  org.joda.time.TestLocalDateTime_Constructors#testConstructor_ObjectStringEx1 StringIndexOutOfBoundsException
  org.joda.time.TestLocalDateTime_Constructors#testConstructor_ObjectStringEx2 StringIndexOutOfBoundsException
  org.joda.time.TestLocalDateTime_Constructors#testConstructor_ObjectStringEx3 StringIndexOutOfBoundsException
  org.joda.time.TestLocalDateTime_Constructors#testConstructor_ObjectStringEx4 StringIndexOutOfBoundsException
  org.joda.time.TestLocalDateTime_Constructors#testConstructor_ObjectStringEx5 StringIndexOutOfBoundsException
  org.joda.time.TestLocalDateTime_Constructors#testConstructor_ObjectStringEx6 StringIndexOutOfBoundsException
  org.joda.time.TestLocalDate_Constructors#testConstructor_ObjectStringEx1 StringIndexOutOfBoundsException
  org.joda.time.TestLocalDate_Constructors#testConstructor_ObjectStringEx2 StringIndexOutOfBoundsException
  org.joda.time.TestLocalDate_Constructors#testConstructor_ObjectStringEx3 StringIndexOutOfBoundsException
  org.joda.time.TestLocalDate_Constructors#testConstructor_ObjectStringEx4 StringIndexOutOfBoundsException
  org.joda.time.TestLocalDate_Constructors#testConstructor_ObjectStringEx5 StringIndexOutOfBoundsException
  org.joda.time.TestLocalDate_Constructors#testConstructor_ObjectStringEx6 StringIndexOutOfBoundsException
  org.joda.time.TestLocalDate_Constructors#testConstructor_ObjectStringEx7 StringIndexOutOfBoundsException
  org.joda.time.TestLocalTime_Constructors#testConstructor_Object2_Chronology StringIndexOutOfBoundsException
  org.joda.time.TestLocalTime_Constructors#testConstructor_ObjectStringEx1 StringIndexOutOfBoundsException
  org.joda.time.TestLocalTime_Constructors#testConstructor_ObjectStringEx2 StringIndexOutOfBoundsException
  org.joda.time.TestLocalTime_Constructors#testConstructor_ObjectStringEx3 StringIndexOutOfBoundsException
  org.joda.time.TestLocalTime_Constructors#testConstructor_ObjectStringEx4 StringIndexOutOfBoundsException
  org.joda.time.TestLocalTime_Constructors#testConstructor_ObjectStringEx5 StringIndexOutOfBoundsException
  org.joda.time.TestLocalTime_Constructors#testConstructor_ObjectStringEx6 StringIndexOutOfBoundsException
  org.joda.time.TestMonthDay_Constructors#testConstructor_ObjectStringEx1 StringIndexOutOfBoundsException
  org.joda.time.TestMonthDay_Constructors#testConstructor_ObjectStringEx2 StringIndexOutOfBoundsException
  org.joda.time.TestMonthDay_Constructors#testConstructor_ObjectStringEx3 StringIndexOutOfBoundsException
  org.joda.time.TestMonthDay_Constructors#testConstructor_ObjectStringEx4 StringIndexOutOfBoundsException
  org.joda.time.TestTimeOfDay_Constructors#testConstructor2_Object_Chronology StringIndexOutOfBoundsException
  org.joda.time.TestTimeOfDay_Constructors#testConstructor_ObjectStringEx1 StringIndexOutOfBoundsException
  org.joda.time.TestTimeOfDay_Constructors#testConstructor_ObjectStringEx2 StringIndexOutOfBoundsException
  org.joda.time.TestTimeOfDay_Constructors#testConstructor_ObjectStringEx3 StringIndexOutOfBoundsException
  org.joda.time.TestTimeOfDay_Constructors#testConstructor_ObjectStringEx4 StringIndexOutOfBoundsException
  org.joda.time.TestYearMonthDay_Constructors#testConstructor_ObjectStringEx1 StringIndexOutOfBoundsException
  org.joda.time.TestYearMonthDay_Constructors#testConstructor_ObjectStringEx2 StringIndexOutOfBoundsException
  org.joda.time.TestYearMonthDay_Constructors#testConstructor_ObjectStringEx3 StringIndexOutOfBoundsException
  org.joda.time.TestYearMonthDay_Constructors#testConstructor_ObjectStringEx4 StringIndexOutOfBoundsException
  org.joda.time.TestYearMonth_Constructors#testConstructor_ObjectStringEx1 StringIndexOutOfBoundsException
  org.joda.time.TestYearMonth_Constructors#testConstructor_ObjectStringEx2 StringIndexOutOfBoundsException
  org.joda.time.TestYearMonth_Constructors#testConstructor_ObjectStringEx3 StringIndexOutOfBoundsException
  org.joda.time.TestYearMonth_Constructors#testConstructor_ObjectStringEx4 StringIndexOutOfBoundsException
  org.joda.time.convert.TestStringConverter#testGetInstantMillisInvalid StringIndexOutOfBoundsException
  org.joda.time.convert.TestStringConverter#testSetIntoPeriod_Object8 StringIndexOutOfBoundsException
  org.joda.time.format.TestDateTimeFormat#testFormatParse_textYear_France StringIndexOutOfBoundsException
  org.joda.time.format.TestDateTimeFormat#testFormatParse_textYear_UK StringIndexOutOfBoundsException
  org.joda.time.format.TestDateTimeFormat#testFormat_shortBasicParse StringIndexOutOfBoundsException
  org.joda.time.format.TestDateTimeFormat#testFormat_weekyearOfEra_twoDigit StringIndexOutOfBoundsException
  org.joda.time.format.TestDateTimeFormat#testFormat_year StringIndexOutOfBoundsException
  org.joda.time.format.TestDateTimeFormat#testFormat_yearOfEra_twoDigit StringIndexOutOfBoundsException
  org.joda.time.format.TestDateTimeFormat#testFormat_year_twoDigit StringIndexOutOfBoundsException
  org.joda.time.format.TestDateTimeFormatter#testParseDateTime_simple StringIndexOutOfBoundsException
  org.joda.time.format.TestDateTimeFormatter#testParseLocalDateTime_simple StringIndexOutOfBoundsException
  org.joda.time.format.TestDateTimeFormatter#testParseLocalDate_simple StringIndexOutOfBoundsException
  org.joda.time.format.TestDateTimeFormatter#testParseLocalTime_simple StringIndexOutOfBoundsException
  org.joda.time.format.TestDateTimeFormatter#testParseMutableDateTime_simple StringIndexOutOfBoundsException
  org.joda.time.format.TestDateTimeFormatterBuilder#test_appendFixedDecimal StringIndexOutOfBoundsException
  org.joda.time.format.TestDateTimeFormatterBuilder#test_appendFixedSignedDecimal StringIndexOutOfBoundsException
  org.joda.time.format.TestDateTimeFormatterBuilder#test_appendTimeZoneId StringIndexOutOfBoundsException
  org.joda.time.format.TestDateTimeFormatterBuilder#test_appendTimeZoneOffset_invalidText StringIndexOutOfBoundsException
  org.joda.time.format.TestDateTimeFormatterBuilder#test_printParseLongNameWithLookup StringIndexOutOfBoundsException
  org.joda.time.format.TestDateTimeFormatterBuilder#test_printParseShortNameWithAutoLookup StringIndexOutOfBoundsException
  org.joda.time.format.TestDateTimeFormatterBuilder#test_printParseShortNameWithLookup StringIndexOutOfBoundsException
  org.joda.time.format.TestISODateTimeFormatParsing#test_basicDate StringIndexOutOfBoundsException
  org.joda.time.format.TestISODateTimeFormatParsing#test_basicDateTime StringIndexOutOfBoundsException
  org.joda.time.format.TestISODateTimeFormatParsing#test_basicDateTimeNoMillis StringIndexOutOfBoundsException
  org.joda.time.format.TestISODateTimeFormatParsing#test_basicOrdinalDate StringIndexOutOfBoundsException
  org.joda.time.format.TestISODateTimeFormatParsing#test_basicOrdinalDateTime StringIndexOutOfBoundsException
  org.joda.time.format.TestISODateTimeFormatParsing#test_basicOrdinalDateTimeNoMillis StringIndexOutOfBoundsException
  org.joda.time.format.TestISODateTimeFormatParsing#test_basicTTime StringIndexOutOfBoundsException
  org.joda.time.format.TestISODateTimeFormatParsing#test_basicTTimeNoMillis StringIndexOutOfBoundsException
  org.joda.time.format.TestISODateTimeFormatParsing#test_basicTime StringIndexOutOfBoundsException
  org.joda.time.format.TestISODateTimeFormatParsing#test_basicTimeNoMillis StringIndexOutOfBoundsException
  org.joda.time.format.TestISODateTimeFormatParsing#test_basicWeekDate StringIndexOutOfBoundsException
  org.joda.time.format.TestISODateTimeFormatParsing#test_basicWeekDateTime StringIndexOutOfBoundsException
  org.joda.time.format.TestISODateTimeFormatParsing#test_basicWeekDateTimeNoMillis StringIndexOutOfBoundsException
  org.joda.time.format.TestISODateTimeFormatParsing#test_date StringIndexOutOfBoundsException
  org.joda.time.format.TestISODateTimeFormatParsing#test_dateElementParser StringIndexOutOfBoundsException
  org.joda.time.format.TestISODateTimeFormatParsing#test_dateOptionalTimeParser StringIndexOutOfBoundsException
  org.joda.time.format.TestISODateTimeFormatParsing#test_dateParser StringIndexOutOfBoundsException
  org.joda.time.format.TestISODateTimeFormatParsing#test_dateTime StringIndexOutOfBoundsException
  org.joda.time.format.TestISODateTimeFormatParsing#test_dateTimeNoMillis StringIndexOutOfBoundsException
  org.joda.time.format.TestISODateTimeFormatParsing#test_dateTimeParser StringIndexOutOfBoundsException
  org.joda.time.format.TestISODateTimeFormatParsing#test_hourMinute StringIndexOutOfBoundsException
  org.joda.time.format.TestISODateTimeFormatParsing#test_hourMinuteSecond StringIndexOutOfBoundsException
  org.joda.time.format.TestISODateTimeFormatParsing#test_hourMinuteSecondFraction StringIndexOutOfBoundsException
  org.joda.time.format.TestISODateTimeFormatParsing#test_hourMinuteSecondMillis StringIndexOutOfBoundsException
  org.joda.time.format.TestISODateTimeFormatParsing#test_localDateOptionalTimeParser StringIndexOutOfBoundsException
  org.joda.time.format.TestISODateTimeFormatParsing#test_localDateParser StringIndexOutOfBoundsException
  org.joda.time.format.TestISODateTimeFormatParsing#test_localTimeParser StringIndexOutOfBoundsException
  org.joda.time.format.TestISODateTimeFormatParsing#test_ordinalDate StringIndexOutOfBoundsException
  org.joda.time.format.TestISODateTimeFormatParsing#test_ordinalDateTime StringIndexOutOfBoundsException
  org.joda.time.format.TestISODateTimeFormatParsing#test_ordinalDateTimeNoMillis StringIndexOutOfBoundsException
  org.joda.time.format.TestISODateTimeFormatParsing#test_tTime StringIndexOutOfBoundsException
  org.joda.time.format.TestISODateTimeFormatParsing#test_tTimeNoMillis StringIndexOutOfBoundsException
  org.joda.time.format.TestISODateTimeFormatParsing#test_time StringIndexOutOfBoundsException
  org.joda.time.format.TestISODateTimeFormatParsing#test_timeElementParser StringIndexOutOfBoundsException
  org.joda.time.format.TestISODateTimeFormatParsing#test_timeNoMillis StringIndexOutOfBoundsException
  org.joda.time.format.TestISODateTimeFormatParsing#test_timeParser StringIndexOutOfBoundsException
  org.joda.time.format.TestISODateTimeFormatParsing#test_weekDate StringIndexOutOfBoundsException
  org.joda.time.format.TestISODateTimeFormatParsing#test_weekDateTime StringIndexOutOfBoundsException
  org.joda.time.format.TestISODateTimeFormatParsing#test_weekDateTimeNoMillis StringIndexOutOfBoundsException
  org.joda.time.format.TestISOPeriodFormatParsing#testParseStandardFail1 StringIndexOutOfBoundsException
  org.joda.time.format.TestISOPeriodFormatParsing#testParseStandardFail2 StringIndexOutOfBoundsException
  org.joda.time.format.TestISOPeriodFormatParsing#testParseStandardFail3 StringIndexOutOfBoundsException
  org.joda.time.format.TestISOPeriodFormatParsing#testParseStandardFail4 StringIndexOutOfBoundsException
  org.joda.time.format.TestPeriodFormatter#testParseMutablePeriod_simple StringIndexOutOfBoundsException
  org.joda.time.format.TestPeriodFormatter#testParsePeriod_simple StringIndexOutOfBoundsException

Tests run: 4157, Failures: 3, Errors: 107, Skipped: 0

[INFO] ------------------------------------------------------------------------
[INFO] BUILD FAILURE
[INFO] ------------------------------------------------------------------------
[INFO] Total time: 15.764s
[INFO] Finished at: Thu Aug 06 09:16:37 BST 2015
[INFO] Final Memory: 9M/213M
[INFO] ------------------------------------------------------------------------
[ERROR] Failed to execute goal org.apache.maven.plugins:maven-surefire-plugin:2.18.1:test (default-test) on project joda-time: There are test failures.
[ERROR] 
[ERROR] Please refer to /home/perham/Study/LittleDarwin/Cases/joda-time-2.8.1/target/surefire-reports for the individual test results.
[ERROR] -> [Help 1]
[ERROR] 
[ERROR] To see the full stack trace of the errors, re-run Maven with the -e switch.
[ERROR] Re-run Maven using the -X switch to enable full debug logging.
[ERROR] 
[ERROR] For more information about the errors and possible solutions, please read the following articles:
[ERROR] [Help 1] http://cwiki.apache.org/confluence/display/MAVEN/MojoFailureException
