[INFO] Scanning for projects...
[INFO]                                                                         
[INFO] ------------------------------------------------------------------------
[INFO] Building Joda-Time 2.8.1
[INFO] ------------------------------------------------------------------------
[INFO] 
[INFO] --- maven-resources-plugin:2.7:resources (default-resources) @ joda-time ---
[INFO] Using 'UTF-8' encoding to copy filtered resources.
[INFO] Copying 2 resources to META-INF
[INFO] Copying 10 resources
[INFO] 
[INFO] --- maven-compiler-plugin:3.3:compile (default-compile) @ joda-time ---
[INFO] Changes detected - recompiling the module!
[INFO] Compiling 166 source files to /home/perham/Study/LittleDarwin/Cases/joda-time-2.8.1/target/classes
[INFO] 
[INFO] --- exec-maven-plugin:1.4.0:java (compile-tzdb) @ joda-time ---
Writing zoneinfo files
Writing ZoneInfoMap
[INFO] 
[INFO] --- maven-resources-plugin:2.7:testResources (default-testResources) @ joda-time ---
[INFO] Using 'UTF-8' encoding to copy filtered resources.
[INFO] Copying 34 resources
[INFO] 
[INFO] --- maven-compiler-plugin:3.3:testCompile (default-testCompile) @ joda-time ---
[INFO] Nothing to compile - all classes are up to date
[INFO] 
[INFO] --- maven-surefire-plugin:2.18.1:test (default-test) @ joda-time ---
[INFO] Surefire report directory: /home/perham/Study/LittleDarwin/Cases/joda-time-2.8.1/target/surefire-reports

-------------------------------------------------------
 T E S T S
-------------------------------------------------------
Running org.joda.time.TestAllPackages

TestBuddhistChronology.testCalendar

TestCopticChronology.testCalendar

TestEthiopicChronology.testCalendar

TestIslamicChronology.testCalendar

Testing Gregorian chronology over 1000 iterations
100% complete (i=1000)

Testing Julian chronology over 1000 iterations
100% complete (i=1000)
Writing zoneinfo files
Writing ZoneInfoMap
Tests run: 4157, Failures: 0, Errors: 11, Skipped: 0, Time elapsed: 34.057 sec <<< FAILURE! - in org.joda.time.TestAllPackages
testForOffsetMillis_int(org.joda.time.TestDateTimeZone)  Time elapsed: 9.208 sec  <<< ERROR!
java.lang.OutOfMemoryError: Java heap space
	at java.util.Arrays.copyOf(Arrays.java:2367)
	at java.lang.AbstractStringBuilder.expandCapacity(AbstractStringBuilder.java:130)
	at java.lang.AbstractStringBuilder.ensureCapacityInternal(AbstractStringBuilder.java:114)
	at java.lang.AbstractStringBuilder.append(AbstractStringBuilder.java:587)
	at java.lang.StringBuffer.append(StringBuffer.java:332)
	at java.lang.StringBuffer.append(StringBuffer.java:83)
	at org.joda.time.format.FormatUtils.appendPaddedInteger(FormatUtils.java:26)
	at org.joda.time.format.FormatUtils.appendPaddedInteger(FormatUtils.java:12)
	at org.joda.time.DateTimeZone.printOffset(DateTimeZone.java:654)
	at org.joda.time.DateTimeZone.forID(DateTimeZone.java:225)
	at org.joda.time.TestDateTimeZone.testForOffsetMillis_int(TestDateTimeZone.java:350)

testForFields_time_HMSm(org.joda.time.format.TestISODateTimeFormat_Fields)  Time elapsed: 1.291 sec  <<< ERROR!
java.lang.OutOfMemoryError: Java heap space
	at java.util.Arrays.copyOf(Arrays.java:2367)
	at java.lang.AbstractStringBuilder.expandCapacity(AbstractStringBuilder.java:130)
	at java.lang.AbstractStringBuilder.ensureCapacityInternal(AbstractStringBuilder.java:114)
	at java.lang.AbstractStringBuilder.append(AbstractStringBuilder.java:587)
	at java.lang.StringBuilder.append(StringBuilder.java:214)
	at java.lang.StringBuilder.append(StringBuilder.java:72)
	at org.joda.time.format.FormatUtils.appendPaddedInteger(FormatUtils.java:26)
	at org.joda.time.format.DateTimeFormatterBuilder$PaddedNumber.printTo(DateTimeFormatterBuilder.java:1436)
	at org.joda.time.format.DateTimeFormatterBuilder$Composite.printTo(DateTimeFormatterBuilder.java:2446)
	at org.joda.time.format.DateTimeFormatter.printTo(DateTimeFormatter.java:609)
	at org.joda.time.format.DateTimeFormatter.print(DateTimeFormatter.java:663)
	at org.joda.time.format.TestISODateTimeFormat_Fields.testForFields_time_HMSm(TestISODateTimeFormat_Fields.java:608)

testForFields_time_MSm(org.joda.time.format.TestISODateTimeFormat_Fields)  Time elapsed: 2.029 sec  <<< ERROR!
java.lang.OutOfMemoryError: Java heap space
	at java.util.Arrays.copyOf(Arrays.java:2367)
	at java.lang.AbstractStringBuilder.expandCapacity(AbstractStringBuilder.java:130)
	at java.lang.AbstractStringBuilder.ensureCapacityInternal(AbstractStringBuilder.java:114)
	at java.lang.AbstractStringBuilder.append(AbstractStringBuilder.java:587)
	at java.lang.StringBuilder.append(StringBuilder.java:214)
	at java.lang.StringBuilder.append(StringBuilder.java:72)
	at org.joda.time.format.FormatUtils.appendPaddedInteger(FormatUtils.java:26)
	at org.joda.time.format.DateTimeFormatterBuilder$PaddedNumber.printTo(DateTimeFormatterBuilder.java:1436)
	at org.joda.time.format.DateTimeFormatterBuilder$Composite.printTo(DateTimeFormatterBuilder.java:2446)
	at org.joda.time.format.DateTimeFormatter.printTo(DateTimeFormatter.java:609)
	at org.joda.time.format.DateTimeFormatter.print(DateTimeFormatter.java:663)
	at org.joda.time.format.TestISODateTimeFormat_Fields.testForFields_time_MSm(TestISODateTimeFormat_Fields.java:721)

testForFields_time_Sm(org.joda.time.format.TestISODateTimeFormat_Fields)  Time elapsed: 1.911 sec  <<< ERROR!
java.lang.OutOfMemoryError: Java heap space
	at java.util.Arrays.copyOf(Arrays.java:2367)
	at java.lang.AbstractStringBuilder.expandCapacity(AbstractStringBuilder.java:130)
	at java.lang.AbstractStringBuilder.ensureCapacityInternal(AbstractStringBuilder.java:114)
	at java.lang.AbstractStringBuilder.append(AbstractStringBuilder.java:587)
	at java.lang.StringBuilder.append(StringBuilder.java:214)
	at java.lang.StringBuilder.append(StringBuilder.java:72)
	at org.joda.time.format.FormatUtils.appendPaddedInteger(FormatUtils.java:26)
	at org.joda.time.format.DateTimeFormatterBuilder$PaddedNumber.printTo(DateTimeFormatterBuilder.java:1436)
	at org.joda.time.format.DateTimeFormatterBuilder$Composite.printTo(DateTimeFormatterBuilder.java:2446)
	at org.joda.time.format.DateTimeFormatter.printTo(DateTimeFormatter.java:609)
	at org.joda.time.format.DateTimeFormatter.print(DateTimeFormatter.java:663)
	at org.joda.time.format.TestISODateTimeFormat_Fields.testForFields_time_Sm(TestISODateTimeFormat_Fields.java:804)

testForFields_time_m(org.joda.time.format.TestISODateTimeFormat_Fields)  Time elapsed: 1.73 sec  <<< ERROR!
java.lang.OutOfMemoryError: Java heap space

testForFields_time_Hm(org.joda.time.format.TestISODateTimeFormat_Fields)  Time elapsed: 1.899 sec  <<< ERROR!
java.lang.OutOfMemoryError: Java heap space

testForFields_time_Mm(org.joda.time.format.TestISODateTimeFormat_Fields)  Time elapsed: 1.865 sec  <<< ERROR!
java.lang.OutOfMemoryError: Java heap space

testForFields_time_HSm(org.joda.time.format.TestISODateTimeFormat_Fields)  Time elapsed: 2.054 sec  <<< ERROR!
java.lang.OutOfMemoryError: Java heap space

testForFields_time_HMm(org.joda.time.format.TestISODateTimeFormat_Fields)  Time elapsed: 2.268 sec  <<< ERROR!
java.lang.OutOfMemoryError: Java heap space

test_appendFixedDecimal(org.joda.time.format.TestDateTimeFormatterBuilder)  Time elapsed: 2.224 sec  <<< ERROR!
java.lang.OutOfMemoryError: Java heap space

test_appendFixedSignedDecimal(org.joda.time.format.TestDateTimeFormatterBuilder)  Time elapsed: 2.192 sec  <<< ERROR!
java.lang.OutOfMemoryError: Java heap space


Results :

Tests in error: 
  org.joda.time.TestDateTimeZone#testForOffsetMillis_int OutOfMemoryError Java h...
  org.joda.time.format.TestDateTimeFormatterBuilder#test_appendFixedDecimal OutOfMemoryError
  org.joda.time.format.TestDateTimeFormatterBuilder#test_appendFixedSignedDecimal OutOfMemoryError
  org.joda.time.format.TestISODateTimeFormat_Fields#testForFields_time_HMSm OutOfMemoryError
  org.joda.time.format.TestISODateTimeFormat_Fields#testForFields_time_HMm OutOfMemoryError
  org.joda.time.format.TestISODateTimeFormat_Fields#testForFields_time_HSm OutOfMemoryError
  org.joda.time.format.TestISODateTimeFormat_Fields#testForFields_time_Hm OutOfMemoryError
  org.joda.time.format.TestISODateTimeFormat_Fields#testForFields_time_MSm OutOfMemoryError
  org.joda.time.format.TestISODateTimeFormat_Fields#testForFields_time_Mm OutOfMemoryError
  org.joda.time.format.TestISODateTimeFormat_Fields#testForFields_time_Sm OutOfMemoryError
  org.joda.time.format.TestISODateTimeFormat_Fields#testForFields_time_m OutOfMemoryError

Tests run: 4157, Failures: 0, Errors: 11, Skipped: 0

[INFO] ------------------------------------------------------------------------
[INFO] BUILD FAILURE
[INFO] ------------------------------------------------------------------------
[INFO] Total time: 44.149s
[INFO] Finished at: Thu Aug 06 09:07:38 BST 2015
[INFO] Final Memory: 8M/216M
[INFO] ------------------------------------------------------------------------
[ERROR] Failed to execute goal org.apache.maven.plugins:maven-surefire-plugin:2.18.1:test (default-test) on project joda-time: There are test failures.
[ERROR] 
[ERROR] Please refer to /home/perham/Study/LittleDarwin/Cases/joda-time-2.8.1/target/surefire-reports for the individual test results.
[ERROR] -> [Help 1]
[ERROR] 
[ERROR] To see the full stack trace of the errors, re-run Maven with the -e switch.
[ERROR] Re-run Maven using the -X switch to enable full debug logging.
[ERROR] 
[ERROR] For more information about the errors and possible solutions, please read the following articles:
[ERROR] [Help 1] http://cwiki.apache.org/confluence/display/MAVEN/MojoFailureException
