[INFO] Scanning for projects...
[INFO]                                                                         
[INFO] ------------------------------------------------------------------------
[INFO] Building Joda-Time 2.8.1
[INFO] ------------------------------------------------------------------------
[INFO] 
[INFO] --- maven-resources-plugin:2.7:resources (default-resources) @ joda-time ---
[INFO] Using 'UTF-8' encoding to copy filtered resources.
[INFO] Copying 2 resources to META-INF
[INFO] Copying 10 resources
[INFO] 
[INFO] --- maven-compiler-plugin:3.3:compile (default-compile) @ joda-time ---
[INFO] Changes detected - recompiling the module!
[INFO] Compiling 166 source files to /home/perham/Study/LittleDarwin/Cases/joda-time-2.8.1/target/classes
[INFO] 
[INFO] --- exec-maven-plugin:1.4.0:java (compile-tzdb) @ joda-time ---
Writing zoneinfo files
Writing ZoneInfoMap
[INFO] 
[INFO] --- maven-resources-plugin:2.7:testResources (default-testResources) @ joda-time ---
[INFO] Using 'UTF-8' encoding to copy filtered resources.
[INFO] Copying 34 resources
[INFO] 
[INFO] --- maven-compiler-plugin:3.3:testCompile (default-testCompile) @ joda-time ---
[INFO] Nothing to compile - all classes are up to date
[INFO] 
[INFO] --- maven-surefire-plugin:2.18.1:test (default-test) @ joda-time ---
[INFO] Surefire report directory: /home/perham/Study/LittleDarwin/Cases/joda-time-2.8.1/target/surefire-reports

-------------------------------------------------------
 T E S T S
-------------------------------------------------------
Running org.joda.time.TestAllPackages

TestBuddhistChronology.testCalendar

TestCopticChronology.testCalendar

TestEthiopicChronology.testCalendar

TestIslamicChronology.testCalendar

Testing Gregorian chronology over 1000 iterations
100% complete (i=1000)

Testing Julian chronology over 1000 iterations
100% complete (i=1000)
Writing zoneinfo files
Writing ZoneInfoMap
Tests run: 4157, Failures: 0, Errors: 9, Skipped: 0, Time elapsed: 26.977 sec <<< FAILURE! - in org.joda.time.TestAllPackages
testFormat_centuryOfEra(org.joda.time.format.TestDateTimeFormat)  Time elapsed: 1.649 sec  <<< ERROR!
java.lang.OutOfMemoryError: Java heap space
	at java.util.Arrays.copyOf(Arrays.java:2367)
	at java.lang.AbstractStringBuilder.expandCapacity(AbstractStringBuilder.java:130)
	at java.lang.AbstractStringBuilder.ensureCapacityInternal(AbstractStringBuilder.java:114)
	at java.lang.AbstractStringBuilder.append(AbstractStringBuilder.java:587)
	at java.lang.StringBuilder.append(StringBuilder.java:214)
	at java.lang.StringBuilder.append(StringBuilder.java:72)
	at org.joda.time.format.FormatUtils.appendPaddedInteger(FormatUtils.java:36)
	at org.joda.time.format.DateTimeFormatterBuilder$PaddedNumber.printTo(DateTimeFormatterBuilder.java:1427)
	at org.joda.time.format.DateTimeFormatterBuilder$Composite.printTo(DateTimeFormatterBuilder.java:2429)
	at org.joda.time.format.DateTimeFormatter.printTo(DateTimeFormatter.java:684)
	at org.joda.time.format.DateTimeFormatter.printTo(DateTimeFormatter.java:521)
	at org.joda.time.format.DateTimeFormatter.print(DateTimeFormatter.java:625)
	at org.joda.time.base.AbstractInstant.toString(AbstractInstant.java:424)
	at org.joda.time.base.AbstractDateTime.toString(AbstractDateTime.java:314)
	at org.joda.time.format.TestDateTimeFormat.testFormat_centuryOfEra(TestDateTimeFormat.java:124)

testFormat_yearOfEra(org.joda.time.format.TestDateTimeFormat)  Time elapsed: 2.742 sec  <<< ERROR!
java.lang.OutOfMemoryError: Java heap space
	at java.util.Arrays.copyOf(Arrays.java:2367)
	at java.lang.AbstractStringBuilder.expandCapacity(AbstractStringBuilder.java:130)
	at java.lang.AbstractStringBuilder.ensureCapacityInternal(AbstractStringBuilder.java:114)
	at java.lang.AbstractStringBuilder.append(AbstractStringBuilder.java:587)
	at java.lang.StringBuilder.append(StringBuilder.java:214)
	at java.lang.StringBuilder.append(StringBuilder.java:72)
	at org.joda.time.format.FormatUtils.appendPaddedInteger(FormatUtils.java:36)
	at org.joda.time.format.DateTimeFormatterBuilder$PaddedNumber.printTo(DateTimeFormatterBuilder.java:1427)
	at org.joda.time.format.DateTimeFormatterBuilder$Composite.printTo(DateTimeFormatterBuilder.java:2429)
	at org.joda.time.format.DateTimeFormatter.printTo(DateTimeFormatter.java:684)
	at org.joda.time.format.DateTimeFormatter.printTo(DateTimeFormatter.java:521)
	at org.joda.time.format.DateTimeFormatter.print(DateTimeFormatter.java:625)
	at org.joda.time.base.AbstractInstant.toString(AbstractInstant.java:424)
	at org.joda.time.base.AbstractDateTime.toString(AbstractDateTime.java:314)
	at org.joda.time.format.TestDateTimeFormat.testFormat_yearOfEra(TestDateTimeFormat.java:140)

testFormat_yearOfEra_twoDigit(org.joda.time.format.TestDateTimeFormat)  Time elapsed: 2.785 sec  <<< ERROR!
java.lang.OutOfMemoryError: Java heap space
	at java.util.Arrays.copyOf(Arrays.java:2367)
	at java.lang.AbstractStringBuilder.expandCapacity(AbstractStringBuilder.java:130)
	at java.lang.AbstractStringBuilder.ensureCapacityInternal(AbstractStringBuilder.java:114)
	at java.lang.AbstractStringBuilder.append(AbstractStringBuilder.java:587)
	at java.lang.StringBuilder.append(StringBuilder.java:214)
	at java.lang.StringBuilder.append(StringBuilder.java:72)
	at org.joda.time.format.FormatUtils.appendPaddedInteger(FormatUtils.java:36)
	at org.joda.time.format.DateTimeFormatterBuilder$PaddedNumber.printTo(DateTimeFormatterBuilder.java:1427)
	at org.joda.time.format.DateTimeFormatterBuilder$Composite.printTo(DateTimeFormatterBuilder.java:2429)
	at org.joda.time.format.DateTimeFormatter.printTo(DateTimeFormatter.java:684)
	at org.joda.time.format.DateTimeFormatter.printTo(DateTimeFormatter.java:521)
	at org.joda.time.format.DateTimeFormatter.print(DateTimeFormatter.java:625)
	at org.joda.time.base.AbstractInstant.toString(AbstractInstant.java:424)
	at org.joda.time.base.AbstractDateTime.toString(AbstractDateTime.java:314)
	at org.joda.time.format.TestDateTimeFormat.testFormat_yearOfEra_twoDigit(TestDateTimeFormat.java:149)

testFormat_year(org.joda.time.format.TestDateTimeFormat)  Time elapsed: 2.738 sec  <<< ERROR!
java.lang.OutOfMemoryError: Java heap space
	at java.util.Arrays.copyOf(Arrays.java:2367)
	at java.lang.AbstractStringBuilder.expandCapacity(AbstractStringBuilder.java:130)
	at java.lang.AbstractStringBuilder.ensureCapacityInternal(AbstractStringBuilder.java:114)
	at java.lang.AbstractStringBuilder.append(AbstractStringBuilder.java:587)
	at java.lang.StringBuilder.append(StringBuilder.java:214)
	at java.lang.StringBuilder.append(StringBuilder.java:72)
	at org.joda.time.format.FormatUtils.appendPaddedInteger(FormatUtils.java:36)
	at org.joda.time.format.DateTimeFormatterBuilder$PaddedNumber.printTo(DateTimeFormatterBuilder.java:1427)
	at org.joda.time.format.DateTimeFormatterBuilder$Composite.printTo(DateTimeFormatterBuilder.java:2429)
	at org.joda.time.format.DateTimeFormatter.printTo(DateTimeFormatter.java:684)
	at org.joda.time.format.DateTimeFormatter.printTo(DateTimeFormatter.java:521)
	at org.joda.time.format.DateTimeFormatter.print(DateTimeFormatter.java:625)
	at org.joda.time.base.AbstractInstant.toString(AbstractInstant.java:424)
	at org.joda.time.base.AbstractDateTime.toString(AbstractDateTime.java:314)
	at org.joda.time.format.TestDateTimeFormat.testFormat_year(TestDateTimeFormat.java:221)

testFormat_year_twoDigit(org.joda.time.format.TestDateTimeFormat)  Time elapsed: 2.78 sec  <<< ERROR!
java.lang.OutOfMemoryError: Java heap space

testFormat_weekyear(org.joda.time.format.TestDateTimeFormat)  Time elapsed: 2.81 sec  <<< ERROR!
java.lang.OutOfMemoryError: Java heap space

testFormat_weekyearOfEra_twoDigit(org.joda.time.format.TestDateTimeFormat)  Time elapsed: 2.73 sec  <<< ERROR!
java.lang.OutOfMemoryError: Java heap space

test_appendFixedDecimal(org.joda.time.format.TestDateTimeFormatterBuilder)  Time elapsed: 1.72 sec  <<< ERROR!
java.lang.OutOfMemoryError: Java heap space

test_appendFixedSignedDecimal(org.joda.time.format.TestDateTimeFormatterBuilder)  Time elapsed: 1.635 sec  <<< ERROR!
java.lang.OutOfMemoryError: Java heap space


Results :

Tests in error: 
  org.joda.time.format.TestDateTimeFormat#testFormat_centuryOfEra OutOfMemoryError
  org.joda.time.format.TestDateTimeFormat#testFormat_weekyear OutOfMemoryError J...
  org.joda.time.format.TestDateTimeFormat#testFormat_weekyearOfEra_twoDigit OutOfMemoryError
  org.joda.time.format.TestDateTimeFormat#testFormat_year OutOfMemoryError Java ...
  org.joda.time.format.TestDateTimeFormat#testFormat_yearOfEra OutOfMemoryError ...
  org.joda.time.format.TestDateTimeFormat#testFormat_yearOfEra_twoDigit OutOfMemoryError
  org.joda.time.format.TestDateTimeFormat#testFormat_year_twoDigit OutOfMemoryError
  org.joda.time.format.TestDateTimeFormatterBuilder#test_appendFixedDecimal OutOfMemoryError
  org.joda.time.format.TestDateTimeFormatterBuilder#test_appendFixedSignedDecimal OutOfMemoryError

Tests run: 4157, Failures: 0, Errors: 9, Skipped: 0

[INFO] ------------------------------------------------------------------------
[INFO] BUILD FAILURE
[INFO] ------------------------------------------------------------------------
[INFO] Total time: 37.422s
[INFO] Finished at: Thu Aug 06 09:06:52 BST 2015
[INFO] Final Memory: 9M/213M
[INFO] ------------------------------------------------------------------------
[ERROR] Failed to execute goal org.apache.maven.plugins:maven-surefire-plugin:2.18.1:test (default-test) on project joda-time: There are test failures.
[ERROR] 
[ERROR] Please refer to /home/perham/Study/LittleDarwin/Cases/joda-time-2.8.1/target/surefire-reports for the individual test results.
[ERROR] -> [Help 1]
[ERROR] 
[ERROR] To see the full stack trace of the errors, re-run Maven with the -e switch.
[ERROR] Re-run Maven using the -X switch to enable full debug logging.
[ERROR] 
[ERROR] For more information about the errors and possible solutions, please read the following articles:
[ERROR] [Help 1] http://cwiki.apache.org/confluence/display/MAVEN/MojoFailureException
