[INFO] Scanning for projects...
[INFO]                                                                         
[INFO] ------------------------------------------------------------------------
[INFO] Building Joda-Time 2.8.1
[INFO] ------------------------------------------------------------------------
[INFO] 
[INFO] --- maven-resources-plugin:2.7:resources (default-resources) @ joda-time ---
[INFO] Using 'UTF-8' encoding to copy filtered resources.
[INFO] Copying 2 resources to META-INF
[INFO] Copying 10 resources
[INFO] 
[INFO] --- maven-compiler-plugin:3.3:compile (default-compile) @ joda-time ---
[INFO] Changes detected - recompiling the module!
[INFO] Compiling 166 source files to /home/perham/Study/LittleDarwin/Cases/joda-time-2.8.1/target/classes
[INFO] 
[INFO] --- exec-maven-plugin:1.4.0:java (compile-tzdb) @ joda-time ---
Writing zoneinfo files
Writing ZoneInfoMap
[INFO] 
[INFO] --- maven-resources-plugin:2.7:testResources (default-testResources) @ joda-time ---
[INFO] Using 'UTF-8' encoding to copy filtered resources.
[INFO] Copying 34 resources
[INFO] 
[INFO] --- maven-compiler-plugin:3.3:testCompile (default-testCompile) @ joda-time ---
[INFO] Nothing to compile - all classes are up to date
[INFO] 
[INFO] --- maven-surefire-plugin:2.18.1:test (default-test) @ joda-time ---
[INFO] Surefire report directory: /home/perham/Study/LittleDarwin/Cases/joda-time-2.8.1/target/surefire-reports

-------------------------------------------------------
 T E S T S
-------------------------------------------------------
Running org.joda.time.TestAllPackages

TestBuddhistChronology.testCalendar

TestCopticChronology.testCalendar

TestEthiopicChronology.testCalendar

TestIslamicChronology.testCalendar

Testing Gregorian chronology over 1000 iterations
100% complete (i=1000)

Testing Julian chronology over 1000 iterations
100% complete (i=1000)
Writing zoneinfo files
Writing ZoneInfoMap
Tests run: 4157, Failures: 18, Errors: 0, Skipped: 0, Time elapsed: 5.306 sec <<< FAILURE! - in org.joda.time.TestAllPackages
testConstructor_ObjectString2(org.joda.time.TestDateTime_Constructors)  Time elapsed: 0.004 sec  <<< FAILURE!
junit.framework.AssertionFailedError: expected:<11> but was:<15>
	at junit.framework.Assert.fail(Assert.java:47)
	at junit.framework.Assert.failNotEquals(Assert.java:280)
	at junit.framework.Assert.assertEquals(Assert.java:64)
	at junit.framework.Assert.assertEquals(Assert.java:198)
	at junit.framework.Assert.assertEquals(Assert.java:204)
	at org.joda.time.TestDateTime_Constructors.testConstructor_ObjectString2(TestDateTime_Constructors.java:392)

testConstructor_ObjectString4(org.joda.time.TestDateTime_Constructors)  Time elapsed: 0.001 sec  <<< FAILURE!
junit.framework.AssertionFailedError: expected:<2> but was:<3>
	at junit.framework.Assert.fail(Assert.java:47)
	at junit.framework.Assert.failNotEquals(Assert.java:280)
	at junit.framework.Assert.assertEquals(Assert.java:64)
	at junit.framework.Assert.assertEquals(Assert.java:198)
	at junit.framework.Assert.assertEquals(Assert.java:204)
	at org.joda.time.TestDateTime_Constructors.testConstructor_ObjectString4(TestDateTime_Constructors.java:415)

testConstructor_ObjectString6(org.joda.time.TestDateTime_Constructors)  Time elapsed: 0.002 sec  <<< FAILURE!
junit.framework.AssertionFailedError: expected:<1969> but was:<1970>
	at junit.framework.Assert.fail(Assert.java:47)
	at junit.framework.Assert.failNotEquals(Assert.java:280)
	at junit.framework.Assert.assertEquals(Assert.java:64)
	at junit.framework.Assert.assertEquals(Assert.java:198)
	at junit.framework.Assert.assertEquals(Assert.java:204)
	at org.joda.time.TestDateTime_Constructors.testConstructor_ObjectString6(TestDateTime_Constructors.java:437)

testConstructor_ObjectString4(org.joda.time.TestYearMonthDay_Constructors)  Time elapsed: 0.001 sec  <<< FAILURE!
junit.framework.AssertionFailedError: expected:<2> but was:<3>
	at junit.framework.Assert.fail(Assert.java:47)
	at junit.framework.Assert.failNotEquals(Assert.java:280)
	at junit.framework.Assert.assertEquals(Assert.java:64)
	at junit.framework.Assert.assertEquals(Assert.java:198)
	at junit.framework.Assert.assertEquals(Assert.java:204)
	at org.joda.time.TestYearMonthDay_Constructors.testConstructor_ObjectString4(TestYearMonthDay_Constructors.java:278)

testForTimeZone_TimeZone(org.joda.time.TestDateTimeZone)  Time elapsed: 0.003 sec  <<< FAILURE!
junit.framework.ComparisonFailure: expected:<+01:[23]> but was:<+01:[15]>
	at junit.framework.Assert.assertEquals(Assert.java:81)
	at junit.framework.Assert.assertEquals(Assert.java:87)
	at org.joda.time.TestDateTimeZone.testForTimeZone_TimeZone(TestDateTimeZone.java:376)

testTimeZoneConversion(org.joda.time.TestDateTimeZone)  Time elapsed: 0.001 sec  <<< FAILURE!
junit.framework.ComparisonFailure: expected:<-[10]:00> but was:<-[06]:00>
	at junit.framework.Assert.assertEquals(Assert.java:81)
	at junit.framework.Assert.assertEquals(Assert.java:87)
	at org.joda.time.TestDateTimeZone.testTimeZoneConversion(TestDateTimeZone.java:437)

testForID_String(org.joda.time.TestDateTimeZone)  Time elapsed: 0.001 sec  <<< FAILURE!
junit.framework.ComparisonFailure: expected:<+01:[23]> but was:<+01:[15]>
	at junit.framework.Assert.assertEquals(Assert.java:81)
	at junit.framework.Assert.assertEquals(Assert.java:87)
	at org.joda.time.TestDateTimeZone.testForID_String(TestDateTimeZone.java:206)

testForOffsetHoursMinutes_int_int(org.joda.time.TestDateTimeZone)  Time elapsed: 0.001 sec  <<< FAILURE!
junit.framework.AssertionFailedError: expected:<+15:39> but was:<+23:59>
	at junit.framework.Assert.fail(Assert.java:47)
	at junit.framework.Assert.failNotEquals(Assert.java:280)
	at junit.framework.Assert.assertEquals(Assert.java:64)
	at junit.framework.Assert.assertEquals(Assert.java:71)
	at org.joda.time.TestDateTimeZone.testForOffsetHoursMinutes_int_int(TestDateTimeZone.java:307)

testForOffsetMillis_int(org.joda.time.TestDateTimeZone)  Time elapsed: 0.001 sec  <<< FAILURE!
junit.framework.AssertionFailedError: expected:<+15:39:39.999> but was:<+23:59:59.999>
	at junit.framework.Assert.fail(Assert.java:47)
	at junit.framework.Assert.failNotEquals(Assert.java:280)
	at junit.framework.Assert.assertEquals(Assert.java:64)
	at junit.framework.Assert.assertEquals(Assert.java:71)
	at org.joda.time.TestDateTimeZone.testForOffsetMillis_int(TestDateTimeZone.java:346)

test_appendTimeZoneOffset_print_min1max2(org.joda.time.format.TestDateTimeFormatterBuilder)  Time elapsed: 0 sec  <<< FAILURE!
junit.framework.ComparisonFailure: expected:<+02:[30]> but was:<+02:[18]>
	at junit.framework.Assert.assertEquals(Assert.java:81)
	at junit.framework.Assert.assertEquals(Assert.java:87)
	at org.joda.time.format.TestDateTimeFormatterBuilder.assertPrint(TestDateTimeFormatterBuilder.java:672)
	at org.joda.time.format.TestDateTimeFormatterBuilder.test_appendTimeZoneOffset_print_min1max2(TestDateTimeFormatterBuilder.java:345)

test_appendTimeZoneOffset_print_min1max3(org.joda.time.format.TestDateTimeFormatterBuilder)  Time elapsed: 0.001 sec  <<< FAILURE!
junit.framework.ComparisonFailure: expected:<+02:[30:12]> but was:<+02:[18:08]>
	at junit.framework.Assert.assertEquals(Assert.java:81)
	at junit.framework.Assert.assertEquals(Assert.java:87)
	at org.joda.time.format.TestDateTimeFormatterBuilder.assertPrint(TestDateTimeFormatterBuilder.java:672)
	at org.joda.time.format.TestDateTimeFormatterBuilder.test_appendTimeZoneOffset_print_min1max3(TestDateTimeFormatterBuilder.java:351)

test_appendTimeZoneOffset_print_min2max2(org.joda.time.format.TestDateTimeFormatterBuilder)  Time elapsed: 0.001 sec  <<< FAILURE!
junit.framework.ComparisonFailure: expected:<+02:[30]> but was:<+02:[18]>
	at junit.framework.Assert.assertEquals(Assert.java:81)
	at junit.framework.Assert.assertEquals(Assert.java:87)
	at org.joda.time.format.TestDateTimeFormatterBuilder.assertPrint(TestDateTimeFormatterBuilder.java:672)
	at org.joda.time.format.TestDateTimeFormatterBuilder.test_appendTimeZoneOffset_print_min2max2(TestDateTimeFormatterBuilder.java:357)

test_appendTimeZoneOffset_print_min2max3(org.joda.time.format.TestDateTimeFormatterBuilder)  Time elapsed: 0 sec  <<< FAILURE!
junit.framework.ComparisonFailure: expected:<+02:[30:12]> but was:<+02:[18:08]>
	at junit.framework.Assert.assertEquals(Assert.java:81)
	at junit.framework.Assert.assertEquals(Assert.java:87)
	at org.joda.time.format.TestDateTimeFormatterBuilder.assertPrint(TestDateTimeFormatterBuilder.java:672)
	at org.joda.time.format.TestDateTimeFormatterBuilder.test_appendTimeZoneOffset_print_min2max3(TestDateTimeFormatterBuilder.java:363)

test_appendTimeZoneOffset_print_min3max3(org.joda.time.format.TestDateTimeFormatterBuilder)  Time elapsed: 0.001 sec  <<< FAILURE!
junit.framework.ComparisonFailure: expected:<+02:[30:12]> but was:<+02:[18:08]>
	at junit.framework.Assert.assertEquals(Assert.java:81)
	at junit.framework.Assert.assertEquals(Assert.java:87)
	at org.joda.time.format.TestDateTimeFormatterBuilder.assertPrint(TestDateTimeFormatterBuilder.java:672)
	at org.joda.time.format.TestDateTimeFormatterBuilder.test_appendTimeZoneOffset_print_min3max3(TestDateTimeFormatterBuilder.java:369)

testSerialization(org.joda.time.tz.TestBuilder)  Time elapsed: 0.003 sec  <<< FAILURE!
junit.framework.AssertionFailedError: expected:<-27158000> but was:<-28378000>
	at junit.framework.Assert.fail(Assert.java:47)
	at junit.framework.Assert.failNotEquals(Assert.java:280)
	at junit.framework.Assert.assertEquals(Assert.java:64)
	at junit.framework.Assert.assertEquals(Assert.java:198)
	at junit.framework.Assert.assertEquals(Assert.java:204)
	at org.joda.time.tz.TestBuilder.testForwardTransitions(TestBuilder.java:236)
	at org.joda.time.tz.TestBuilder.testSerialization(TestBuilder.java:282)

testReverseTransitions(org.joda.time.tz.TestBuilder)  Time elapsed: 0.021 sec  <<< FAILURE!
junit.framework.AssertionFailedError: expected:<-27158000> but was:<-28378000>
	at junit.framework.Assert.fail(Assert.java:47)
	at junit.framework.Assert.failNotEquals(Assert.java:280)
	at junit.framework.Assert.assertEquals(Assert.java:64)
	at junit.framework.Assert.assertEquals(Assert.java:198)
	at junit.framework.Assert.assertEquals(Assert.java:204)
	at org.joda.time.tz.TestBuilder.testReverseTransitions(TestBuilder.java:272)
	at org.joda.time.tz.TestBuilder.testReverseTransitions(TestBuilder.java:255)

testForwardTransitions(org.joda.time.tz.TestBuilder)  Time elapsed: 0.006 sec  <<< FAILURE!
junit.framework.AssertionFailedError: expected:<-27158000> but was:<-28378000>
	at junit.framework.Assert.fail(Assert.java:47)
	at junit.framework.Assert.failNotEquals(Assert.java:280)
	at junit.framework.Assert.assertEquals(Assert.java:64)
	at junit.framework.Assert.assertEquals(Assert.java:198)
	at junit.framework.Assert.assertEquals(Assert.java:204)
	at org.joda.time.tz.TestBuilder.testForwardTransitions(TestBuilder.java:236)
	at org.joda.time.tz.TestBuilder.testForwardTransitions(TestBuilder.java:217)

testCompile(org.joda.time.tz.TestCompiler)  Time elapsed: 0.032 sec  <<< FAILURE!
junit.framework.AssertionFailedError: expected:<-27158000> but was:<-28378000>
	at junit.framework.Assert.fail(Assert.java:47)
	at junit.framework.Assert.failNotEquals(Assert.java:280)
	at junit.framework.Assert.assertEquals(Assert.java:64)
	at junit.framework.Assert.assertEquals(Assert.java:198)
	at junit.framework.Assert.assertEquals(Assert.java:204)
	at org.joda.time.tz.TestBuilder.testForwardTransitions(TestBuilder.java:236)
	at org.joda.time.tz.TestCompiler.testCompile(TestCompiler.java:117)


Results :

Failed tests: 
  org.joda.time.TestDateTimeZone#testForID_String ComparisonFailure expected:<+0...
  org.joda.time.TestDateTimeZone#testForOffsetHoursMinutes_int_int AssertionFailedError
  org.joda.time.TestDateTimeZone#testForOffsetMillis_int AssertionFailedError ex...
  org.joda.time.TestDateTimeZone#testForTimeZone_TimeZone ComparisonFailure expe...
  org.joda.time.TestDateTimeZone#testTimeZoneConversion ComparisonFailure expect...
  org.joda.time.TestDateTime_Constructors#testConstructor_ObjectString2 AssertionFailedError
  org.joda.time.TestDateTime_Constructors#testConstructor_ObjectString4 AssertionFailedError
  org.joda.time.TestDateTime_Constructors#testConstructor_ObjectString6 AssertionFailedError
  org.joda.time.TestYearMonthDay_Constructors#testConstructor_ObjectString4 AssertionFailedError
  org.joda.time.format.TestDateTimeFormatterBuilder#test_appendTimeZoneOffset_print_min1max2 ComparisonFailure
  org.joda.time.format.TestDateTimeFormatterBuilder#test_appendTimeZoneOffset_print_min1max3 ComparisonFailure
  org.joda.time.format.TestDateTimeFormatterBuilder#test_appendTimeZoneOffset_print_min2max2 ComparisonFailure
  org.joda.time.format.TestDateTimeFormatterBuilder#test_appendTimeZoneOffset_print_min2max3 ComparisonFailure
  org.joda.time.format.TestDateTimeFormatterBuilder#test_appendTimeZoneOffset_print_min3max3 ComparisonFailure
  org.joda.time.tz.TestBuilder#testForwardTransitions AssertionFailedError expec...
  org.joda.time.tz.TestBuilder#testReverseTransitions AssertionFailedError expec...
  org.joda.time.tz.TestBuilder#testSerialization AssertionFailedError expected:<...
  org.joda.time.tz.TestCompiler#testCompile AssertionFailedError expected:<-2715...

Tests run: 4157, Failures: 18, Errors: 0, Skipped: 0

[INFO] ------------------------------------------------------------------------
[INFO] BUILD FAILURE
[INFO] ------------------------------------------------------------------------
[INFO] Total time: 16.097s
[INFO] Finished at: Thu Aug 06 08:51:30 BST 2015
[INFO] Final Memory: 10M/209M
[INFO] ------------------------------------------------------------------------
[ERROR] Failed to execute goal org.apache.maven.plugins:maven-surefire-plugin:2.18.1:test (default-test) on project joda-time: There are test failures.
[ERROR] 
[ERROR] Please refer to /home/perham/Study/LittleDarwin/Cases/joda-time-2.8.1/target/surefire-reports for the individual test results.
[ERROR] -> [Help 1]
[ERROR] 
[ERROR] To see the full stack trace of the errors, re-run Maven with the -e switch.
[ERROR] Re-run Maven using the -X switch to enable full debug logging.
[ERROR] 
[ERROR] For more information about the errors and possible solutions, please read the following articles:
[ERROR] [Help 1] http://cwiki.apache.org/confluence/display/MAVEN/MojoFailureException
