[INFO] Scanning for projects...
[INFO]                                                                         
[INFO] ------------------------------------------------------------------------
[INFO] Building Joda-Time 2.8.1
[INFO] ------------------------------------------------------------------------
[INFO] 
[INFO] --- maven-resources-plugin:2.7:resources (default-resources) @ joda-time ---
[INFO] Using 'UTF-8' encoding to copy filtered resources.
[INFO] Copying 2 resources to META-INF
[INFO] Copying 10 resources
[INFO] 
[INFO] --- maven-compiler-plugin:3.3:compile (default-compile) @ joda-time ---
[INFO] Changes detected - recompiling the module!
[INFO] Compiling 166 source files to /home/perham/Study/LittleDarwin/Cases/joda-time-2.8.1/target/classes
[INFO] 
[INFO] --- exec-maven-plugin:1.4.0:java (compile-tzdb) @ joda-time ---
Writing zoneinfo files
Writing ZoneInfoMap
[INFO] 
[INFO] --- maven-resources-plugin:2.7:testResources (default-testResources) @ joda-time ---
[INFO] Using 'UTF-8' encoding to copy filtered resources.
[INFO] Copying 34 resources
[INFO] 
[INFO] --- maven-compiler-plugin:3.3:testCompile (default-testCompile) @ joda-time ---
[INFO] Nothing to compile - all classes are up to date
[INFO] 
[INFO] --- maven-surefire-plugin:2.18.1:test (default-test) @ joda-time ---
[INFO] Surefire report directory: /home/perham/Study/LittleDarwin/Cases/joda-time-2.8.1/target/surefire-reports

-------------------------------------------------------
 T E S T S
-------------------------------------------------------
Running org.joda.time.TestAllPackages

TestBuddhistChronology.testCalendar

TestCopticChronology.testCalendar

TestEthiopicChronology.testCalendar

TestIslamicChronology.testCalendar

Testing Gregorian chronology over 1000 iterations
100% complete (i=1000)

Testing Julian chronology over 1000 iterations
100% complete (i=1000)
Writing zoneinfo files
Writing ZoneInfoMap
Tests run: 4157, Failures: 0, Errors: 278, Skipped: 0, Time elapsed: 5.297 sec <<< FAILURE! - in org.joda.time.TestAllPackages
testParse_noFormatter(org.joda.time.TestInstant_Constructors)  Time elapsed: 0.002 sec  <<< ERROR!
java.lang.ArrayIndexOutOfBoundsException: -1
	at org.joda.time.format.DateTimeParserBucket.computeMillis(DateTimeParserBucket.java:109)
	at org.joda.time.format.DateTimeParserBucket.computeMillis(DateTimeParserBucket.java:92)
	at org.joda.time.format.DateTimeFormatter.parseDateTime(DateTimeFormatter.java:882)
	at org.joda.time.Instant.parse(Instant.java:98)
	at org.joda.time.Instant.parse(Instant.java:87)
	at org.joda.time.TestInstant_Constructors.testParse_noFormatter(TestInstant_Constructors.java:100)

testParse_formatter(org.joda.time.TestInstant_Constructors)  Time elapsed: 0.003 sec  <<< ERROR!
java.lang.ArrayIndexOutOfBoundsException: -1
	at org.joda.time.format.DateTimeParserBucket.computeMillis(DateTimeParserBucket.java:109)
	at org.joda.time.format.DateTimeParserBucket.computeMillis(DateTimeParserBucket.java:92)
	at org.joda.time.format.DateTimeFormatter.parseDateTime(DateTimeFormatter.java:882)
	at org.joda.time.Instant.parse(Instant.java:98)
	at org.joda.time.TestInstant_Constructors.testParse_formatter(TestInstant_Constructors.java:106)

testConstructor_ObjectString2(org.joda.time.TestDateTime_Constructors)  Time elapsed: 0.001 sec  <<< ERROR!
java.lang.ArrayIndexOutOfBoundsException: -1
	at org.joda.time.format.DateTimeParserBucket.computeMillis(DateTimeParserBucket.java:109)
	at org.joda.time.format.DateTimeParserBucket.doParseMillis(DateTimeParserBucket.java:55)
	at org.joda.time.format.DateTimeFormatter.parseMillis(DateTimeFormatter.java:780)
	at org.joda.time.convert.StringConverter.getInstantMillis(StringConverter.java:65)
	at org.joda.time.base.BaseDateTime.<init>(BaseDateTime.java:175)
	at org.joda.time.DateTime.<init>(DateTime.java:257)
	at org.joda.time.TestDateTime_Constructors.testConstructor_ObjectString2(TestDateTime_Constructors.java:387)

testConstructor_ObjectString3(org.joda.time.TestDateTime_Constructors)  Time elapsed: 0.001 sec  <<< ERROR!
java.lang.ArrayIndexOutOfBoundsException: -1
	at org.joda.time.format.DateTimeParserBucket.computeMillis(DateTimeParserBucket.java:109)
	at org.joda.time.format.DateTimeParserBucket.doParseMillis(DateTimeParserBucket.java:55)
	at org.joda.time.format.DateTimeFormatter.parseMillis(DateTimeFormatter.java:780)
	at org.joda.time.convert.StringConverter.getInstantMillis(StringConverter.java:65)
	at org.joda.time.base.BaseDateTime.<init>(BaseDateTime.java:175)
	at org.joda.time.DateTime.<init>(DateTime.java:257)
	at org.joda.time.TestDateTime_Constructors.testConstructor_ObjectString3(TestDateTime_Constructors.java:399)

testConstructor_ObjectString4(org.joda.time.TestDateTime_Constructors)  Time elapsed: 0.001 sec  <<< ERROR!
java.lang.ArrayIndexOutOfBoundsException: -1
	at org.joda.time.format.DateTimeParserBucket.computeMillis(DateTimeParserBucket.java:109)
	at org.joda.time.format.DateTimeParserBucket.doParseMillis(DateTimeParserBucket.java:55)
	at org.joda.time.format.DateTimeFormatter.parseMillis(DateTimeFormatter.java:780)
	at org.joda.time.convert.StringConverter.getInstantMillis(StringConverter.java:65)
	at org.joda.time.base.BaseDateTime.<init>(BaseDateTime.java:175)
	at org.joda.time.DateTime.<init>(DateTime.java:257)
	at org.joda.time.TestDateTime_Constructors.testConstructor_ObjectString4(TestDateTime_Constructors.java:411)

testConstructor_ObjectString5(org.joda.time.TestDateTime_Constructors)  Time elapsed: 0.001 sec  <<< ERROR!
java.lang.ArrayIndexOutOfBoundsException: -1
	at org.joda.time.format.DateTimeParserBucket.computeMillis(DateTimeParserBucket.java:109)
	at org.joda.time.format.DateTimeParserBucket.doParseMillis(DateTimeParserBucket.java:55)
	at org.joda.time.format.DateTimeFormatter.parseMillis(DateTimeFormatter.java:780)
	at org.joda.time.convert.StringConverter.getInstantMillis(StringConverter.java:65)
	at org.joda.time.base.BaseDateTime.<init>(BaseDateTime.java:175)
	at org.joda.time.DateTime.<init>(DateTime.java:257)
	at org.joda.time.TestDateTime_Constructors.testConstructor_ObjectString5(TestDateTime_Constructors.java:423)

testConstructor_ObjectString6(org.joda.time.TestDateTime_Constructors)  Time elapsed: 0 sec  <<< ERROR!
java.lang.ArrayIndexOutOfBoundsException: -1
	at org.joda.time.format.DateTimeParserBucket.computeMillis(DateTimeParserBucket.java:109)
	at org.joda.time.format.DateTimeParserBucket.doParseMillis(DateTimeParserBucket.java:55)
	at org.joda.time.format.DateTimeFormatter.parseMillis(DateTimeFormatter.java:780)
	at org.joda.time.convert.StringConverter.getInstantMillis(StringConverter.java:65)
	at org.joda.time.base.BaseDateTime.<init>(BaseDateTime.java:175)
	at org.joda.time.DateTime.<init>(DateTime.java:257)
	at org.joda.time.TestDateTime_Constructors.testConstructor_ObjectString6(TestDateTime_Constructors.java:435)

testConstructor_ObjectString7(org.joda.time.TestDateTime_Constructors)  Time elapsed: 0 sec  <<< ERROR!
java.lang.ArrayIndexOutOfBoundsException: -1
	at org.joda.time.format.DateTimeParserBucket.computeMillis(DateTimeParserBucket.java:109)
	at org.joda.time.format.DateTimeParserBucket.doParseMillis(DateTimeParserBucket.java:55)
	at org.joda.time.format.DateTimeFormatter.parseMillis(DateTimeFormatter.java:780)
	at org.joda.time.convert.StringConverter.getInstantMillis(StringConverter.java:65)
	at org.joda.time.base.BaseDateTime.<init>(BaseDateTime.java:175)
	at org.joda.time.DateTime.<init>(DateTime.java:257)
	at org.joda.time.TestDateTime_Constructors.testConstructor_ObjectString7(TestDateTime_Constructors.java:447)

testConstructor_ObjectString1(org.joda.time.TestDateTime_Constructors)  Time elapsed: 0 sec  <<< ERROR!
java.lang.ArrayIndexOutOfBoundsException: -1
	at org.joda.time.format.DateTimeParserBucket.computeMillis(DateTimeParserBucket.java:109)
	at org.joda.time.format.DateTimeParserBucket.doParseMillis(DateTimeParserBucket.java:55)
	at org.joda.time.format.DateTimeFormatter.parseMillis(DateTimeFormatter.java:780)
	at org.joda.time.convert.StringConverter.getInstantMillis(StringConverter.java:65)
	at org.joda.time.base.BaseDateTime.<init>(BaseDateTime.java:175)
	at org.joda.time.DateTime.<init>(DateTime.java:257)
	at org.joda.time.TestDateTime_Constructors.testConstructor_ObjectString1(TestDateTime_Constructors.java:375)

testParse_noFormatter_vs_constructor_noOffset(org.joda.time.TestDateTime_Constructors)  Time elapsed: 0.001 sec  <<< ERROR!
java.lang.ArrayIndexOutOfBoundsException: -1
	at org.joda.time.format.DateTimeParserBucket.computeMillis(DateTimeParserBucket.java:109)
	at org.joda.time.format.DateTimeParserBucket.computeMillis(DateTimeParserBucket.java:92)
	at org.joda.time.format.DateTimeFormatter.parseDateTime(DateTimeFormatter.java:882)
	at org.joda.time.DateTime.parse(DateTime.java:160)
	at org.joda.time.DateTime.parse(DateTime.java:149)
	at org.joda.time.TestDateTime_Constructors.testParse_noFormatter_vs_constructor_noOffset(TestDateTime_Constructors.java:162)

testParse_noFormatter_vs_constructor_correctOffset(org.joda.time.TestDateTime_Constructors)  Time elapsed: 0.001 sec  <<< ERROR!
java.lang.ArrayIndexOutOfBoundsException: -1
	at org.joda.time.format.DateTimeParserBucket.computeMillis(DateTimeParserBucket.java:109)
	at org.joda.time.format.DateTimeParserBucket.computeMillis(DateTimeParserBucket.java:92)
	at org.joda.time.format.DateTimeFormatter.parseDateTime(DateTimeFormatter.java:882)
	at org.joda.time.DateTime.parse(DateTime.java:160)
	at org.joda.time.DateTime.parse(DateTime.java:149)
	at org.joda.time.TestDateTime_Constructors.testParse_noFormatter_vs_constructor_correctOffset(TestDateTime_Constructors.java:170)

testParse_noFormatter(org.joda.time.TestDateTime_Constructors)  Time elapsed: 0.001 sec  <<< ERROR!
java.lang.ArrayIndexOutOfBoundsException: -1
	at org.joda.time.format.DateTimeParserBucket.computeMillis(DateTimeParserBucket.java:109)
	at org.joda.time.format.DateTimeParserBucket.computeMillis(DateTimeParserBucket.java:92)
	at org.joda.time.format.DateTimeFormatter.parseDateTime(DateTimeFormatter.java:882)
	at org.joda.time.DateTime.parse(DateTime.java:160)
	at org.joda.time.DateTime.parse(DateTime.java:149)
	at org.joda.time.TestDateTime_Constructors.testParse_noFormatter(TestDateTime_Constructors.java:157)

testParse_formatter(org.joda.time.TestDateTime_Constructors)  Time elapsed: 0 sec  <<< ERROR!
java.lang.ArrayIndexOutOfBoundsException: -1
	at org.joda.time.format.DateTimeParserBucket.computeMillis(DateTimeParserBucket.java:109)
	at org.joda.time.format.DateTimeParserBucket.computeMillis(DateTimeParserBucket.java:92)
	at org.joda.time.format.DateTimeFormatter.parseDateTime(DateTimeFormatter.java:882)
	at org.joda.time.DateTime.parse(DateTime.java:160)
	at org.joda.time.TestDateTime_Constructors.testParse_formatter(TestDateTime_Constructors.java:178)

testParse_noFormatter(org.joda.time.TestMutableDateTime_Constructors)  Time elapsed: 0.001 sec  <<< ERROR!
java.lang.ArrayIndexOutOfBoundsException: -1
	at org.joda.time.format.DateTimeParserBucket.computeMillis(DateTimeParserBucket.java:109)
	at org.joda.time.format.DateTimeParserBucket.computeMillis(DateTimeParserBucket.java:92)
	at org.joda.time.format.DateTimeFormatter.parseDateTime(DateTimeFormatter.java:882)
	at org.joda.time.MutableDateTime.parse(MutableDateTime.java:160)
	at org.joda.time.MutableDateTime.parse(MutableDateTime.java:149)
	at org.joda.time.TestMutableDateTime_Constructors.testParse_noFormatter(TestMutableDateTime_Constructors.java:157)

testParse_formatter(org.joda.time.TestMutableDateTime_Constructors)  Time elapsed: 0 sec  <<< ERROR!
java.lang.ArrayIndexOutOfBoundsException: -1
	at org.joda.time.format.DateTimeParserBucket.computeMillis(DateTimeParserBucket.java:109)
	at org.joda.time.format.DateTimeParserBucket.computeMillis(DateTimeParserBucket.java:92)
	at org.joda.time.format.DateTimeFormatter.parseDateTime(DateTimeFormatter.java:882)
	at org.joda.time.MutableDateTime.parse(MutableDateTime.java:160)
	at org.joda.time.TestMutableDateTime_Constructors.testParse_formatter(TestMutableDateTime_Constructors.java:163)

testParse_noFormatter(org.joda.time.TestDateMidnight_Constructors)  Time elapsed: 0.001 sec  <<< ERROR!
java.lang.ArrayIndexOutOfBoundsException: -1
	at org.joda.time.format.DateTimeParserBucket.computeMillis(DateTimeParserBucket.java:109)
	at org.joda.time.format.DateTimeParserBucket.computeMillis(DateTimeParserBucket.java:92)
	at org.joda.time.format.DateTimeFormatter.parseDateTime(DateTimeFormatter.java:882)
	at org.joda.time.DateMidnight.parse(DateMidnight.java:152)
	at org.joda.time.DateMidnight.parse(DateMidnight.java:141)
	at org.joda.time.TestDateMidnight_Constructors.testParse_noFormatter(TestDateMidnight_Constructors.java:174)

testParse_formatter(org.joda.time.TestDateMidnight_Constructors)  Time elapsed: 0.001 sec  <<< ERROR!
java.lang.ArrayIndexOutOfBoundsException: -1
	at org.joda.time.format.DateTimeParserBucket.computeMillis(DateTimeParserBucket.java:109)
	at org.joda.time.format.DateTimeParserBucket.computeMillis(DateTimeParserBucket.java:92)
	at org.joda.time.format.DateTimeFormatter.parseDateTime(DateTimeFormatter.java:882)
	at org.joda.time.DateMidnight.parse(DateMidnight.java:152)
	at org.joda.time.TestDateMidnight_Constructors.testParse_formatter(TestDateMidnight_Constructors.java:179)

testParse_noFormatter(org.joda.time.TestInterval_Constructors)  Time elapsed: 0.002 sec  <<< ERROR!
java.lang.ArrayIndexOutOfBoundsException: -1
	at org.joda.time.format.DateTimeParserBucket.computeMillis(DateTimeParserBucket.java:109)
	at org.joda.time.format.DateTimeParserBucket.computeMillis(DateTimeParserBucket.java:92)
	at org.joda.time.format.DateTimeFormatter.parseDateTime(DateTimeFormatter.java:882)
	at org.joda.time.convert.StringConverter.setInto(StringConverter.java:212)
	at org.joda.time.base.BaseInterval.<init>(BaseInterval.java:200)
	at org.joda.time.Interval.<init>(Interval.java:193)
	at org.joda.time.Interval.parse(Interval.java:69)
	at org.joda.time.TestInterval_Constructors.testParse_noFormatter(TestInterval_Constructors.java:108)

testConstructor_Object1(org.joda.time.TestInterval_Constructors)  Time elapsed: 0 sec  <<< ERROR!
java.lang.ArrayIndexOutOfBoundsException: -1
	at org.joda.time.format.DateTimeParserBucket.computeMillis(DateTimeParserBucket.java:109)
	at org.joda.time.format.DateTimeParserBucket.computeMillis(DateTimeParserBucket.java:92)
	at org.joda.time.format.DateTimeFormatter.parseDateTime(DateTimeFormatter.java:882)
	at org.joda.time.convert.StringConverter.setInto(StringConverter.java:212)
	at org.joda.time.base.BaseInterval.<init>(BaseInterval.java:200)
	at org.joda.time.Interval.<init>(Interval.java:193)
	at org.joda.time.TestInterval_Constructors.testConstructor_Object1(TestInterval_Constructors.java:535)

testToString_reparse(org.joda.time.TestInterval_Basics)  Time elapsed: 0.001 sec  <<< ERROR!
java.lang.ArrayIndexOutOfBoundsException: -1
	at org.joda.time.format.DateTimeParserBucket.computeMillis(DateTimeParserBucket.java:109)
	at org.joda.time.format.DateTimeParserBucket.computeMillis(DateTimeParserBucket.java:92)
	at org.joda.time.format.DateTimeFormatter.parseDateTime(DateTimeFormatter.java:882)
	at org.joda.time.convert.StringConverter.setInto(StringConverter.java:212)
	at org.joda.time.base.BaseInterval.<init>(BaseInterval.java:200)
	at org.joda.time.Interval.<init>(Interval.java:193)
	at org.joda.time.TestInterval_Basics.testToString_reparse(TestInterval_Basics.java:1053)

testConstructor_ObjectString2(org.joda.time.TestLocalDateTime_Constructors)  Time elapsed: 0 sec  <<< ERROR!
java.lang.ArrayIndexOutOfBoundsException: -1
	at org.joda.time.format.DateTimeParserBucket.computeMillis(DateTimeParserBucket.java:109)
	at org.joda.time.format.DateTimeParserBucket.doParseMillis(DateTimeParserBucket.java:55)
	at org.joda.time.format.DateTimeFormatter.parseMillis(DateTimeFormatter.java:780)
	at org.joda.time.convert.StringConverter.getPartialValues(StringConverter.java:87)
	at org.joda.time.LocalDateTime.<init>(LocalDateTime.java:414)
	at org.joda.time.LocalDateTime.<init>(LocalDateTime.java:358)
	at org.joda.time.TestLocalDateTime_Constructors.testConstructor_ObjectString2(TestLocalDateTime_Constructors.java:392)

testConstructor_ObjectString3(org.joda.time.TestLocalDateTime_Constructors)  Time elapsed: 0.001 sec  <<< ERROR!
java.lang.ArrayIndexOutOfBoundsException: -1
	at org.joda.time.format.DateTimeParserBucket.computeMillis(DateTimeParserBucket.java:109)
	at org.joda.time.format.DateTimeParserBucket.doParseMillis(DateTimeParserBucket.java:55)
	at org.joda.time.format.DateTimeFormatter.parseMillis(DateTimeFormatter.java:780)
	at org.joda.time.convert.StringConverter.getPartialValues(StringConverter.java:87)
	at org.joda.time.LocalDateTime.<init>(LocalDateTime.java:414)
	at org.joda.time.LocalDateTime.<init>(LocalDateTime.java:358)
	at org.joda.time.TestLocalDateTime_Constructors.testConstructor_ObjectString3(TestLocalDateTime_Constructors.java:404)

testConstructor_ObjectString4(org.joda.time.TestLocalDateTime_Constructors)  Time elapsed: 0 sec  <<< ERROR!
java.lang.ArrayIndexOutOfBoundsException: -1
	at org.joda.time.format.DateTimeParserBucket.computeMillis(DateTimeParserBucket.java:109)
	at org.joda.time.format.DateTimeParserBucket.doParseMillis(DateTimeParserBucket.java:55)
	at org.joda.time.format.DateTimeFormatter.parseMillis(DateTimeFormatter.java:780)
	at org.joda.time.convert.StringConverter.getPartialValues(StringConverter.java:87)
	at org.joda.time.LocalDateTime.<init>(LocalDateTime.java:414)
	at org.joda.time.LocalDateTime.<init>(LocalDateTime.java:358)
	at org.joda.time.TestLocalDateTime_Constructors.testConstructor_ObjectString4(TestLocalDateTime_Constructors.java:416)

testConstructor_ObjectString1(org.joda.time.TestLocalDateTime_Constructors)  Time elapsed: 0 sec  <<< ERROR!
java.lang.ArrayIndexOutOfBoundsException: -1
	at org.joda.time.format.DateTimeParserBucket.computeMillis(DateTimeParserBucket.java:109)
	at org.joda.time.format.DateTimeParserBucket.doParseMillis(DateTimeParserBucket.java:55)
	at org.joda.time.format.DateTimeFormatter.parseMillis(DateTimeFormatter.java:780)
	at org.joda.time.convert.StringConverter.getPartialValues(StringConverter.java:87)
	at org.joda.time.LocalDateTime.<init>(LocalDateTime.java:414)
	at org.joda.time.LocalDateTime.<init>(LocalDateTime.java:358)
	at org.joda.time.TestLocalDateTime_Constructors.testConstructor_ObjectString1(TestLocalDateTime_Constructors.java:380)

testParse_noFormatter(org.joda.time.TestLocalDateTime_Constructors)  Time elapsed: 0.001 sec  <<< ERROR!
java.lang.ArrayIndexOutOfBoundsException: -1
	at org.joda.time.format.DateTimeParserBucket.computeMillis(DateTimeParserBucket.java:109)
	at org.joda.time.format.DateTimeParserBucket.computeMillis(DateTimeParserBucket.java:92)
	at org.joda.time.format.DateTimeFormatter.parseLocalDateTime(DateTimeFormatter.java:841)
	at org.joda.time.LocalDateTime.parse(LocalDateTime.java:168)
	at org.joda.time.LocalDateTime.parse(LocalDateTime.java:157)
	at org.joda.time.TestLocalDateTime_Constructors.testParse_noFormatter(TestLocalDateTime_Constructors.java:95)

testParse_formatter(org.joda.time.TestLocalDateTime_Constructors)  Time elapsed: 0 sec  <<< ERROR!
java.lang.ArrayIndexOutOfBoundsException: -1
	at org.joda.time.format.DateTimeParserBucket.computeMillis(DateTimeParserBucket.java:109)
	at org.joda.time.format.DateTimeParserBucket.computeMillis(DateTimeParserBucket.java:92)
	at org.joda.time.format.DateTimeFormatter.parseLocalDateTime(DateTimeFormatter.java:841)
	at org.joda.time.LocalDateTime.parse(LocalDateTime.java:168)
	at org.joda.time.TestLocalDateTime_Constructors.testParse_formatter(TestLocalDateTime_Constructors.java:101)

testConstructor_Object_DateTimeZoneMoscow(org.joda.time.TestLocalDateTime_Constructors)  Time elapsed: 0.001 sec  <<< ERROR!
java.lang.ArrayIndexOutOfBoundsException: -1
	at org.joda.time.format.DateTimeParserBucket.computeMillis(DateTimeParserBucket.java:109)
	at org.joda.time.format.DateTimeParserBucket.doParseMillis(DateTimeParserBucket.java:55)
	at org.joda.time.format.DateTimeFormatter.parseMillis(DateTimeFormatter.java:780)
	at org.joda.time.convert.StringConverter.getPartialValues(StringConverter.java:87)
	at org.joda.time.LocalDateTime.<init>(LocalDateTime.java:384)
	at org.joda.time.TestLocalDateTime_Constructors.testConstructor_Object_DateTimeZoneMoscow(TestLocalDateTime_Constructors.java:513)

testConstructor_Object_DateTimeZoneMoscowBadDateTime(org.joda.time.TestLocalDateTime_Constructors)  Time elapsed: 0 sec  <<< ERROR!
java.lang.ArrayIndexOutOfBoundsException: -1
	at org.joda.time.format.DateTimeParserBucket.computeMillis(DateTimeParserBucket.java:109)
	at org.joda.time.format.DateTimeParserBucket.doParseMillis(DateTimeParserBucket.java:55)
	at org.joda.time.format.DateTimeFormatter.parseMillis(DateTimeFormatter.java:780)
	at org.joda.time.convert.StringConverter.getPartialValues(StringConverter.java:87)
	at org.joda.time.LocalDateTime.<init>(LocalDateTime.java:384)
	at org.joda.time.TestLocalDateTime_Constructors.testConstructor_Object_DateTimeZoneMoscowBadDateTime(TestLocalDateTime_Constructors.java:529)

testConstructor_Object_ChronologyMoscow(org.joda.time.TestLocalDateTime_Constructors)  Time elapsed: 0.001 sec  <<< ERROR!
java.lang.ArrayIndexOutOfBoundsException: -1
	at org.joda.time.format.DateTimeParserBucket.computeMillis(DateTimeParserBucket.java:109)
	at org.joda.time.format.DateTimeParserBucket.doParseMillis(DateTimeParserBucket.java:55)
	at org.joda.time.format.DateTimeFormatter.parseMillis(DateTimeFormatter.java:780)
	at org.joda.time.convert.StringConverter.getPartialValues(StringConverter.java:87)
	at org.joda.time.LocalDateTime.<init>(LocalDateTime.java:414)
	at org.joda.time.TestLocalDateTime_Constructors.testConstructor_Object_ChronologyMoscow(TestLocalDateTime_Constructors.java:605)

testConstructor_Object_ChronologyMoscowBadDateTime(org.joda.time.TestLocalDateTime_Constructors)  Time elapsed: 0 sec  <<< ERROR!
java.lang.ArrayIndexOutOfBoundsException: -1
	at org.joda.time.format.DateTimeParserBucket.computeMillis(DateTimeParserBucket.java:109)
	at org.joda.time.format.DateTimeParserBucket.doParseMillis(DateTimeParserBucket.java:55)
	at org.joda.time.format.DateTimeFormatter.parseMillis(DateTimeFormatter.java:780)
	at org.joda.time.convert.StringConverter.getPartialValues(StringConverter.java:87)
	at org.joda.time.LocalDateTime.<init>(LocalDateTime.java:414)
	at org.joda.time.TestLocalDateTime_Constructors.testConstructor_Object_ChronologyMoscowBadDateTime(TestLocalDateTime_Constructors.java:621)

testConstructor_ObjectString2(org.joda.time.TestLocalDate_Constructors)  Time elapsed: 0 sec  <<< ERROR!
java.lang.ArrayIndexOutOfBoundsException: -1
	at org.joda.time.format.DateTimeParserBucket.computeMillis(DateTimeParserBucket.java:109)
	at org.joda.time.format.DateTimeParserBucket.doParseMillis(DateTimeParserBucket.java:55)
	at org.joda.time.format.DateTimeFormatter.parseMillis(DateTimeFormatter.java:780)
	at org.joda.time.convert.StringConverter.getPartialValues(StringConverter.java:87)
	at org.joda.time.LocalDate.<init>(LocalDate.java:419)
	at org.joda.time.LocalDate.<init>(LocalDate.java:363)
	at org.joda.time.TestLocalDate_Constructors.testConstructor_ObjectString2(TestLocalDate_Constructors.java:341)

testConstructor_ObjectString3(org.joda.time.TestLocalDate_Constructors)  Time elapsed: 0.001 sec  <<< ERROR!
java.lang.ArrayIndexOutOfBoundsException: -1
	at org.joda.time.format.DateTimeParserBucket.computeMillis(DateTimeParserBucket.java:109)
	at org.joda.time.format.DateTimeParserBucket.doParseMillis(DateTimeParserBucket.java:55)
	at org.joda.time.format.DateTimeFormatter.parseMillis(DateTimeFormatter.java:780)
	at org.joda.time.convert.StringConverter.getPartialValues(StringConverter.java:87)
	at org.joda.time.LocalDate.<init>(LocalDate.java:419)
	at org.joda.time.LocalDate.<init>(LocalDate.java:363)
	at org.joda.time.TestLocalDate_Constructors.testConstructor_ObjectString3(TestLocalDate_Constructors.java:349)

testConstructor_ObjectString1(org.joda.time.TestLocalDate_Constructors)  Time elapsed: 0.001 sec  <<< ERROR!
java.lang.ArrayIndexOutOfBoundsException: -1
	at org.joda.time.format.DateTimeParserBucket.computeMillis(DateTimeParserBucket.java:109)
	at org.joda.time.format.DateTimeParserBucket.doParseMillis(DateTimeParserBucket.java:55)
	at org.joda.time.format.DateTimeFormatter.parseMillis(DateTimeFormatter.java:780)
	at org.joda.time.convert.StringConverter.getPartialValues(StringConverter.java:87)
	at org.joda.time.LocalDate.<init>(LocalDate.java:419)
	at org.joda.time.LocalDate.<init>(LocalDate.java:363)
	at org.joda.time.TestLocalDate_Constructors.testConstructor_ObjectString1(TestLocalDate_Constructors.java:333)

testParse_noFormatter(org.joda.time.TestLocalDate_Constructors)  Time elapsed: 0 sec  <<< ERROR!
java.lang.ArrayIndexOutOfBoundsException: -1
	at org.joda.time.format.DateTimeParserBucket.computeMillis(DateTimeParserBucket.java:109)
	at org.joda.time.format.DateTimeParserBucket.computeMillis(DateTimeParserBucket.java:92)
	at org.joda.time.format.DateTimeFormatter.parseLocalDateTime(DateTimeFormatter.java:841)
	at org.joda.time.format.DateTimeFormatter.parseLocalDate(DateTimeFormatter.java:798)
	at org.joda.time.LocalDate.parse(LocalDate.java:179)
	at org.joda.time.LocalDate.parse(LocalDate.java:168)
	at org.joda.time.TestLocalDate_Constructors.testParse_noFormatter(TestLocalDate_Constructors.java:87)

testParse_formatter(org.joda.time.TestLocalDate_Constructors)  Time elapsed: 0.001 sec  <<< ERROR!
java.lang.ArrayIndexOutOfBoundsException: -1
	at org.joda.time.format.DateTimeParserBucket.computeMillis(DateTimeParserBucket.java:109)
	at org.joda.time.format.DateTimeParserBucket.computeMillis(DateTimeParserBucket.java:92)
	at org.joda.time.format.DateTimeFormatter.parseLocalDateTime(DateTimeFormatter.java:841)
	at org.joda.time.format.DateTimeFormatter.parseLocalDate(DateTimeFormatter.java:798)
	at org.joda.time.LocalDate.parse(LocalDate.java:179)
	at org.joda.time.TestLocalDate_Constructors.testParse_formatter(TestLocalDate_Constructors.java:93)

testConstructor_ObjectString2(org.joda.time.TestLocalTime_Constructors)  Time elapsed: 0 sec  <<< ERROR!
java.lang.ArrayIndexOutOfBoundsException: -1
	at org.joda.time.format.DateTimeParserBucket.computeMillis(DateTimeParserBucket.java:109)
	at org.joda.time.format.DateTimeParserBucket.doParseMillis(DateTimeParserBucket.java:55)
	at org.joda.time.format.DateTimeFormatter.parseMillis(DateTimeFormatter.java:780)
	at org.joda.time.convert.StringConverter.getPartialValues(StringConverter.java:87)
	at org.joda.time.LocalTime.<init>(LocalTime.java:435)
	at org.joda.time.LocalTime.<init>(LocalTime.java:383)
	at org.joda.time.TestLocalTime_Constructors.testConstructor_ObjectString2(TestLocalTime_Constructors.java:392)

testConstructor_ObjectString3(org.joda.time.TestLocalTime_Constructors)  Time elapsed: 0.001 sec  <<< ERROR!
java.lang.ArrayIndexOutOfBoundsException: -1
	at org.joda.time.format.DateTimeParserBucket.computeMillis(DateTimeParserBucket.java:109)
	at org.joda.time.format.DateTimeParserBucket.doParseMillis(DateTimeParserBucket.java:55)
	at org.joda.time.format.DateTimeFormatter.parseMillis(DateTimeFormatter.java:780)
	at org.joda.time.convert.StringConverter.getPartialValues(StringConverter.java:87)
	at org.joda.time.LocalTime.<init>(LocalTime.java:435)
	at org.joda.time.LocalTime.<init>(LocalTime.java:383)
	at org.joda.time.TestLocalTime_Constructors.testConstructor_ObjectString3(TestLocalTime_Constructors.java:401)

testConstructor_ObjectString4(org.joda.time.TestLocalTime_Constructors)  Time elapsed: 0 sec  <<< ERROR!
java.lang.ArrayIndexOutOfBoundsException: -1
	at org.joda.time.format.DateTimeParserBucket.computeMillis(DateTimeParserBucket.java:109)
	at org.joda.time.format.DateTimeParserBucket.doParseMillis(DateTimeParserBucket.java:55)
	at org.joda.time.format.DateTimeFormatter.parseMillis(DateTimeFormatter.java:780)
	at org.joda.time.convert.StringConverter.getPartialValues(StringConverter.java:87)
	at org.joda.time.LocalTime.<init>(LocalTime.java:435)
	at org.joda.time.LocalTime.<init>(LocalTime.java:383)
	at org.joda.time.TestLocalTime_Constructors.testConstructor_ObjectString4(TestLocalTime_Constructors.java:410)

testConstructor_ObjectString1(org.joda.time.TestLocalTime_Constructors)  Time elapsed: 0 sec  <<< ERROR!
java.lang.ArrayIndexOutOfBoundsException: -1
	at org.joda.time.format.DateTimeParserBucket.computeMillis(DateTimeParserBucket.java:109)
	at org.joda.time.format.DateTimeParserBucket.doParseMillis(DateTimeParserBucket.java:55)
	at org.joda.time.format.DateTimeFormatter.parseMillis(DateTimeFormatter.java:780)
	at org.joda.time.convert.StringConverter.getPartialValues(StringConverter.java:87)
	at org.joda.time.LocalTime.<init>(LocalTime.java:435)
	at org.joda.time.LocalTime.<init>(LocalTime.java:383)
	at org.joda.time.TestLocalTime_Constructors.testConstructor_ObjectString1(TestLocalTime_Constructors.java:363)

testParse_noFormatter(org.joda.time.TestLocalTime_Constructors)  Time elapsed: 0.001 sec  <<< ERROR!
java.lang.ArrayIndexOutOfBoundsException: -1
	at org.joda.time.format.DateTimeParserBucket.computeMillis(DateTimeParserBucket.java:109)
	at org.joda.time.format.DateTimeParserBucket.computeMillis(DateTimeParserBucket.java:92)
	at org.joda.time.format.DateTimeFormatter.parseLocalDateTime(DateTimeFormatter.java:841)
	at org.joda.time.format.DateTimeFormatter.parseLocalTime(DateTimeFormatter.java:816)
	at org.joda.time.LocalTime.parse(LocalTime.java:175)
	at org.joda.time.LocalTime.parse(LocalTime.java:164)
	at org.joda.time.TestLocalTime_Constructors.testParse_noFormatter(TestLocalTime_Constructors.java:113)

testParse_formatter(org.joda.time.TestLocalTime_Constructors)  Time elapsed: 0 sec  <<< ERROR!
java.lang.ArrayIndexOutOfBoundsException: -1
	at org.joda.time.format.DateTimeParserBucket.computeMillis(DateTimeParserBucket.java:109)
	at org.joda.time.format.DateTimeParserBucket.computeMillis(DateTimeParserBucket.java:92)
	at org.joda.time.format.DateTimeFormatter.parseLocalDateTime(DateTimeFormatter.java:841)
	at org.joda.time.format.DateTimeFormatter.parseLocalTime(DateTimeFormatter.java:816)
	at org.joda.time.LocalTime.parse(LocalTime.java:175)
	at org.joda.time.TestLocalTime_Constructors.testParse_formatter(TestLocalTime_Constructors.java:119)

testConstructor_ObjectString1Tokyo(org.joda.time.TestLocalTime_Constructors)  Time elapsed: 0.001 sec  <<< ERROR!
java.lang.ArrayIndexOutOfBoundsException: -1
	at org.joda.time.format.DateTimeParserBucket.computeMillis(DateTimeParserBucket.java:109)
	at org.joda.time.format.DateTimeParserBucket.doParseMillis(DateTimeParserBucket.java:55)
	at org.joda.time.format.DateTimeFormatter.parseMillis(DateTimeFormatter.java:780)
	at org.joda.time.convert.StringConverter.getPartialValues(StringConverter.java:87)
	at org.joda.time.LocalTime.<init>(LocalTime.java:435)
	at org.joda.time.LocalTime.<init>(LocalTime.java:383)
	at org.joda.time.TestLocalTime_Constructors.testConstructor_ObjectString1Tokyo(TestLocalTime_Constructors.java:373)

testConstructor_ObjectString1NewYork(org.joda.time.TestLocalTime_Constructors)  Time elapsed: 0 sec  <<< ERROR!
java.lang.ArrayIndexOutOfBoundsException: -1
	at org.joda.time.format.DateTimeParserBucket.computeMillis(DateTimeParserBucket.java:109)
	at org.joda.time.format.DateTimeParserBucket.doParseMillis(DateTimeParserBucket.java:55)
	at org.joda.time.format.DateTimeFormatter.parseMillis(DateTimeFormatter.java:780)
	at org.joda.time.convert.StringConverter.getPartialValues(StringConverter.java:87)
	at org.joda.time.LocalTime.<init>(LocalTime.java:435)
	at org.joda.time.LocalTime.<init>(LocalTime.java:383)
	at org.joda.time.TestLocalTime_Constructors.testConstructor_ObjectString1NewYork(TestLocalTime_Constructors.java:383)

testConstructor_ObjectString_DateTimeZoneLondon(org.joda.time.TestLocalTime_Constructors)  Time elapsed: 0 sec  <<< ERROR!
java.lang.ArrayIndexOutOfBoundsException: -1
	at org.joda.time.format.DateTimeParserBucket.computeMillis(DateTimeParserBucket.java:109)
	at org.joda.time.format.DateTimeParserBucket.doParseMillis(DateTimeParserBucket.java:55)
	at org.joda.time.format.DateTimeFormatter.parseMillis(DateTimeFormatter.java:780)
	at org.joda.time.convert.StringConverter.getPartialValues(StringConverter.java:87)
	at org.joda.time.LocalTime.<init>(LocalTime.java:409)
	at org.joda.time.TestLocalTime_Constructors.testConstructor_ObjectString_DateTimeZoneLondon(TestLocalTime_Constructors.java:511)

testConstructor_ObjectString_DateTimeZoneTokyo(org.joda.time.TestLocalTime_Constructors)  Time elapsed: 0 sec  <<< ERROR!
java.lang.ArrayIndexOutOfBoundsException: -1
	at org.joda.time.format.DateTimeParserBucket.computeMillis(DateTimeParserBucket.java:109)
	at org.joda.time.format.DateTimeParserBucket.doParseMillis(DateTimeParserBucket.java:55)
	at org.joda.time.format.DateTimeFormatter.parseMillis(DateTimeFormatter.java:780)
	at org.joda.time.convert.StringConverter.getPartialValues(StringConverter.java:87)
	at org.joda.time.LocalTime.<init>(LocalTime.java:409)
	at org.joda.time.TestLocalTime_Constructors.testConstructor_ObjectString_DateTimeZoneTokyo(TestLocalTime_Constructors.java:517)

testConstructor_ObjectString_DateTimeZoneNewYork(org.joda.time.TestLocalTime_Constructors)  Time elapsed: 0 sec  <<< ERROR!
java.lang.ArrayIndexOutOfBoundsException: -1
	at org.joda.time.format.DateTimeParserBucket.computeMillis(DateTimeParserBucket.java:109)
	at org.joda.time.format.DateTimeParserBucket.doParseMillis(DateTimeParserBucket.java:55)
	at org.joda.time.format.DateTimeFormatter.parseMillis(DateTimeFormatter.java:780)
	at org.joda.time.convert.StringConverter.getPartialValues(StringConverter.java:87)
	at org.joda.time.LocalTime.<init>(LocalTime.java:409)
	at org.joda.time.TestLocalTime_Constructors.testConstructor_ObjectString_DateTimeZoneNewYork(TestLocalTime_Constructors.java:524)

testConstructor_Object2_Chronology(org.joda.time.TestLocalTime_Constructors)  Time elapsed: 0.001 sec  <<< ERROR!
java.lang.ArrayIndexOutOfBoundsException: -1
	at org.joda.time.format.DateTimeParserBucket.computeMillis(DateTimeParserBucket.java:109)
	at org.joda.time.format.DateTimeParserBucket.doParseMillis(DateTimeParserBucket.java:55)
	at org.joda.time.format.DateTimeFormatter.parseMillis(DateTimeFormatter.java:780)
	at org.joda.time.convert.StringConverter.getPartialValues(StringConverter.java:87)
	at org.joda.time.LocalTime.<init>(LocalTime.java:435)
	at org.joda.time.LocalTime.<init>(LocalTime.java:383)
	at org.joda.time.TestLocalTime_Constructors.testConstructor_Object2_Chronology(TestLocalTime_Constructors.java:570)

testParse_noFormatter(org.joda.time.TestMutableInterval_Constructors)  Time elapsed: 0.001 sec  <<< ERROR!
java.lang.ArrayIndexOutOfBoundsException: -1
	at org.joda.time.format.DateTimeParserBucket.computeMillis(DateTimeParserBucket.java:109)
	at org.joda.time.format.DateTimeParserBucket.computeMillis(DateTimeParserBucket.java:92)
	at org.joda.time.format.DateTimeFormatter.parseDateTime(DateTimeFormatter.java:882)
	at org.joda.time.convert.StringConverter.setInto(StringConverter.java:212)
	at org.joda.time.base.BaseInterval.<init>(BaseInterval.java:197)
	at org.joda.time.MutableInterval.<init>(MutableInterval.java:186)
	at org.joda.time.MutableInterval.parse(MutableInterval.java:71)
	at org.joda.time.TestMutableInterval_Constructors.testParse_noFormatter(TestMutableInterval_Constructors.java:114)

testConstructor_Object1(org.joda.time.TestMutableInterval_Constructors)  Time elapsed: 0.001 sec  <<< ERROR!
java.lang.ArrayIndexOutOfBoundsException: -1
	at org.joda.time.format.DateTimeParserBucket.computeMillis(DateTimeParserBucket.java:109)
	at org.joda.time.format.DateTimeParserBucket.computeMillis(DateTimeParserBucket.java:92)
	at org.joda.time.format.DateTimeFormatter.parseDateTime(DateTimeFormatter.java:882)
	at org.joda.time.convert.StringConverter.setInto(StringConverter.java:212)
	at org.joda.time.base.BaseInterval.<init>(BaseInterval.java:197)
	at org.joda.time.MutableInterval.<init>(MutableInterval.java:186)
	at org.joda.time.TestMutableInterval_Constructors.testConstructor_Object1(TestMutableInterval_Constructors.java:511)

testConstructor_ObjectString2(org.joda.time.TestTimeOfDay_Constructors)  Time elapsed: 0.002 sec  <<< ERROR!
java.lang.ArrayIndexOutOfBoundsException: -1
	at org.joda.time.format.DateTimeParserBucket.computeMillis(DateTimeParserBucket.java:109)
	at org.joda.time.format.DateTimeParserBucket.doParseMillis(DateTimeParserBucket.java:55)
	at org.joda.time.format.DateTimeFormatter.parseMillis(DateTimeFormatter.java:780)
	at org.joda.time.convert.StringConverter.getPartialValues(StringConverter.java:87)
	at org.joda.time.base.BasePartial.<init>(BasePartial.java:163)
	at org.joda.time.TimeOfDay.<init>(TimeOfDay.java:277)
	at org.joda.time.TestTimeOfDay_Constructors.testConstructor_ObjectString2(TestTimeOfDay_Constructors.java:374)

testConstructor_ObjectString3(org.joda.time.TestTimeOfDay_Constructors)  Time elapsed: 0 sec  <<< ERROR!
java.lang.ArrayIndexOutOfBoundsException: -1
	at org.joda.time.format.DateTimeParserBucket.computeMillis(DateTimeParserBucket.java:109)
	at org.joda.time.format.DateTimeParserBucket.doParseMillis(DateTimeParserBucket.java:55)
	at org.joda.time.format.DateTimeFormatter.parseMillis(DateTimeFormatter.java:780)
	at org.joda.time.convert.StringConverter.getPartialValues(StringConverter.java:87)
	at org.joda.time.base.BasePartial.<init>(BasePartial.java:163)
	at org.joda.time.TimeOfDay.<init>(TimeOfDay.java:277)
	at org.joda.time.TestTimeOfDay_Constructors.testConstructor_ObjectString3(TestTimeOfDay_Constructors.java:383)

testConstructor_ObjectString4(org.joda.time.TestTimeOfDay_Constructors)  Time elapsed: 0 sec  <<< ERROR!
java.lang.ArrayIndexOutOfBoundsException: -1
	at org.joda.time.format.DateTimeParserBucket.computeMillis(DateTimeParserBucket.java:109)
	at org.joda.time.format.DateTimeParserBucket.doParseMillis(DateTimeParserBucket.java:55)
	at org.joda.time.format.DateTimeFormatter.parseMillis(DateTimeFormatter.java:780)
	at org.joda.time.convert.StringConverter.getPartialValues(StringConverter.java:87)
	at org.joda.time.base.BasePartial.<init>(BasePartial.java:163)
	at org.joda.time.TimeOfDay.<init>(TimeOfDay.java:277)
	at org.joda.time.TestTimeOfDay_Constructors.testConstructor_ObjectString4(TestTimeOfDay_Constructors.java:392)

testConstructor_ObjectString5(org.joda.time.TestTimeOfDay_Constructors)  Time elapsed: 0 sec  <<< ERROR!
java.lang.ArrayIndexOutOfBoundsException: -1
	at org.joda.time.format.DateTimeParserBucket.computeMillis(DateTimeParserBucket.java:109)
	at org.joda.time.format.DateTimeParserBucket.doParseMillis(DateTimeParserBucket.java:55)
	at org.joda.time.format.DateTimeFormatter.parseMillis(DateTimeFormatter.java:780)
	at org.joda.time.convert.StringConverter.getPartialValues(StringConverter.java:87)
	at org.joda.time.base.BasePartial.<init>(BasePartial.java:163)
	at org.joda.time.TimeOfDay.<init>(TimeOfDay.java:277)
	at org.joda.time.TestTimeOfDay_Constructors.testConstructor_ObjectString5(TestTimeOfDay_Constructors.java:401)

testConstructor_ObjectString6(org.joda.time.TestTimeOfDay_Constructors)  Time elapsed: 0.001 sec  <<< ERROR!
java.lang.ArrayIndexOutOfBoundsException: -1
	at org.joda.time.format.DateTimeParserBucket.computeMillis(DateTimeParserBucket.java:109)
	at org.joda.time.format.DateTimeParserBucket.doParseMillis(DateTimeParserBucket.java:55)
	at org.joda.time.format.DateTimeFormatter.parseMillis(DateTimeFormatter.java:780)
	at org.joda.time.convert.StringConverter.getPartialValues(StringConverter.java:87)
	at org.joda.time.base.BasePartial.<init>(BasePartial.java:163)
	at org.joda.time.TimeOfDay.<init>(TimeOfDay.java:277)
	at org.joda.time.TestTimeOfDay_Constructors.testConstructor_ObjectString6(TestTimeOfDay_Constructors.java:410)

testConstructor_ObjectString1(org.joda.time.TestTimeOfDay_Constructors)  Time elapsed: 0.001 sec  <<< ERROR!
java.lang.ArrayIndexOutOfBoundsException: -1
	at org.joda.time.format.DateTimeParserBucket.computeMillis(DateTimeParserBucket.java:109)
	at org.joda.time.format.DateTimeParserBucket.doParseMillis(DateTimeParserBucket.java:55)
	at org.joda.time.format.DateTimeFormatter.parseMillis(DateTimeFormatter.java:780)
	at org.joda.time.convert.StringConverter.getPartialValues(StringConverter.java:87)
	at org.joda.time.base.BasePartial.<init>(BasePartial.java:163)
	at org.joda.time.TimeOfDay.<init>(TimeOfDay.java:277)
	at org.joda.time.TestTimeOfDay_Constructors.testConstructor_ObjectString1(TestTimeOfDay_Constructors.java:365)

testConstructor2_Object_Chronology(org.joda.time.TestTimeOfDay_Constructors)  Time elapsed: 0 sec  <<< ERROR!
java.lang.ArrayIndexOutOfBoundsException: -1
	at org.joda.time.format.DateTimeParserBucket.computeMillis(DateTimeParserBucket.java:109)
	at org.joda.time.format.DateTimeParserBucket.doParseMillis(DateTimeParserBucket.java:55)
	at org.joda.time.format.DateTimeFormatter.parseMillis(DateTimeFormatter.java:780)
	at org.joda.time.convert.StringConverter.getPartialValues(StringConverter.java:87)
	at org.joda.time.base.BasePartial.<init>(BasePartial.java:163)
	at org.joda.time.TimeOfDay.<init>(TimeOfDay.java:277)
	at org.joda.time.TestTimeOfDay_Constructors.testConstructor2_Object_Chronology(TestTimeOfDay_Constructors.java:464)

testConstructor_ObjectString2(org.joda.time.TestYearMonthDay_Constructors)  Time elapsed: 0.001 sec  <<< ERROR!
java.lang.ArrayIndexOutOfBoundsException: -1
	at org.joda.time.format.DateTimeParserBucket.computeMillis(DateTimeParserBucket.java:109)
	at org.joda.time.format.DateTimeParserBucket.doParseMillis(DateTimeParserBucket.java:55)
	at org.joda.time.format.DateTimeFormatter.parseMillis(DateTimeFormatter.java:780)
	at org.joda.time.convert.StringConverter.getPartialValues(StringConverter.java:87)
	at org.joda.time.base.BasePartial.<init>(BasePartial.java:163)
	at org.joda.time.YearMonthDay.<init>(YearMonthDay.java:231)
	at org.joda.time.TestYearMonthDay_Constructors.testConstructor_ObjectString2(TestYearMonthDay_Constructors.java:258)

testConstructor_ObjectString3(org.joda.time.TestYearMonthDay_Constructors)  Time elapsed: 0.001 sec  <<< ERROR!
java.lang.ArrayIndexOutOfBoundsException: -1
	at org.joda.time.format.DateTimeParserBucket.computeMillis(DateTimeParserBucket.java:109)
	at org.joda.time.format.DateTimeParserBucket.doParseMillis(DateTimeParserBucket.java:55)
	at org.joda.time.format.DateTimeFormatter.parseMillis(DateTimeFormatter.java:780)
	at org.joda.time.convert.StringConverter.getPartialValues(StringConverter.java:87)
	at org.joda.time.base.BasePartial.<init>(BasePartial.java:163)
	at org.joda.time.YearMonthDay.<init>(YearMonthDay.java:231)
	at org.joda.time.TestYearMonthDay_Constructors.testConstructor_ObjectString3(TestYearMonthDay_Constructors.java:266)

testConstructor_ObjectString4(org.joda.time.TestYearMonthDay_Constructors)  Time elapsed: 0.001 sec  <<< ERROR!
java.lang.ArrayIndexOutOfBoundsException: -1
	at org.joda.time.format.DateTimeParserBucket.computeMillis(DateTimeParserBucket.java:109)
	at org.joda.time.format.DateTimeParserBucket.doParseMillis(DateTimeParserBucket.java:55)
	at org.joda.time.format.DateTimeFormatter.parseMillis(DateTimeFormatter.java:780)
	at org.joda.time.convert.StringConverter.getPartialValues(StringConverter.java:87)
	at org.joda.time.base.BasePartial.<init>(BasePartial.java:163)
	at org.joda.time.YearMonthDay.<init>(YearMonthDay.java:231)
	at org.joda.time.TestYearMonthDay_Constructors.testConstructor_ObjectString4(TestYearMonthDay_Constructors.java:274)

testConstructor_ObjectString5(org.joda.time.TestYearMonthDay_Constructors)  Time elapsed: 0 sec  <<< ERROR!
java.lang.ArrayIndexOutOfBoundsException: -1
	at org.joda.time.format.DateTimeParserBucket.computeMillis(DateTimeParserBucket.java:109)
	at org.joda.time.format.DateTimeParserBucket.doParseMillis(DateTimeParserBucket.java:55)
	at org.joda.time.format.DateTimeFormatter.parseMillis(DateTimeFormatter.java:780)
	at org.joda.time.convert.StringConverter.getPartialValues(StringConverter.java:87)
	at org.joda.time.base.BasePartial.<init>(BasePartial.java:163)
	at org.joda.time.YearMonthDay.<init>(YearMonthDay.java:231)
	at org.joda.time.TestYearMonthDay_Constructors.testConstructor_ObjectString5(TestYearMonthDay_Constructors.java:282)

testConstructor_ObjectString1(org.joda.time.TestYearMonthDay_Constructors)  Time elapsed: 0.001 sec  <<< ERROR!
java.lang.ArrayIndexOutOfBoundsException: -1
	at org.joda.time.format.DateTimeParserBucket.computeMillis(DateTimeParserBucket.java:109)
	at org.joda.time.format.DateTimeParserBucket.doParseMillis(DateTimeParserBucket.java:55)
	at org.joda.time.format.DateTimeFormatter.parseMillis(DateTimeFormatter.java:780)
	at org.joda.time.convert.StringConverter.getPartialValues(StringConverter.java:87)
	at org.joda.time.base.BasePartial.<init>(BasePartial.java:163)
	at org.joda.time.YearMonthDay.<init>(YearMonthDay.java:231)
	at org.joda.time.TestYearMonthDay_Constructors.testConstructor_ObjectString1(TestYearMonthDay_Constructors.java:250)

testConstructor_ObjectString5(org.joda.time.TestYearMonth_Constructors)  Time elapsed: 0 sec  <<< ERROR!
java.lang.ArrayIndexOutOfBoundsException: -1
	at org.joda.time.format.DateTimeParserBucket.computeMillis(DateTimeParserBucket.java:109)
	at org.joda.time.format.DateTimeParserBucket.doParseMillis(DateTimeParserBucket.java:55)
	at org.joda.time.format.DateTimeFormatter.parseMillis(DateTimeFormatter.java:780)
	at org.joda.time.convert.StringConverter.getPartialValues(StringConverter.java:87)
	at org.joda.time.base.BasePartial.<init>(BasePartial.java:163)
	at org.joda.time.YearMonth.<init>(YearMonth.java:289)
	at org.joda.time.TestYearMonth_Constructors.testConstructor_ObjectString5(TestYearMonth_Constructors.java:260)

testConstructor_ObjectString1(org.joda.time.TestYearMonth_Constructors)  Time elapsed: 0.001 sec  <<< ERROR!
java.lang.ArrayIndexOutOfBoundsException: -1
	at org.joda.time.format.DateTimeParserBucket.computeMillis(DateTimeParserBucket.java:109)
	at org.joda.time.format.DateTimeParserBucket.doParseMillis(DateTimeParserBucket.java:55)
	at org.joda.time.format.DateTimeFormatter.parseMillis(DateTimeFormatter.java:780)
	at org.joda.time.convert.StringConverter.getPartialValues(StringConverter.java:87)
	at org.joda.time.base.BasePartial.<init>(BasePartial.java:163)
	at org.joda.time.YearMonth.<init>(YearMonth.java:289)
	at org.joda.time.TestYearMonth_Constructors.testConstructor_ObjectString1(TestYearMonth_Constructors.java:253)

testParse_noFormatter(org.joda.time.TestYearMonth_Constructors)  Time elapsed: 0.001 sec  <<< ERROR!
java.lang.ArrayIndexOutOfBoundsException: -1
	at org.joda.time.format.DateTimeParserBucket.computeMillis(DateTimeParserBucket.java:109)
	at org.joda.time.format.DateTimeParserBucket.computeMillis(DateTimeParserBucket.java:92)
	at org.joda.time.format.DateTimeFormatter.parseLocalDateTime(DateTimeFormatter.java:841)
	at org.joda.time.format.DateTimeFormatter.parseLocalDate(DateTimeFormatter.java:798)
	at org.joda.time.YearMonth.parse(YearMonth.java:152)
	at org.joda.time.YearMonth.parse(YearMonth.java:141)
	at org.joda.time.TestYearMonth_Constructors.testParse_noFormatter(TestYearMonth_Constructors.java:84)

testParse_formatter(org.joda.time.TestYearMonth_Constructors)  Time elapsed: 0 sec  <<< ERROR!
java.lang.ArrayIndexOutOfBoundsException: -1
	at org.joda.time.format.DateTimeParserBucket.computeMillis(DateTimeParserBucket.java:109)
	at org.joda.time.format.DateTimeParserBucket.computeMillis(DateTimeParserBucket.java:92)
	at org.joda.time.format.DateTimeFormatter.parseLocalDateTime(DateTimeFormatter.java:841)
	at org.joda.time.format.DateTimeFormatter.parseLocalDate(DateTimeFormatter.java:798)
	at org.joda.time.YearMonth.parse(YearMonth.java:152)
	at org.joda.time.TestYearMonth_Constructors.testParse_formatter(TestYearMonth_Constructors.java:90)

testConstructor_ObjectString5(org.joda.time.TestMonthDay_Constructors)  Time elapsed: 0 sec  <<< ERROR!
java.lang.ArrayIndexOutOfBoundsException: -1
	at org.joda.time.format.DateTimeParserBucket.computeMillis(DateTimeParserBucket.java:109)
	at org.joda.time.format.DateTimeParserBucket.doParseMillis(DateTimeParserBucket.java:55)
	at org.joda.time.format.DateTimeFormatter.parseMillis(DateTimeFormatter.java:780)
	at org.joda.time.convert.StringConverter.getPartialValues(StringConverter.java:87)
	at org.joda.time.base.BasePartial.<init>(BasePartial.java:163)
	at org.joda.time.MonthDay.<init>(MonthDay.java:297)
	at org.joda.time.TestMonthDay_Constructors.testConstructor_ObjectString5(TestMonthDay_Constructors.java:260)

testConstructor_ObjectString1(org.joda.time.TestMonthDay_Constructors)  Time elapsed: 0 sec  <<< ERROR!
java.lang.ArrayIndexOutOfBoundsException: -1
	at org.joda.time.format.DateTimeParserBucket.computeMillis(DateTimeParserBucket.java:109)
	at org.joda.time.format.DateTimeParserBucket.doParseMillis(DateTimeParserBucket.java:55)
	at org.joda.time.format.DateTimeFormatter.parseMillis(DateTimeFormatter.java:780)
	at org.joda.time.convert.StringConverter.getPartialValues(StringConverter.java:87)
	at org.joda.time.base.BasePartial.<init>(BasePartial.java:163)
	at org.joda.time.MonthDay.<init>(MonthDay.java:297)
	at org.joda.time.TestMonthDay_Constructors.testConstructor_ObjectString1(TestMonthDay_Constructors.java:253)

testParse_noFormatter(org.joda.time.TestMonthDay_Constructors)  Time elapsed: 0 sec  <<< ERROR!
java.lang.ArrayIndexOutOfBoundsException: -1
	at org.joda.time.format.DateTimeParserBucket.computeMillis(DateTimeParserBucket.java:109)
	at org.joda.time.format.DateTimeParserBucket.computeMillis(DateTimeParserBucket.java:102)
	at org.joda.time.format.DateTimeParserBucket.computeMillis(DateTimeParserBucket.java:92)
	at org.joda.time.format.DateTimeFormatter.parseLocalDateTime(DateTimeFormatter.java:841)
	at org.joda.time.format.DateTimeFormatter.parseLocalDate(DateTimeFormatter.java:798)
	at org.joda.time.MonthDay.parse(MonthDay.java:160)
	at org.joda.time.MonthDay.parse(MonthDay.java:149)
	at org.joda.time.TestMonthDay_Constructors.testParse_noFormatter(TestMonthDay_Constructors.java:82)

testParse_formatter(org.joda.time.TestMonthDay_Constructors)  Time elapsed: 0 sec  <<< ERROR!
java.lang.ArrayIndexOutOfBoundsException: -1
	at org.joda.time.format.DateTimeParserBucket.computeMillis(DateTimeParserBucket.java:109)
	at org.joda.time.format.DateTimeParserBucket.computeMillis(DateTimeParserBucket.java:92)
	at org.joda.time.format.DateTimeFormatter.parseLocalDateTime(DateTimeFormatter.java:841)
	at org.joda.time.format.DateTimeFormatter.parseLocalDate(DateTimeFormatter.java:798)
	at org.joda.time.MonthDay.parse(MonthDay.java:160)
	at org.joda.time.TestMonthDay_Constructors.testParse_formatter(TestMonthDay_Constructors.java:90)

testSecond(org.joda.time.TestDateTimeComparator)  Time elapsed: 0.001 sec  <<< ERROR!
java.lang.ArrayIndexOutOfBoundsException: -1
	at org.joda.time.format.DateTimeParserBucket.computeMillis(DateTimeParserBucket.java:109)
	at org.joda.time.format.DateTimeParserBucket.doParseMillis(DateTimeParserBucket.java:55)
	at org.joda.time.format.DateTimeFormatter.parseMillis(DateTimeFormatter.java:780)
	at org.joda.time.convert.StringConverter.getInstantMillis(StringConverter.java:65)
	at org.joda.time.base.BaseDateTime.<init>(BaseDateTime.java:154)
	at org.joda.time.DateTime.<init>(DateTime.java:281)
	at org.joda.time.TestDateTimeComparator.getADate(TestDateTimeComparator.java:906)
	at org.joda.time.TestDateTimeComparator.testSecond(TestDateTimeComparator.java:434)

testMinute(org.joda.time.TestDateTimeComparator)  Time elapsed: 0 sec  <<< ERROR!
java.lang.ArrayIndexOutOfBoundsException: -1
	at org.joda.time.format.DateTimeParserBucket.computeMillis(DateTimeParserBucket.java:109)
	at org.joda.time.format.DateTimeParserBucket.doParseMillis(DateTimeParserBucket.java:55)
	at org.joda.time.format.DateTimeFormatter.parseMillis(DateTimeFormatter.java:780)
	at org.joda.time.convert.StringConverter.getInstantMillis(StringConverter.java:65)
	at org.joda.time.base.BaseDateTime.<init>(BaseDateTime.java:154)
	at org.joda.time.DateTime.<init>(DateTime.java:281)
	at org.joda.time.TestDateTimeComparator.getADate(TestDateTimeComparator.java:906)
	at org.joda.time.TestDateTimeComparator.testMinute(TestDateTimeComparator.java:448)

testHour(org.joda.time.TestDateTimeComparator)  Time elapsed: 0 sec  <<< ERROR!
java.lang.ArrayIndexOutOfBoundsException: -1
	at org.joda.time.format.DateTimeParserBucket.computeMillis(DateTimeParserBucket.java:109)
	at org.joda.time.format.DateTimeParserBucket.doParseMillis(DateTimeParserBucket.java:55)
	at org.joda.time.format.DateTimeFormatter.parseMillis(DateTimeFormatter.java:780)
	at org.joda.time.convert.StringConverter.getInstantMillis(StringConverter.java:65)
	at org.joda.time.base.BaseDateTime.<init>(BaseDateTime.java:154)
	at org.joda.time.DateTime.<init>(DateTime.java:281)
	at org.joda.time.TestDateTimeComparator.getADate(TestDateTimeComparator.java:906)
	at org.joda.time.TestDateTimeComparator.testHour(TestDateTimeComparator.java:462)

testDOW(org.joda.time.TestDateTimeComparator)  Time elapsed: 0.001 sec  <<< ERROR!
java.lang.ArrayIndexOutOfBoundsException: -1
	at org.joda.time.format.DateTimeParserBucket.computeMillis(DateTimeParserBucket.java:109)
	at org.joda.time.format.DateTimeParserBucket.doParseMillis(DateTimeParserBucket.java:55)
	at org.joda.time.format.DateTimeFormatter.parseMillis(DateTimeFormatter.java:780)
	at org.joda.time.convert.StringConverter.getInstantMillis(StringConverter.java:65)
	at org.joda.time.base.BaseDateTime.<init>(BaseDateTime.java:154)
	at org.joda.time.DateTime.<init>(DateTime.java:281)
	at org.joda.time.TestDateTimeComparator.getADate(TestDateTimeComparator.java:906)
	at org.joda.time.TestDateTimeComparator.testDOW(TestDateTimeComparator.java:484)

testDOM(org.joda.time.TestDateTimeComparator)  Time elapsed: 0.001 sec  <<< ERROR!
java.lang.ArrayIndexOutOfBoundsException: -1
	at org.joda.time.format.DateTimeParserBucket.computeMillis(DateTimeParserBucket.java:109)
	at org.joda.time.format.DateTimeParserBucket.doParseMillis(DateTimeParserBucket.java:55)
	at org.joda.time.format.DateTimeFormatter.parseMillis(DateTimeFormatter.java:780)
	at org.joda.time.convert.StringConverter.getInstantMillis(StringConverter.java:65)
	at org.joda.time.base.BaseDateTime.<init>(BaseDateTime.java:154)
	at org.joda.time.DateTime.<init>(DateTime.java:281)
	at org.joda.time.TestDateTimeComparator.getADate(TestDateTimeComparator.java:906)
	at org.joda.time.TestDateTimeComparator.testDOM(TestDateTimeComparator.java:494)

testDOY(org.joda.time.TestDateTimeComparator)  Time elapsed: 0.001 sec  <<< ERROR!
java.lang.ArrayIndexOutOfBoundsException: -1
	at org.joda.time.format.DateTimeParserBucket.computeMillis(DateTimeParserBucket.java:109)
	at org.joda.time.format.DateTimeParserBucket.doParseMillis(DateTimeParserBucket.java:55)
	at org.joda.time.format.DateTimeFormatter.parseMillis(DateTimeFormatter.java:780)
	at org.joda.time.convert.StringConverter.getInstantMillis(StringConverter.java:65)
	at org.joda.time.base.BaseDateTime.<init>(BaseDateTime.java:154)
	at org.joda.time.DateTime.<init>(DateTime.java:281)
	at org.joda.time.TestDateTimeComparator.getADate(TestDateTimeComparator.java:906)
	at org.joda.time.TestDateTimeComparator.testDOY(TestDateTimeComparator.java:508)

testWOW(org.joda.time.TestDateTimeComparator)  Time elapsed: 0 sec  <<< ERROR!
java.lang.ArrayIndexOutOfBoundsException: -1
	at org.joda.time.format.DateTimeParserBucket.computeMillis(DateTimeParserBucket.java:109)
	at org.joda.time.format.DateTimeParserBucket.doParseMillis(DateTimeParserBucket.java:55)
	at org.joda.time.format.DateTimeFormatter.parseMillis(DateTimeFormatter.java:780)
	at org.joda.time.convert.StringConverter.getInstantMillis(StringConverter.java:65)
	at org.joda.time.base.BaseDateTime.<init>(BaseDateTime.java:154)
	at org.joda.time.DateTime.<init>(DateTime.java:281)
	at org.joda.time.TestDateTimeComparator.getADate(TestDateTimeComparator.java:906)
	at org.joda.time.TestDateTimeComparator.testWOW(TestDateTimeComparator.java:523)

testWOYY(org.joda.time.TestDateTimeComparator)  Time elapsed: 0 sec  <<< ERROR!
java.lang.ArrayIndexOutOfBoundsException: -1
	at org.joda.time.format.DateTimeParserBucket.computeMillis(DateTimeParserBucket.java:109)
	at org.joda.time.format.DateTimeParserBucket.doParseMillis(DateTimeParserBucket.java:55)
	at org.joda.time.format.DateTimeFormatter.parseMillis(DateTimeFormatter.java:780)
	at org.joda.time.convert.StringConverter.getInstantMillis(StringConverter.java:65)
	at org.joda.time.base.BaseDateTime.<init>(BaseDateTime.java:154)
	at org.joda.time.DateTime.<init>(DateTime.java:281)
	at org.joda.time.TestDateTimeComparator.getADate(TestDateTimeComparator.java:906)
	at org.joda.time.TestDateTimeComparator.testWOYY(TestDateTimeComparator.java:543)

testMonth(org.joda.time.TestDateTimeComparator)  Time elapsed: 0.001 sec  <<< ERROR!
java.lang.ArrayIndexOutOfBoundsException: -1
	at org.joda.time.format.DateTimeParserBucket.computeMillis(DateTimeParserBucket.java:109)
	at org.joda.time.format.DateTimeParserBucket.doParseMillis(DateTimeParserBucket.java:55)
	at org.joda.time.format.DateTimeFormatter.parseMillis(DateTimeFormatter.java:780)
	at org.joda.time.convert.StringConverter.getInstantMillis(StringConverter.java:65)
	at org.joda.time.base.BaseDateTime.<init>(BaseDateTime.java:154)
	at org.joda.time.DateTime.<init>(DateTime.java:281)
	at org.joda.time.TestDateTimeComparator.getADate(TestDateTimeComparator.java:906)
	at org.joda.time.TestDateTimeComparator.testMonth(TestDateTimeComparator.java:555)

testYear(org.joda.time.TestDateTimeComparator)  Time elapsed: 0.001 sec  <<< ERROR!
java.lang.ArrayIndexOutOfBoundsException: -1
	at org.joda.time.format.DateTimeParserBucket.computeMillis(DateTimeParserBucket.java:109)
	at org.joda.time.format.DateTimeParserBucket.doParseMillis(DateTimeParserBucket.java:55)
	at org.joda.time.format.DateTimeFormatter.parseMillis(DateTimeFormatter.java:780)
	at org.joda.time.convert.StringConverter.getInstantMillis(StringConverter.java:65)
	at org.joda.time.base.BaseDateTime.<init>(BaseDateTime.java:154)
	at org.joda.time.DateTime.<init>(DateTime.java:281)
	at org.joda.time.TestDateTimeComparator.getADate(TestDateTimeComparator.java:906)
	at org.joda.time.TestDateTimeComparator.testYear(TestDateTimeComparator.java:569)

testListBasic(org.joda.time.TestDateTimeComparator)  Time elapsed: 0.001 sec  <<< ERROR!
java.lang.ArrayIndexOutOfBoundsException: -1
	at org.joda.time.format.DateTimeParserBucket.computeMillis(DateTimeParserBucket.java:109)
	at org.joda.time.format.DateTimeParserBucket.doParseMillis(DateTimeParserBucket.java:55)
	at org.joda.time.format.DateTimeFormatter.parseMillis(DateTimeFormatter.java:780)
	at org.joda.time.convert.StringConverter.getInstantMillis(StringConverter.java:65)
	at org.joda.time.base.BaseDateTime.<init>(BaseDateTime.java:154)
	at org.joda.time.DateTime.<init>(DateTime.java:281)
	at org.joda.time.TestDateTimeComparator.loadAList(TestDateTimeComparator.java:920)
	at org.joda.time.TestDateTimeComparator.testListBasic(TestDateTimeComparator.java:596)

testListSecond(org.joda.time.TestDateTimeComparator)  Time elapsed: 0.001 sec  <<< ERROR!
java.lang.ArrayIndexOutOfBoundsException: -1
	at org.joda.time.format.DateTimeParserBucket.computeMillis(DateTimeParserBucket.java:109)
	at org.joda.time.format.DateTimeParserBucket.doParseMillis(DateTimeParserBucket.java:55)
	at org.joda.time.format.DateTimeFormatter.parseMillis(DateTimeFormatter.java:780)
	at org.joda.time.convert.StringConverter.getInstantMillis(StringConverter.java:65)
	at org.joda.time.base.BaseDateTime.<init>(BaseDateTime.java:154)
	at org.joda.time.DateTime.<init>(DateTime.java:281)
	at org.joda.time.TestDateTimeComparator.loadAList(TestDateTimeComparator.java:920)
	at org.joda.time.TestDateTimeComparator.testListSecond(TestDateTimeComparator.java:638)

testListMinute(org.joda.time.TestDateTimeComparator)  Time elapsed: 0 sec  <<< ERROR!
java.lang.ArrayIndexOutOfBoundsException: -1
	at org.joda.time.format.DateTimeParserBucket.computeMillis(DateTimeParserBucket.java:109)
	at org.joda.time.format.DateTimeParserBucket.doParseMillis(DateTimeParserBucket.java:55)
	at org.joda.time.format.DateTimeFormatter.parseMillis(DateTimeFormatter.java:780)
	at org.joda.time.convert.StringConverter.getInstantMillis(StringConverter.java:65)
	at org.joda.time.base.BaseDateTime.<init>(BaseDateTime.java:154)
	at org.joda.time.DateTime.<init>(DateTime.java:281)
	at org.joda.time.TestDateTimeComparator.loadAList(TestDateTimeComparator.java:920)
	at org.joda.time.TestDateTimeComparator.testListMinute(TestDateTimeComparator.java:659)

testListHour(org.joda.time.TestDateTimeComparator)  Time elapsed: 0 sec  <<< ERROR!
java.lang.ArrayIndexOutOfBoundsException: -1
	at org.joda.time.format.DateTimeParserBucket.computeMillis(DateTimeParserBucket.java:109)
	at org.joda.time.format.DateTimeParserBucket.doParseMillis(DateTimeParserBucket.java:55)
	at org.joda.time.format.DateTimeFormatter.parseMillis(DateTimeFormatter.java:780)
	at org.joda.time.convert.StringConverter.getInstantMillis(StringConverter.java:65)
	at org.joda.time.base.BaseDateTime.<init>(BaseDateTime.java:154)
	at org.joda.time.DateTime.<init>(DateTime.java:281)
	at org.joda.time.TestDateTimeComparator.loadAList(TestDateTimeComparator.java:920)
	at org.joda.time.TestDateTimeComparator.testListHour(TestDateTimeComparator.java:680)

testListDOW(org.joda.time.TestDateTimeComparator)  Time elapsed: 0.001 sec  <<< ERROR!
java.lang.ArrayIndexOutOfBoundsException: -1
	at org.joda.time.format.DateTimeParserBucket.computeMillis(DateTimeParserBucket.java:109)
	at org.joda.time.format.DateTimeParserBucket.doParseMillis(DateTimeParserBucket.java:55)
	at org.joda.time.format.DateTimeFormatter.parseMillis(DateTimeFormatter.java:780)
	at org.joda.time.convert.StringConverter.getInstantMillis(StringConverter.java:65)
	at org.joda.time.base.BaseDateTime.<init>(BaseDateTime.java:154)
	at org.joda.time.DateTime.<init>(DateTime.java:281)
	at org.joda.time.TestDateTimeComparator.loadAList(TestDateTimeComparator.java:920)
	at org.joda.time.TestDateTimeComparator.testListDOW(TestDateTimeComparator.java:703)

testListDOM(org.joda.time.TestDateTimeComparator)  Time elapsed: 0 sec  <<< ERROR!
java.lang.ArrayIndexOutOfBoundsException: -1
	at org.joda.time.format.DateTimeParserBucket.computeMillis(DateTimeParserBucket.java:109)
	at org.joda.time.format.DateTimeParserBucket.doParseMillis(DateTimeParserBucket.java:55)
	at org.joda.time.format.DateTimeFormatter.parseMillis(DateTimeFormatter.java:780)
	at org.joda.time.convert.StringConverter.getInstantMillis(StringConverter.java:65)
	at org.joda.time.base.BaseDateTime.<init>(BaseDateTime.java:154)
	at org.joda.time.DateTime.<init>(DateTime.java:281)
	at org.joda.time.TestDateTimeComparator.loadAList(TestDateTimeComparator.java:920)
	at org.joda.time.TestDateTimeComparator.testListDOM(TestDateTimeComparator.java:725)

testListDOY(org.joda.time.TestDateTimeComparator)  Time elapsed: 0.001 sec  <<< ERROR!
java.lang.ArrayIndexOutOfBoundsException: -1
	at org.joda.time.format.DateTimeParserBucket.computeMillis(DateTimeParserBucket.java:109)
	at org.joda.time.format.DateTimeParserBucket.doParseMillis(DateTimeParserBucket.java:55)
	at org.joda.time.format.DateTimeFormatter.parseMillis(DateTimeFormatter.java:780)
	at org.joda.time.convert.StringConverter.getInstantMillis(StringConverter.java:65)
	at org.joda.time.base.BaseDateTime.<init>(BaseDateTime.java:154)
	at org.joda.time.DateTime.<init>(DateTime.java:281)
	at org.joda.time.TestDateTimeComparator.loadAList(TestDateTimeComparator.java:920)
	at org.joda.time.TestDateTimeComparator.testListDOY(TestDateTimeComparator.java:746)

testListWOW(org.joda.time.TestDateTimeComparator)  Time elapsed: 0 sec  <<< ERROR!
java.lang.ArrayIndexOutOfBoundsException: -1
	at org.joda.time.format.DateTimeParserBucket.computeMillis(DateTimeParserBucket.java:109)
	at org.joda.time.format.DateTimeParserBucket.doParseMillis(DateTimeParserBucket.java:55)
	at org.joda.time.format.DateTimeFormatter.parseMillis(DateTimeFormatter.java:780)
	at org.joda.time.convert.StringConverter.getInstantMillis(StringConverter.java:65)
	at org.joda.time.base.BaseDateTime.<init>(BaseDateTime.java:154)
	at org.joda.time.DateTime.<init>(DateTime.java:281)
	at org.joda.time.TestDateTimeComparator.loadAList(TestDateTimeComparator.java:920)
	at org.joda.time.TestDateTimeComparator.testListWOW(TestDateTimeComparator.java:767)

testListYOYY(org.joda.time.TestDateTimeComparator)  Time elapsed: 0.001 sec  <<< ERROR!
java.lang.ArrayIndexOutOfBoundsException: -1
	at org.joda.time.format.DateTimeParserBucket.computeMillis(DateTimeParserBucket.java:109)
	at org.joda.time.format.DateTimeParserBucket.doParseMillis(DateTimeParserBucket.java:55)
	at org.joda.time.format.DateTimeFormatter.parseMillis(DateTimeFormatter.java:780)
	at org.joda.time.convert.StringConverter.getInstantMillis(StringConverter.java:65)
	at org.joda.time.base.BaseDateTime.<init>(BaseDateTime.java:154)
	at org.joda.time.DateTime.<init>(DateTime.java:281)
	at org.joda.time.TestDateTimeComparator.loadAList(TestDateTimeComparator.java:920)
	at org.joda.time.TestDateTimeComparator.testListYOYY(TestDateTimeComparator.java:784)

testListMonth(org.joda.time.TestDateTimeComparator)  Time elapsed: 0 sec  <<< ERROR!
java.lang.ArrayIndexOutOfBoundsException: -1
	at org.joda.time.format.DateTimeParserBucket.computeMillis(DateTimeParserBucket.java:109)
	at org.joda.time.format.DateTimeParserBucket.doParseMillis(DateTimeParserBucket.java:55)
	at org.joda.time.format.DateTimeFormatter.parseMillis(DateTimeFormatter.java:780)
	at org.joda.time.convert.StringConverter.getInstantMillis(StringConverter.java:65)
	at org.joda.time.base.BaseDateTime.<init>(BaseDateTime.java:154)
	at org.joda.time.DateTime.<init>(DateTime.java:281)
	at org.joda.time.TestDateTimeComparator.loadAList(TestDateTimeComparator.java:920)
	at org.joda.time.TestDateTimeComparator.testListMonth(TestDateTimeComparator.java:806)

testListYear(org.joda.time.TestDateTimeComparator)  Time elapsed: 0.001 sec  <<< ERROR!
java.lang.ArrayIndexOutOfBoundsException: -1
	at org.joda.time.format.DateTimeParserBucket.computeMillis(DateTimeParserBucket.java:109)
	at org.joda.time.format.DateTimeParserBucket.doParseMillis(DateTimeParserBucket.java:55)
	at org.joda.time.format.DateTimeFormatter.parseMillis(DateTimeFormatter.java:780)
	at org.joda.time.convert.StringConverter.getInstantMillis(StringConverter.java:65)
	at org.joda.time.base.BaseDateTime.<init>(BaseDateTime.java:154)
	at org.joda.time.DateTime.<init>(DateTime.java:281)
	at org.joda.time.TestDateTimeComparator.loadAList(TestDateTimeComparator.java:920)
	at org.joda.time.TestDateTimeComparator.testListYear(TestDateTimeComparator.java:827)

testListDate(org.joda.time.TestDateTimeComparator)  Time elapsed: 0 sec  <<< ERROR!
java.lang.ArrayIndexOutOfBoundsException: -1
	at org.joda.time.format.DateTimeParserBucket.computeMillis(DateTimeParserBucket.java:109)
	at org.joda.time.format.DateTimeParserBucket.doParseMillis(DateTimeParserBucket.java:55)
	at org.joda.time.format.DateTimeFormatter.parseMillis(DateTimeFormatter.java:780)
	at org.joda.time.convert.StringConverter.getInstantMillis(StringConverter.java:65)
	at org.joda.time.base.BaseDateTime.<init>(BaseDateTime.java:154)
	at org.joda.time.DateTime.<init>(DateTime.java:281)
	at org.joda.time.TestDateTimeComparator.loadAList(TestDateTimeComparator.java:920)
	at org.joda.time.TestDateTimeComparator.testListDate(TestDateTimeComparator.java:848)

testListTime(org.joda.time.TestDateTimeComparator)  Time elapsed: 0.001 sec  <<< ERROR!
java.lang.ArrayIndexOutOfBoundsException: -1
	at org.joda.time.format.DateTimeParserBucket.computeMillis(DateTimeParserBucket.java:109)
	at org.joda.time.format.DateTimeParserBucket.doParseMillis(DateTimeParserBucket.java:55)
	at org.joda.time.format.DateTimeFormatter.parseMillis(DateTimeFormatter.java:780)
	at org.joda.time.convert.StringConverter.getInstantMillis(StringConverter.java:65)
	at org.joda.time.base.BaseDateTime.<init>(BaseDateTime.java:154)
	at org.joda.time.DateTime.<init>(DateTime.java:281)
	at org.joda.time.TestDateTimeComparator.loadAList(TestDateTimeComparator.java:920)
	at org.joda.time.TestDateTimeComparator.testListTime(TestDateTimeComparator.java:869)

testNullDT(org.joda.time.TestDateTimeComparator)  Time elapsed: 0 sec  <<< ERROR!
java.lang.ArrayIndexOutOfBoundsException: -1
	at org.joda.time.format.DateTimeParserBucket.computeMillis(DateTimeParserBucket.java:109)
	at org.joda.time.format.DateTimeParserBucket.doParseMillis(DateTimeParserBucket.java:55)
	at org.joda.time.format.DateTimeFormatter.parseMillis(DateTimeFormatter.java:780)
	at org.joda.time.convert.StringConverter.getInstantMillis(StringConverter.java:65)
	at org.joda.time.base.BaseDateTime.<init>(BaseDateTime.java:154)
	at org.joda.time.DateTime.<init>(DateTime.java:281)
	at org.joda.time.TestDateTimeComparator.getADate(TestDateTimeComparator.java:906)
	at org.joda.time.TestDateTimeComparator.testNullDT(TestDateTimeComparator.java:882)

testInvalidObj(org.joda.time.TestDateTimeComparator)  Time elapsed: 0.001 sec  <<< ERROR!
java.lang.ArrayIndexOutOfBoundsException: -1
	at org.joda.time.format.DateTimeParserBucket.computeMillis(DateTimeParserBucket.java:109)
	at org.joda.time.format.DateTimeParserBucket.doParseMillis(DateTimeParserBucket.java:55)
	at org.joda.time.format.DateTimeFormatter.parseMillis(DateTimeFormatter.java:780)
	at org.joda.time.convert.StringConverter.getInstantMillis(StringConverter.java:65)
	at org.joda.time.base.BaseDateTime.<init>(BaseDateTime.java:154)
	at org.joda.time.DateTime.<init>(DateTime.java:281)
	at org.joda.time.TestDateTimeComparator.getADate(TestDateTimeComparator.java:906)
	at org.joda.time.TestDateTimeComparator.testInvalidObj(TestDateTimeComparator.java:891)

test_DateTime_parse_Gaza(org.joda.time.TestDateTimeZoneCutover)  Time elapsed: 0.001 sec  <<< ERROR!
java.lang.ArrayIndexOutOfBoundsException: -1
	at org.joda.time.format.DateTimeParserBucket.computeMillis(DateTimeParserBucket.java:109)
	at org.joda.time.format.DateTimeParserBucket.doParseMillis(DateTimeParserBucket.java:55)
	at org.joda.time.format.DateTimeFormatter.parseMillis(DateTimeFormatter.java:780)
	at org.joda.time.convert.StringConverter.getInstantMillis(StringConverter.java:65)
	at org.joda.time.base.BaseDateTime.<init>(BaseDateTime.java:154)
	at org.joda.time.DateTime.<init>(DateTime.java:281)
	at org.joda.time.TestDateTimeZoneCutover.test_DateTime_parse_Gaza(TestDateTimeZoneCutover.java:254)

testPeriod(org.joda.time.TestDateTimeZoneCutover)  Time elapsed: 0.001 sec  <<< ERROR!
java.lang.ArrayIndexOutOfBoundsException: -1
	at org.joda.time.format.DateTimeParserBucket.computeMillis(DateTimeParserBucket.java:109)
	at org.joda.time.format.DateTimeParserBucket.doParseMillis(DateTimeParserBucket.java:55)
	at org.joda.time.format.DateTimeFormatter.parseMillis(DateTimeFormatter.java:780)
	at org.joda.time.convert.StringConverter.getInstantMillis(StringConverter.java:65)
	at org.joda.time.base.BaseDateTime.<init>(BaseDateTime.java:154)
	at org.joda.time.DateTime.<init>(DateTime.java:281)
	at org.joda.time.TestDateTimeZoneCutover.testPeriod(TestDateTimeZoneCutover.java:1247)

test_DateTime_parse_Turk(org.joda.time.TestDateTimeZoneCutover)  Time elapsed: 0.001 sec  <<< ERROR!
java.lang.ArrayIndexOutOfBoundsException: -1
	at org.joda.time.format.DateTimeParserBucket.computeMillis(DateTimeParserBucket.java:109)
	at org.joda.time.format.DateTimeParserBucket.doParseMillis(DateTimeParserBucket.java:55)
	at org.joda.time.format.DateTimeFormatter.parseMillis(DateTimeFormatter.java:780)
	at org.joda.time.convert.StringConverter.getInstantMillis(StringConverter.java:65)
	at org.joda.time.base.BaseDateTime.<init>(BaseDateTime.java:154)
	at org.joda.time.DateTime.<init>(DateTime.java:281)
	at org.joda.time.TestDateTimeZoneCutover.test_DateTime_parse_Turk(TestDateTimeZoneCutover.java:470)

testWithHourOfDayInDstChange(org.joda.time.TestDateTimeZoneCutover)  Time elapsed: 0.001 sec  <<< ERROR!
java.lang.ArrayIndexOutOfBoundsException: -1
	at org.joda.time.format.DateTimeParserBucket.computeMillis(DateTimeParserBucket.java:109)
	at org.joda.time.format.DateTimeParserBucket.doParseMillis(DateTimeParserBucket.java:55)
	at org.joda.time.format.DateTimeFormatter.parseMillis(DateTimeFormatter.java:780)
	at org.joda.time.convert.StringConverter.getInstantMillis(StringConverter.java:65)
	at org.joda.time.base.BaseDateTime.<init>(BaseDateTime.java:154)
	at org.joda.time.DateTime.<init>(DateTime.java:281)
	at org.joda.time.TestDateTimeZoneCutover.testWithHourOfDayInDstChange(TestDateTimeZoneCutover.java:1139)

testWithMinuteOfHourInDstChange(org.joda.time.TestDateTimeZoneCutover)  Time elapsed: 0 sec  <<< ERROR!
java.lang.ArrayIndexOutOfBoundsException: -1
	at org.joda.time.format.DateTimeParserBucket.computeMillis(DateTimeParserBucket.java:109)
	at org.joda.time.format.DateTimeParserBucket.doParseMillis(DateTimeParserBucket.java:55)
	at org.joda.time.format.DateTimeFormatter.parseMillis(DateTimeFormatter.java:780)
	at org.joda.time.convert.StringConverter.getInstantMillis(StringConverter.java:65)
	at org.joda.time.base.BaseDateTime.<init>(BaseDateTime.java:154)
	at org.joda.time.DateTime.<init>(DateTime.java:281)
	at org.joda.time.TestDateTimeZoneCutover.testWithMinuteOfHourInDstChange(TestDateTimeZoneCutover.java:1146)

testWithSecondOfMinuteInDstChange(org.joda.time.TestDateTimeZoneCutover)  Time elapsed: 0.001 sec  <<< ERROR!
java.lang.ArrayIndexOutOfBoundsException: -1
	at org.joda.time.format.DateTimeParserBucket.computeMillis(DateTimeParserBucket.java:109)
	at org.joda.time.format.DateTimeParserBucket.doParseMillis(DateTimeParserBucket.java:55)
	at org.joda.time.format.DateTimeFormatter.parseMillis(DateTimeFormatter.java:780)
	at org.joda.time.convert.StringConverter.getInstantMillis(StringConverter.java:65)
	at org.joda.time.base.BaseDateTime.<init>(BaseDateTime.java:154)
	at org.joda.time.DateTime.<init>(DateTime.java:281)
	at org.joda.time.TestDateTimeZoneCutover.testWithSecondOfMinuteInDstChange(TestDateTimeZoneCutover.java:1153)

testWithMillisOfSecondInDstChange_Paris_summer(org.joda.time.TestDateTimeZoneCutover)  Time elapsed: 0 sec  <<< ERROR!
java.lang.ArrayIndexOutOfBoundsException: -1
	at org.joda.time.format.DateTimeParserBucket.computeMillis(DateTimeParserBucket.java:109)
	at org.joda.time.format.DateTimeParserBucket.doParseMillis(DateTimeParserBucket.java:55)
	at org.joda.time.format.DateTimeFormatter.parseMillis(DateTimeFormatter.java:780)
	at org.joda.time.convert.StringConverter.getInstantMillis(StringConverter.java:65)
	at org.joda.time.base.BaseDateTime.<init>(BaseDateTime.java:154)
	at org.joda.time.DateTime.<init>(DateTime.java:281)
	at org.joda.time.TestDateTimeZoneCutover.testWithMillisOfSecondInDstChange_Paris_summer(TestDateTimeZoneCutover.java:1160)

testWithMillisOfSecondInDstChange_Paris_winter(org.joda.time.TestDateTimeZoneCutover)  Time elapsed: 0.002 sec  <<< ERROR!
java.lang.ArrayIndexOutOfBoundsException: -1
	at org.joda.time.format.DateTimeParserBucket.computeMillis(DateTimeParserBucket.java:109)
	at org.joda.time.format.DateTimeParserBucket.doParseMillis(DateTimeParserBucket.java:55)
	at org.joda.time.format.DateTimeFormatter.parseMillis(DateTimeFormatter.java:780)
	at org.joda.time.convert.StringConverter.getInstantMillis(StringConverter.java:65)
	at org.joda.time.base.BaseDateTime.<init>(BaseDateTime.java:154)
	at org.joda.time.DateTime.<init>(DateTime.java:281)
	at org.joda.time.TestDateTimeZoneCutover.testWithMillisOfSecondInDstChange_Paris_winter(TestDateTimeZoneCutover.java:1167)

testWithMillisOfSecondInDstChange_NewYork_summer(org.joda.time.TestDateTimeZoneCutover)  Time elapsed: 0 sec  <<< ERROR!
java.lang.ArrayIndexOutOfBoundsException: -1
	at org.joda.time.format.DateTimeParserBucket.computeMillis(DateTimeParserBucket.java:109)
	at org.joda.time.format.DateTimeParserBucket.doParseMillis(DateTimeParserBucket.java:55)
	at org.joda.time.format.DateTimeFormatter.parseMillis(DateTimeFormatter.java:780)
	at org.joda.time.convert.StringConverter.getInstantMillis(StringConverter.java:65)
	at org.joda.time.base.BaseDateTime.<init>(BaseDateTime.java:154)
	at org.joda.time.DateTime.<init>(DateTime.java:281)
	at org.joda.time.TestDateTimeZoneCutover.testWithMillisOfSecondInDstChange_NewYork_summer(TestDateTimeZoneCutover.java:1174)

testWithMillisOfSecondInDstChange_NewYork_winter(org.joda.time.TestDateTimeZoneCutover)  Time elapsed: 0 sec  <<< ERROR!
java.lang.ArrayIndexOutOfBoundsException: -1
	at org.joda.time.format.DateTimeParserBucket.computeMillis(DateTimeParserBucket.java:109)
	at org.joda.time.format.DateTimeParserBucket.doParseMillis(DateTimeParserBucket.java:55)
	at org.joda.time.format.DateTimeFormatter.parseMillis(DateTimeFormatter.java:780)
	at org.joda.time.convert.StringConverter.getInstantMillis(StringConverter.java:65)
	at org.joda.time.base.BaseDateTime.<init>(BaseDateTime.java:154)
	at org.joda.time.DateTime.<init>(DateTime.java:281)
	at org.joda.time.TestDateTimeZoneCutover.testWithMillisOfSecondInDstChange_NewYork_winter(TestDateTimeZoneCutover.java:1181)

testPlusMinutesInDstChange(org.joda.time.TestDateTimeZoneCutover)  Time elapsed: 0 sec  <<< ERROR!
java.lang.ArrayIndexOutOfBoundsException: -1
	at org.joda.time.format.DateTimeParserBucket.computeMillis(DateTimeParserBucket.java:109)
	at org.joda.time.format.DateTimeParserBucket.doParseMillis(DateTimeParserBucket.java:55)
	at org.joda.time.format.DateTimeFormatter.parseMillis(DateTimeFormatter.java:780)
	at org.joda.time.convert.StringConverter.getInstantMillis(StringConverter.java:65)
	at org.joda.time.base.BaseDateTime.<init>(BaseDateTime.java:154)
	at org.joda.time.DateTime.<init>(DateTime.java:281)
	at org.joda.time.TestDateTimeZoneCutover.testPlusMinutesInDstChange(TestDateTimeZoneCutover.java:1188)

testPlusSecondsInDstChange(org.joda.time.TestDateTimeZoneCutover)  Time elapsed: 0.001 sec  <<< ERROR!
java.lang.ArrayIndexOutOfBoundsException: -1
	at org.joda.time.format.DateTimeParserBucket.computeMillis(DateTimeParserBucket.java:109)
	at org.joda.time.format.DateTimeParserBucket.doParseMillis(DateTimeParserBucket.java:55)
	at org.joda.time.format.DateTimeFormatter.parseMillis(DateTimeFormatter.java:780)
	at org.joda.time.convert.StringConverter.getInstantMillis(StringConverter.java:65)
	at org.joda.time.base.BaseDateTime.<init>(BaseDateTime.java:154)
	at org.joda.time.DateTime.<init>(DateTime.java:281)
	at org.joda.time.TestDateTimeZoneCutover.testPlusSecondsInDstChange(TestDateTimeZoneCutover.java:1195)

testPlusMillisInDstChange(org.joda.time.TestDateTimeZoneCutover)  Time elapsed: 0 sec  <<< ERROR!
java.lang.ArrayIndexOutOfBoundsException: -1
	at org.joda.time.format.DateTimeParserBucket.computeMillis(DateTimeParserBucket.java:109)
	at org.joda.time.format.DateTimeParserBucket.doParseMillis(DateTimeParserBucket.java:55)
	at org.joda.time.format.DateTimeFormatter.parseMillis(DateTimeFormatter.java:780)
	at org.joda.time.convert.StringConverter.getInstantMillis(StringConverter.java:65)
	at org.joda.time.base.BaseDateTime.<init>(BaseDateTime.java:154)
	at org.joda.time.DateTime.<init>(DateTime.java:281)
	at org.joda.time.TestDateTimeZoneCutover.testPlusMillisInDstChange(TestDateTimeZoneCutover.java:1202)

testDateMidnight(org.joda.time.TestStringConvert)  Time elapsed: 0.003 sec  <<< ERROR!
java.lang.ArrayIndexOutOfBoundsException: -1
	at org.joda.time.format.DateTimeParserBucket.computeMillis(DateTimeParserBucket.java:109)
	at org.joda.time.format.DateTimeParserBucket.computeMillis(DateTimeParserBucket.java:92)
	at org.joda.time.format.DateTimeFormatter.parseDateTime(DateTimeFormatter.java:882)
	at org.joda.time.DateMidnight.parse(DateMidnight.java:152)
	at org.joda.time.DateMidnight.parse(DateMidnight.java:141)
	at sun.reflect.NativeMethodAccessorImpl.invoke0(Native Method)
	at sun.reflect.NativeMethodAccessorImpl.invoke(NativeMethodAccessorImpl.java:57)
	at sun.reflect.DelegatingMethodAccessorImpl.invoke(DelegatingMethodAccessorImpl.java:43)
	at java.lang.reflect.Method.invoke(Method.java:606)
	at org.joda.convert.MethodsStringConverter.convertFromString(MethodsStringConverter.java:70)
	at org.joda.convert.StringConvert.convertFromString(StringConvert.java:163)
	at org.joda.time.TestStringConvert.testDateMidnight(TestStringConvert.java:57)

testDateTime(org.joda.time.TestStringConvert)  Time elapsed: 0.001 sec  <<< ERROR!
java.lang.ArrayIndexOutOfBoundsException: -1
	at org.joda.time.format.DateTimeParserBucket.computeMillis(DateTimeParserBucket.java:109)
	at org.joda.time.format.DateTimeParserBucket.computeMillis(DateTimeParserBucket.java:92)
	at org.joda.time.format.DateTimeFormatter.parseDateTime(DateTimeFormatter.java:882)
	at org.joda.time.DateTime.parse(DateTime.java:160)
	at org.joda.time.DateTime.parse(DateTime.java:149)
	at sun.reflect.NativeMethodAccessorImpl.invoke0(Native Method)
	at sun.reflect.NativeMethodAccessorImpl.invoke(NativeMethodAccessorImpl.java:57)
	at sun.reflect.DelegatingMethodAccessorImpl.invoke(DelegatingMethodAccessorImpl.java:43)
	at java.lang.reflect.Method.invoke(Method.java:606)
	at org.joda.convert.MethodsStringConverter.convertFromString(MethodsStringConverter.java:70)
	at org.joda.convert.StringConvert.convertFromString(StringConvert.java:163)
	at org.joda.time.TestStringConvert.testDateTime(TestStringConvert.java:64)

testMutableDateTime(org.joda.time.TestStringConvert)  Time elapsed: 0.001 sec  <<< ERROR!
java.lang.ArrayIndexOutOfBoundsException: -1
	at org.joda.time.format.DateTimeParserBucket.computeMillis(DateTimeParserBucket.java:109)
	at org.joda.time.format.DateTimeParserBucket.computeMillis(DateTimeParserBucket.java:92)
	at org.joda.time.format.DateTimeFormatter.parseDateTime(DateTimeFormatter.java:882)
	at org.joda.time.MutableDateTime.parse(MutableDateTime.java:160)
	at org.joda.time.MutableDateTime.parse(MutableDateTime.java:149)
	at sun.reflect.NativeMethodAccessorImpl.invoke0(Native Method)
	at sun.reflect.NativeMethodAccessorImpl.invoke(NativeMethodAccessorImpl.java:57)
	at sun.reflect.DelegatingMethodAccessorImpl.invoke(DelegatingMethodAccessorImpl.java:43)
	at java.lang.reflect.Method.invoke(Method.java:606)
	at org.joda.convert.MethodsStringConverter.convertFromString(MethodsStringConverter.java:70)
	at org.joda.convert.StringConvert.convertFromString(StringConvert.java:163)
	at org.joda.time.TestStringConvert.testMutableDateTime(TestStringConvert.java:71)

testLocalDateTime(org.joda.time.TestStringConvert)  Time elapsed: 0.002 sec  <<< ERROR!
java.lang.ArrayIndexOutOfBoundsException: -1
	at org.joda.time.format.DateTimeParserBucket.computeMillis(DateTimeParserBucket.java:109)
	at org.joda.time.format.DateTimeParserBucket.computeMillis(DateTimeParserBucket.java:92)
	at org.joda.time.format.DateTimeFormatter.parseLocalDateTime(DateTimeFormatter.java:841)
	at org.joda.time.LocalDateTime.parse(LocalDateTime.java:168)
	at org.joda.time.LocalDateTime.parse(LocalDateTime.java:157)
	at sun.reflect.NativeMethodAccessorImpl.invoke0(Native Method)
	at sun.reflect.NativeMethodAccessorImpl.invoke(NativeMethodAccessorImpl.java:57)
	at sun.reflect.DelegatingMethodAccessorImpl.invoke(DelegatingMethodAccessorImpl.java:43)
	at java.lang.reflect.Method.invoke(Method.java:606)
	at org.joda.convert.MethodsStringConverter.convertFromString(MethodsStringConverter.java:70)
	at org.joda.convert.StringConvert.convertFromString(StringConvert.java:163)
	at org.joda.time.TestStringConvert.testLocalDateTime(TestStringConvert.java:78)

testLocalDate(org.joda.time.TestStringConvert)  Time elapsed: 0.002 sec  <<< ERROR!
java.lang.ArrayIndexOutOfBoundsException: -1
	at org.joda.time.format.DateTimeParserBucket.computeMillis(DateTimeParserBucket.java:109)
	at org.joda.time.format.DateTimeParserBucket.computeMillis(DateTimeParserBucket.java:92)
	at org.joda.time.format.DateTimeFormatter.parseLocalDateTime(DateTimeFormatter.java:841)
	at org.joda.time.format.DateTimeFormatter.parseLocalDate(DateTimeFormatter.java:798)
	at org.joda.time.LocalDate.parse(LocalDate.java:179)
	at org.joda.time.LocalDate.parse(LocalDate.java:168)
	at sun.reflect.NativeMethodAccessorImpl.invoke0(Native Method)
	at sun.reflect.NativeMethodAccessorImpl.invoke(NativeMethodAccessorImpl.java:57)
	at sun.reflect.DelegatingMethodAccessorImpl.invoke(DelegatingMethodAccessorImpl.java:43)
	at java.lang.reflect.Method.invoke(Method.java:606)
	at org.joda.convert.MethodsStringConverter.convertFromString(MethodsStringConverter.java:70)
	at org.joda.convert.StringConvert.convertFromString(StringConvert.java:163)
	at org.joda.time.TestStringConvert.testLocalDate(TestStringConvert.java:85)

testLocalTime(org.joda.time.TestStringConvert)  Time elapsed: 0.001 sec  <<< ERROR!
java.lang.ArrayIndexOutOfBoundsException: -1
	at org.joda.time.format.DateTimeParserBucket.computeMillis(DateTimeParserBucket.java:109)
	at org.joda.time.format.DateTimeParserBucket.computeMillis(DateTimeParserBucket.java:92)
	at org.joda.time.format.DateTimeFormatter.parseLocalDateTime(DateTimeFormatter.java:841)
	at org.joda.time.format.DateTimeFormatter.parseLocalTime(DateTimeFormatter.java:816)
	at org.joda.time.LocalTime.parse(LocalTime.java:175)
	at org.joda.time.LocalTime.parse(LocalTime.java:164)
	at sun.reflect.NativeMethodAccessorImpl.invoke0(Native Method)
	at sun.reflect.NativeMethodAccessorImpl.invoke(NativeMethodAccessorImpl.java:57)
	at sun.reflect.DelegatingMethodAccessorImpl.invoke(DelegatingMethodAccessorImpl.java:43)
	at java.lang.reflect.Method.invoke(Method.java:606)
	at org.joda.convert.MethodsStringConverter.convertFromString(MethodsStringConverter.java:70)
	at org.joda.convert.StringConvert.convertFromString(StringConvert.java:163)
	at org.joda.time.TestStringConvert.testLocalTime(TestStringConvert.java:92)

testYearMonth(org.joda.time.TestStringConvert)  Time elapsed: 0.001 sec  <<< ERROR!
java.lang.ArrayIndexOutOfBoundsException: -1
	at org.joda.time.format.DateTimeParserBucket.computeMillis(DateTimeParserBucket.java:109)
	at org.joda.time.format.DateTimeParserBucket.computeMillis(DateTimeParserBucket.java:92)
	at org.joda.time.format.DateTimeFormatter.parseLocalDateTime(DateTimeFormatter.java:841)
	at org.joda.time.format.DateTimeFormatter.parseLocalDate(DateTimeFormatter.java:798)
	at org.joda.time.YearMonth.parse(YearMonth.java:152)
	at org.joda.time.YearMonth.parse(YearMonth.java:141)
	at sun.reflect.NativeMethodAccessorImpl.invoke0(Native Method)
	at sun.reflect.NativeMethodAccessorImpl.invoke(NativeMethodAccessorImpl.java:57)
	at sun.reflect.DelegatingMethodAccessorImpl.invoke(DelegatingMethodAccessorImpl.java:43)
	at java.lang.reflect.Method.invoke(Method.java:606)
	at org.joda.convert.MethodsStringConverter.convertFromString(MethodsStringConverter.java:70)
	at org.joda.convert.StringConvert.convertFromString(StringConvert.java:163)
	at org.joda.time.TestStringConvert.testYearMonth(TestStringConvert.java:99)

testMonthDay(org.joda.time.TestStringConvert)  Time elapsed: 0.001 sec  <<< ERROR!
java.lang.ArrayIndexOutOfBoundsException: -1
	at org.joda.time.format.DateTimeParserBucket.computeMillis(DateTimeParserBucket.java:109)
	at org.joda.time.format.DateTimeParserBucket.computeMillis(DateTimeParserBucket.java:102)
	at org.joda.time.format.DateTimeParserBucket.computeMillis(DateTimeParserBucket.java:92)
	at org.joda.time.format.DateTimeFormatter.parseLocalDateTime(DateTimeFormatter.java:841)
	at org.joda.time.format.DateTimeFormatter.parseLocalDate(DateTimeFormatter.java:798)
	at org.joda.time.MonthDay.parse(MonthDay.java:160)
	at org.joda.time.MonthDay.parse(MonthDay.java:149)
	at sun.reflect.NativeMethodAccessorImpl.invoke0(Native Method)
	at sun.reflect.NativeMethodAccessorImpl.invoke(NativeMethodAccessorImpl.java:57)
	at sun.reflect.DelegatingMethodAccessorImpl.invoke(DelegatingMethodAccessorImpl.java:43)
	at java.lang.reflect.Method.invoke(Method.java:606)
	at org.joda.convert.MethodsStringConverter.convertFromString(MethodsStringConverter.java:70)
	at org.joda.convert.StringConvert.convertFromString(StringConvert.java:163)
	at org.joda.time.TestStringConvert.testMonthDay(TestStringConvert.java:106)

testMonthDay_leapDay(org.joda.time.TestStringConvert)  Time elapsed: 0.001 sec  <<< ERROR!
java.lang.ArrayIndexOutOfBoundsException: -1
	at org.joda.time.format.DateTimeParserBucket.computeMillis(DateTimeParserBucket.java:109)
	at org.joda.time.format.DateTimeParserBucket.computeMillis(DateTimeParserBucket.java:102)
	at org.joda.time.format.DateTimeParserBucket.computeMillis(DateTimeParserBucket.java:92)
	at org.joda.time.format.DateTimeFormatter.parseLocalDateTime(DateTimeFormatter.java:841)
	at org.joda.time.format.DateTimeFormatter.parseLocalDate(DateTimeFormatter.java:798)
	at org.joda.time.MonthDay.parse(MonthDay.java:160)
	at org.joda.time.MonthDay.parse(MonthDay.java:149)
	at sun.reflect.NativeMethodAccessorImpl.invoke0(Native Method)
	at sun.reflect.NativeMethodAccessorImpl.invoke(NativeMethodAccessorImpl.java:57)
	at sun.reflect.DelegatingMethodAccessorImpl.invoke(DelegatingMethodAccessorImpl.java:43)
	at java.lang.reflect.Method.invoke(Method.java:606)
	at org.joda.convert.MethodsStringConverter.convertFromString(MethodsStringConverter.java:70)
	at org.joda.convert.StringConvert.convertFromString(StringConvert.java:163)
	at org.joda.time.TestStringConvert.testMonthDay_leapDay(TestStringConvert.java:113)

testGJCutover(org.joda.time.TestIllegalFieldValueException)  Time elapsed: 0.001 sec  <<< ERROR!
java.lang.ArrayIndexOutOfBoundsException: -1
	at org.joda.time.format.DateTimeParserBucket.computeMillis(DateTimeParserBucket.java:109)
	at org.joda.time.format.DateTimeParserBucket.doParseMillis(DateTimeParserBucket.java:55)
	at org.joda.time.format.DateTimeFormatter.parseMillis(DateTimeFormatter.java:780)
	at org.joda.time.convert.StringConverter.getInstantMillis(StringConverter.java:65)
	at org.joda.time.base.BaseDateTime.<init>(BaseDateTime.java:175)
	at org.joda.time.DateTime.<init>(DateTime.java:302)
	at org.joda.time.TestIllegalFieldValueException.testGJCutover(TestIllegalFieldValueException.java:229)

testCutoverAddDays(org.joda.time.chrono.TestGJChronology)  Time elapsed: 0.001 sec  <<< ERROR!
java.lang.ArrayIndexOutOfBoundsException: -1
	at org.joda.time.format.DateTimeParserBucket.computeMillis(DateTimeParserBucket.java:109)
	at org.joda.time.format.DateTimeParserBucket.doParseMillis(DateTimeParserBucket.java:55)
	at org.joda.time.format.DateTimeFormatter.parseMillis(DateTimeFormatter.java:780)
	at org.joda.time.convert.StringConverter.getInstantMillis(StringConverter.java:65)
	at org.joda.time.base.BaseDateTime.<init>(BaseDateTime.java:175)
	at org.joda.time.DateTime.<init>(DateTime.java:302)
	at org.joda.time.chrono.TestGJChronology.testAdd(TestGJChronology.java:482)
	at org.joda.time.chrono.TestGJChronology.testCutoverAddDays(TestGJChronology.java:452)

testYearEndAddDays(org.joda.time.chrono.TestGJChronology)  Time elapsed: 0 sec  <<< ERROR!
java.lang.ArrayIndexOutOfBoundsException: -1
	at org.joda.time.format.DateTimeParserBucket.computeMillis(DateTimeParserBucket.java:109)
	at org.joda.time.format.DateTimeParserBucket.doParseMillis(DateTimeParserBucket.java:55)
	at org.joda.time.format.DateTimeFormatter.parseMillis(DateTimeFormatter.java:780)
	at org.joda.time.convert.StringConverter.getInstantMillis(StringConverter.java:65)
	at org.joda.time.base.BaseDateTime.<init>(BaseDateTime.java:175)
	at org.joda.time.DateTime.<init>(DateTime.java:302)
	at org.joda.time.chrono.TestGJChronology.testAdd(TestGJChronology.java:482)
	at org.joda.time.chrono.TestGJChronology.testYearEndAddDays(TestGJChronology.java:462)

testPartialGetAsText(org.joda.time.chrono.TestGJChronology)  Time elapsed: 0.001 sec  <<< ERROR!
java.lang.ArrayIndexOutOfBoundsException: -1
	at org.joda.time.format.DateTimeParserBucket.computeMillis(DateTimeParserBucket.java:109)
	at org.joda.time.format.DateTimeParserBucket.doParseMillis(DateTimeParserBucket.java:55)
	at org.joda.time.format.DateTimeFormatter.parseMillis(DateTimeFormatter.java:780)
	at org.joda.time.convert.StringConverter.getPartialValues(StringConverter.java:87)
	at org.joda.time.base.BasePartial.<init>(BasePartial.java:163)
	at org.joda.time.YearMonthDay.<init>(YearMonthDay.java:256)
	at org.joda.time.chrono.TestGJChronology.testPartialGetAsText(TestGJChronology.java:523)

testParseEquivalence(org.joda.time.chrono.TestGJChronology)  Time elapsed: 0.001 sec  <<< ERROR!
java.lang.ArrayIndexOutOfBoundsException: -1
	at org.joda.time.format.DateTimeParserBucket.computeMillis(DateTimeParserBucket.java:109)
	at org.joda.time.format.DateTimeParserBucket.doParseMillis(DateTimeParserBucket.java:55)
	at org.joda.time.format.DateTimeFormatter.parseMillis(DateTimeFormatter.java:780)
	at org.joda.time.convert.StringConverter.getInstantMillis(StringConverter.java:65)
	at org.joda.time.base.BaseDateTime.<init>(BaseDateTime.java:175)
	at org.joda.time.DateTime.<init>(DateTime.java:302)
	at org.joda.time.chrono.TestGJChronology.testParse(TestGJChronology.java:375)
	at org.joda.time.chrono.TestGJChronology.testParseEquivalence(TestGJChronology.java:362)

testCutoverAddYears(org.joda.time.chrono.TestGJChronology)  Time elapsed: 0.001 sec  <<< ERROR!
java.lang.ArrayIndexOutOfBoundsException: -1
	at org.joda.time.format.DateTimeParserBucket.computeMillis(DateTimeParserBucket.java:109)
	at org.joda.time.format.DateTimeParserBucket.doParseMillis(DateTimeParserBucket.java:55)
	at org.joda.time.format.DateTimeFormatter.parseMillis(DateTimeFormatter.java:780)
	at org.joda.time.convert.StringConverter.getInstantMillis(StringConverter.java:65)
	at org.joda.time.base.BaseDateTime.<init>(BaseDateTime.java:175)
	at org.joda.time.DateTime.<init>(DateTime.java:302)
	at org.joda.time.chrono.TestGJChronology.testAdd(TestGJChronology.java:482)
	at org.joda.time.chrono.TestGJChronology.testCutoverAddYears(TestGJChronology.java:381)

testCutoverAddWeekyears(org.joda.time.chrono.TestGJChronology)  Time elapsed: 0.001 sec  <<< ERROR!
java.lang.ArrayIndexOutOfBoundsException: -1
	at org.joda.time.format.DateTimeParserBucket.computeMillis(DateTimeParserBucket.java:109)
	at org.joda.time.format.DateTimeParserBucket.doParseMillis(DateTimeParserBucket.java:55)
	at org.joda.time.format.DateTimeFormatter.parseMillis(DateTimeFormatter.java:780)
	at org.joda.time.convert.StringConverter.getInstantMillis(StringConverter.java:65)
	at org.joda.time.base.BaseDateTime.<init>(BaseDateTime.java:175)
	at org.joda.time.DateTime.<init>(DateTime.java:302)
	at org.joda.time.chrono.TestGJChronology.testAdd(TestGJChronology.java:482)
	at org.joda.time.chrono.TestGJChronology.testCutoverAddWeekyears(TestGJChronology.java:401)

testCutoverAddMonths(org.joda.time.chrono.TestGJChronology)  Time elapsed: 0 sec  <<< ERROR!
java.lang.ArrayIndexOutOfBoundsException: -1
	at org.joda.time.format.DateTimeParserBucket.computeMillis(DateTimeParserBucket.java:109)
	at org.joda.time.format.DateTimeParserBucket.doParseMillis(DateTimeParserBucket.java:55)
	at org.joda.time.format.DateTimeFormatter.parseMillis(DateTimeFormatter.java:780)
	at org.joda.time.convert.StringConverter.getInstantMillis(StringConverter.java:65)
	at org.joda.time.base.BaseDateTime.<init>(BaseDateTime.java:175)
	at org.joda.time.DateTime.<init>(DateTime.java:302)
	at org.joda.time.chrono.TestGJChronology.testAdd(TestGJChronology.java:482)
	at org.joda.time.chrono.TestGJChronology.testCutoverAddMonths(TestGJChronology.java:422)

testCutoverAddWeeks(org.joda.time.chrono.TestGJChronology)  Time elapsed: 0.001 sec  <<< ERROR!
java.lang.ArrayIndexOutOfBoundsException: -1
	at org.joda.time.format.DateTimeParserBucket.computeMillis(DateTimeParserBucket.java:109)
	at org.joda.time.format.DateTimeParserBucket.doParseMillis(DateTimeParserBucket.java:55)
	at org.joda.time.format.DateTimeFormatter.parseMillis(DateTimeFormatter.java:780)
	at org.joda.time.convert.StringConverter.getInstantMillis(StringConverter.java:65)
	at org.joda.time.base.BaseDateTime.<init>(BaseDateTime.java:175)
	at org.joda.time.DateTime.<init>(DateTime.java:302)
	at org.joda.time.chrono.TestGJChronology.testAdd(TestGJChronology.java:482)
	at org.joda.time.chrono.TestGJChronology.testCutoverAddWeeks(TestGJChronology.java:443)

testAddMonths(org.joda.time.chrono.TestISOChronology)  Time elapsed: 0.001 sec  <<< ERROR!
java.lang.ArrayIndexOutOfBoundsException: -1
	at org.joda.time.format.DateTimeParserBucket.computeMillis(DateTimeParserBucket.java:109)
	at org.joda.time.format.DateTimeParserBucket.doParseMillis(DateTimeParserBucket.java:55)
	at org.joda.time.format.DateTimeFormatter.parseMillis(DateTimeFormatter.java:780)
	at org.joda.time.convert.StringConverter.getInstantMillis(StringConverter.java:65)
	at org.joda.time.base.BaseDateTime.<init>(BaseDateTime.java:175)
	at org.joda.time.DateTime.<init>(DateTime.java:302)
	at org.joda.time.chrono.TestISOChronology.testAdd(TestISOChronology.java:411)
	at org.joda.time.chrono.TestISOChronology.testAddMonths(TestISOChronology.java:394)

testMinYear(org.joda.time.chrono.TestISOChronology)  Time elapsed: 0.001 sec  <<< ERROR!
java.lang.ArrayIndexOutOfBoundsException: -1
	at org.joda.time.format.DateTimeParserBucket.computeMillis(DateTimeParserBucket.java:109)
	at org.joda.time.format.DateTimeParserBucket.doParseMillis(DateTimeParserBucket.java:55)
	at org.joda.time.format.DateTimeFormatter.parseMillis(DateTimeFormatter.java:780)
	at org.joda.time.convert.StringConverter.getInstantMillis(StringConverter.java:65)
	at org.joda.time.base.BaseDateTime.<init>(BaseDateTime.java:175)
	at org.joda.time.DateTime.<init>(DateTime.java:302)
	at org.joda.time.chrono.TestISOChronology.testMinYear(TestISOChronology.java:357)

testCutoverAddYears(org.joda.time.chrono.TestISOChronology)  Time elapsed: 0.001 sec  <<< ERROR!
java.lang.ArrayIndexOutOfBoundsException: -1
	at org.joda.time.format.DateTimeParserBucket.computeMillis(DateTimeParserBucket.java:109)
	at org.joda.time.format.DateTimeParserBucket.doParseMillis(DateTimeParserBucket.java:55)
	at org.joda.time.format.DateTimeFormatter.parseMillis(DateTimeFormatter.java:780)
	at org.joda.time.convert.StringConverter.getInstantMillis(StringConverter.java:65)
	at org.joda.time.base.BaseDateTime.<init>(BaseDateTime.java:175)
	at org.joda.time.DateTime.<init>(DateTime.java:302)
	at org.joda.time.chrono.TestISOChronology.testAdd(TestISOChronology.java:411)
	at org.joda.time.chrono.TestISOChronology.testCutoverAddYears(TestISOChronology.java:376)

testMaxYear(org.joda.time.chrono.TestISOChronology)  Time elapsed: 0.001 sec  <<< ERROR!
java.lang.ArrayIndexOutOfBoundsException: -1
	at org.joda.time.format.DateTimeParserBucket.computeMillis(DateTimeParserBucket.java:109)
	at org.joda.time.format.DateTimeParserBucket.doParseMillis(DateTimeParserBucket.java:55)
	at org.joda.time.format.DateTimeFormatter.parseMillis(DateTimeFormatter.java:780)
	at org.joda.time.convert.StringConverter.getInstantMillis(StringConverter.java:65)
	at org.joda.time.base.BaseDateTime.<init>(BaseDateTime.java:175)
	at org.joda.time.DateTime.<init>(DateTime.java:302)
	at org.joda.time.chrono.TestISOChronology.testMaxYear(TestISOChronology.java:324)

testGetDateTime(org.joda.time.convert.TestStringConverter)  Time elapsed: 0.001 sec  <<< ERROR!
java.lang.ArrayIndexOutOfBoundsException: -1
	at org.joda.time.format.DateTimeParserBucket.computeMillis(DateTimeParserBucket.java:109)
	at org.joda.time.format.DateTimeParserBucket.doParseMillis(DateTimeParserBucket.java:55)
	at org.joda.time.format.DateTimeFormatter.parseMillis(DateTimeFormatter.java:780)
	at org.joda.time.convert.StringConverter.getInstantMillis(StringConverter.java:65)
	at org.joda.time.base.BaseDateTime.<init>(BaseDateTime.java:154)
	at org.joda.time.DateTime.<init>(DateTime.java:281)
	at org.joda.time.convert.TestStringConverter.testGetDateTime(TestStringConverter.java:212)

testGetDateTime1(org.joda.time.convert.TestStringConverter)  Time elapsed: 0.001 sec  <<< ERROR!
java.lang.ArrayIndexOutOfBoundsException: -1
	at org.joda.time.format.DateTimeParserBucket.computeMillis(DateTimeParserBucket.java:109)
	at org.joda.time.format.DateTimeParserBucket.doParseMillis(DateTimeParserBucket.java:55)
	at org.joda.time.format.DateTimeFormatter.parseMillis(DateTimeFormatter.java:780)
	at org.joda.time.convert.StringConverter.getInstantMillis(StringConverter.java:65)
	at org.joda.time.base.BaseDateTime.<init>(BaseDateTime.java:175)
	at org.joda.time.DateTime.<init>(DateTime.java:257)
	at org.joda.time.convert.TestStringConverter.testGetDateTime1(TestStringConverter.java:217)

testGetDateTime2(org.joda.time.convert.TestStringConverter)  Time elapsed: 0 sec  <<< ERROR!
java.lang.ArrayIndexOutOfBoundsException: -1
	at org.joda.time.format.DateTimeParserBucket.computeMillis(DateTimeParserBucket.java:109)
	at org.joda.time.format.DateTimeParserBucket.doParseMillis(DateTimeParserBucket.java:55)
	at org.joda.time.format.DateTimeFormatter.parseMillis(DateTimeFormatter.java:780)
	at org.joda.time.convert.StringConverter.getInstantMillis(StringConverter.java:65)
	at org.joda.time.base.BaseDateTime.<init>(BaseDateTime.java:175)
	at org.joda.time.DateTime.<init>(DateTime.java:257)
	at org.joda.time.convert.TestStringConverter.testGetDateTime2(TestStringConverter.java:229)

testGetDateTime3(org.joda.time.convert.TestStringConverter)  Time elapsed: 0.001 sec  <<< ERROR!
java.lang.ArrayIndexOutOfBoundsException: -1
	at org.joda.time.format.DateTimeParserBucket.computeMillis(DateTimeParserBucket.java:109)
	at org.joda.time.format.DateTimeParserBucket.doParseMillis(DateTimeParserBucket.java:55)
	at org.joda.time.format.DateTimeFormatter.parseMillis(DateTimeFormatter.java:780)
	at org.joda.time.convert.StringConverter.getInstantMillis(StringConverter.java:65)
	at org.joda.time.base.BaseDateTime.<init>(BaseDateTime.java:154)
	at org.joda.time.DateTime.<init>(DateTime.java:281)
	at org.joda.time.convert.TestStringConverter.testGetDateTime3(TestStringConverter.java:241)

testGetDateTime4(org.joda.time.convert.TestStringConverter)  Time elapsed: 0 sec  <<< ERROR!
java.lang.ArrayIndexOutOfBoundsException: -1
	at org.joda.time.format.DateTimeParserBucket.computeMillis(DateTimeParserBucket.java:109)
	at org.joda.time.format.DateTimeParserBucket.doParseMillis(DateTimeParserBucket.java:55)
	at org.joda.time.format.DateTimeFormatter.parseMillis(DateTimeFormatter.java:780)
	at org.joda.time.convert.StringConverter.getInstantMillis(StringConverter.java:65)
	at org.joda.time.base.BaseDateTime.<init>(BaseDateTime.java:154)
	at org.joda.time.DateTime.<init>(DateTime.java:281)
	at org.joda.time.convert.TestStringConverter.testGetDateTime4(TestStringConverter.java:253)

testGetInstantMillis_Object(org.joda.time.convert.TestStringConverter)  Time elapsed: 0.001 sec  <<< ERROR!
java.lang.ArrayIndexOutOfBoundsException: -1
	at org.joda.time.format.DateTimeParserBucket.computeMillis(DateTimeParserBucket.java:109)
	at org.joda.time.format.DateTimeParserBucket.doParseMillis(DateTimeParserBucket.java:55)
	at org.joda.time.format.DateTimeFormatter.parseMillis(DateTimeFormatter.java:780)
	at org.joda.time.convert.StringConverter.getInstantMillis(StringConverter.java:65)
	at org.joda.time.convert.TestStringConverter.testGetInstantMillis_Object(TestStringConverter.java:114)

testGetPartialValues(org.joda.time.convert.TestStringConverter)  Time elapsed: 0 sec  <<< ERROR!
java.lang.ArrayIndexOutOfBoundsException: -1
	at org.joda.time.format.DateTimeParserBucket.computeMillis(DateTimeParserBucket.java:109)
	at org.joda.time.format.DateTimeParserBucket.doParseMillis(DateTimeParserBucket.java:55)
	at org.joda.time.format.DateTimeFormatter.parseMillis(DateTimeFormatter.java:780)
	at org.joda.time.convert.StringConverter.getInstantMillis(StringConverter.java:65)
	at org.joda.time.convert.AbstractConverter.getPartialValues(AbstractConverter.java:101)
	at org.joda.time.convert.TestStringConverter.testGetPartialValues(TestStringConverter.java:205)

testGetInstantMillis_Object_Zone(org.joda.time.convert.TestStringConverter)  Time elapsed: 0 sec  <<< ERROR!
java.lang.ArrayIndexOutOfBoundsException: -1
	at org.joda.time.format.DateTimeParserBucket.computeMillis(DateTimeParserBucket.java:109)
	at org.joda.time.format.DateTimeParserBucket.doParseMillis(DateTimeParserBucket.java:55)
	at org.joda.time.format.DateTimeFormatter.parseMillis(DateTimeFormatter.java:780)
	at org.joda.time.convert.StringConverter.getInstantMillis(StringConverter.java:65)
	at org.joda.time.convert.TestStringConverter.testGetInstantMillis_Object_Zone(TestStringConverter.java:158)

testGetDateTime5(org.joda.time.convert.TestStringConverter)  Time elapsed: 0.001 sec  <<< ERROR!
java.lang.ArrayIndexOutOfBoundsException: -1
	at org.joda.time.format.DateTimeParserBucket.computeMillis(DateTimeParserBucket.java:109)
	at org.joda.time.format.DateTimeParserBucket.doParseMillis(DateTimeParserBucket.java:55)
	at org.joda.time.format.DateTimeFormatter.parseMillis(DateTimeFormatter.java:780)
	at org.joda.time.convert.StringConverter.getInstantMillis(StringConverter.java:65)
	at org.joda.time.base.BaseDateTime.<init>(BaseDateTime.java:175)
	at org.joda.time.DateTime.<init>(DateTime.java:302)
	at org.joda.time.convert.TestStringConverter.testGetDateTime5(TestStringConverter.java:265)

testGetDateTime6(org.joda.time.convert.TestStringConverter)  Time elapsed: 0 sec  <<< ERROR!
java.lang.ArrayIndexOutOfBoundsException: -1
	at org.joda.time.format.DateTimeParserBucket.computeMillis(DateTimeParserBucket.java:109)
	at org.joda.time.format.DateTimeParserBucket.doParseMillis(DateTimeParserBucket.java:55)
	at org.joda.time.format.DateTimeFormatter.parseMillis(DateTimeFormatter.java:780)
	at org.joda.time.convert.StringConverter.getInstantMillis(StringConverter.java:65)
	at org.joda.time.base.BaseDateTime.<init>(BaseDateTime.java:175)
	at org.joda.time.DateTime.<init>(DateTime.java:302)
	at org.joda.time.convert.TestStringConverter.testGetDateTime6(TestStringConverter.java:277)

testSetIntoInterval_Object_Chronology1(org.joda.time.convert.TestStringConverter)  Time elapsed: 0 sec  <<< ERROR!
java.lang.ArrayIndexOutOfBoundsException: -1
	at org.joda.time.format.DateTimeParserBucket.computeMillis(DateTimeParserBucket.java:109)
	at org.joda.time.format.DateTimeParserBucket.computeMillis(DateTimeParserBucket.java:92)
	at org.joda.time.format.DateTimeFormatter.parseDateTime(DateTimeFormatter.java:882)
	at org.joda.time.convert.StringConverter.setInto(StringConverter.java:212)
	at org.joda.time.convert.TestStringConverter.testSetIntoInterval_Object_Chronology1(TestStringConverter.java:476)

testSetIntoInterval_Object_Chronology2(org.joda.time.convert.TestStringConverter)  Time elapsed: 0.001 sec  <<< ERROR!
java.lang.ArrayIndexOutOfBoundsException: -1
	at org.joda.time.format.DateTimeParserBucket.computeMillis(DateTimeParserBucket.java:109)
	at org.joda.time.format.DateTimeParserBucket.computeMillis(DateTimeParserBucket.java:92)
	at org.joda.time.format.DateTimeFormatter.parseDateTime(DateTimeFormatter.java:882)
	at org.joda.time.convert.StringConverter.setInto(StringConverter.java:227)
	at org.joda.time.convert.TestStringConverter.testSetIntoInterval_Object_Chronology2(TestStringConverter.java:484)

testSetIntoInterval_Object_Chronology3(org.joda.time.convert.TestStringConverter)  Time elapsed: 0 sec  <<< ERROR!
java.lang.ArrayIndexOutOfBoundsException: -1
	at org.joda.time.format.DateTimeParserBucket.computeMillis(DateTimeParserBucket.java:109)
	at org.joda.time.format.DateTimeParserBucket.computeMillis(DateTimeParserBucket.java:92)
	at org.joda.time.format.DateTimeFormatter.parseDateTime(DateTimeFormatter.java:882)
	at org.joda.time.convert.StringConverter.setInto(StringConverter.java:212)
	at org.joda.time.convert.TestStringConverter.testSetIntoInterval_Object_Chronology3(TestStringConverter.java:492)

testSetIntoInterval_Object_Chronology4(org.joda.time.convert.TestStringConverter)  Time elapsed: 0.001 sec  <<< ERROR!
java.lang.ArrayIndexOutOfBoundsException: -1
	at org.joda.time.format.DateTimeParserBucket.computeMillis(DateTimeParserBucket.java:109)
	at org.joda.time.format.DateTimeParserBucket.computeMillis(DateTimeParserBucket.java:92)
	at org.joda.time.format.DateTimeFormatter.parseDateTime(DateTimeFormatter.java:882)
	at org.joda.time.convert.StringConverter.setInto(StringConverter.java:212)
	at org.joda.time.convert.TestStringConverter.testSetIntoInterval_Object_Chronology4(TestStringConverter.java:500)

testSetIntoInterval_Object_Chronology5(org.joda.time.convert.TestStringConverter)  Time elapsed: 0 sec  <<< ERROR!
java.lang.ArrayIndexOutOfBoundsException: -1
	at org.joda.time.format.DateTimeParserBucket.computeMillis(DateTimeParserBucket.java:109)
	at org.joda.time.format.DateTimeParserBucket.computeMillis(DateTimeParserBucket.java:92)
	at org.joda.time.format.DateTimeFormatter.parseDateTime(DateTimeFormatter.java:882)
	at org.joda.time.convert.StringConverter.setInto(StringConverter.java:227)
	at org.joda.time.convert.TestStringConverter.testSetIntoInterval_Object_Chronology5(TestStringConverter.java:508)

testSetIntoInterval_Object_Chronology6(org.joda.time.convert.TestStringConverter)  Time elapsed: 0.001 sec  <<< ERROR!
java.lang.ArrayIndexOutOfBoundsException: -1
	at org.joda.time.format.DateTimeParserBucket.computeMillis(DateTimeParserBucket.java:109)
	at org.joda.time.format.DateTimeParserBucket.computeMillis(DateTimeParserBucket.java:92)
	at org.joda.time.format.DateTimeFormatter.parseDateTime(DateTimeFormatter.java:882)
	at org.joda.time.convert.StringConverter.setInto(StringConverter.java:212)
	at org.joda.time.convert.TestStringConverter.testSetIntoInterval_Object_Chronology6(TestStringConverter.java:516)

testGetInstantMillis_Object_Chronology(org.joda.time.convert.TestStringConverter)  Time elapsed: 0.001 sec  <<< ERROR!
java.lang.ArrayIndexOutOfBoundsException: -1
	at org.joda.time.format.DateTimeParserBucket.computeMillis(DateTimeParserBucket.java:109)
	at org.joda.time.format.DateTimeParserBucket.doParseMillis(DateTimeParserBucket.java:55)
	at org.joda.time.format.DateTimeFormatter.parseMillis(DateTimeFormatter.java:780)
	at org.joda.time.convert.StringConverter.getInstantMillis(StringConverter.java:65)
	at org.joda.time.convert.TestStringConverter.testGetInstantMillis_Object_Chronology(TestStringConverter.java:172)

testSetIntoInterval_Object_Chronology7(org.joda.time.convert.TestStringConverter)  Time elapsed: 0 sec  <<< ERROR!
java.lang.ArrayIndexOutOfBoundsException: -1
	at org.joda.time.format.DateTimeParserBucket.computeMillis(DateTimeParserBucket.java:109)
	at org.joda.time.format.DateTimeParserBucket.computeMillis(DateTimeParserBucket.java:92)
	at org.joda.time.format.DateTimeFormatter.parseDateTime(DateTimeFormatter.java:882)
	at org.joda.time.convert.StringConverter.setInto(StringConverter.java:212)
	at org.joda.time.convert.TestStringConverter.testSetIntoInterval_Object_Chronology7(TestStringConverter.java:524)

testSetIntoInterval_Object_Chronology8(org.joda.time.convert.TestStringConverter)  Time elapsed: 0.002 sec  <<< ERROR!
java.lang.ArrayIndexOutOfBoundsException: -1
	at org.joda.time.format.DateTimeParserBucket.computeMillis(DateTimeParserBucket.java:109)
	at org.joda.time.format.DateTimeParserBucket.computeMillis(DateTimeParserBucket.java:92)
	at org.joda.time.format.DateTimeFormatter.parseDateTime(DateTimeFormatter.java:882)
	at org.joda.time.convert.StringConverter.setInto(StringConverter.java:212)
	at org.joda.time.convert.TestStringConverter.testSetIntoInterval_Object_Chronology8(TestStringConverter.java:532)

testParseMillis_fractionOfSecondLong(org.joda.time.format.TestDateTimeFormatter)  Time elapsed: 0.001 sec  <<< ERROR!
java.lang.ArrayIndexOutOfBoundsException: -1
	at org.joda.time.format.DateTimeParserBucket.computeMillis(DateTimeParserBucket.java:109)
	at org.joda.time.format.DateTimeParserBucket.doParseMillis(DateTimeParserBucket.java:55)
	at org.joda.time.format.DateTimeFormatter.parseMillis(DateTimeFormatter.java:780)
	at org.joda.time.format.TestDateTimeFormatter.testParseMillis_fractionOfSecondLong(TestDateTimeFormatter.java:989)

testPrinterParserMethods(org.joda.time.format.TestDateTimeFormatter)  Time elapsed: 0.002 sec  <<< ERROR!
java.lang.ArrayIndexOutOfBoundsException: -1
	at org.joda.time.format.DateTimeParserBucket.computeMillis(DateTimeParserBucket.java:109)
	at org.joda.time.format.DateTimeParserBucket.computeMillis(DateTimeParserBucket.java:92)
	at org.joda.time.format.DateTimeFormatter.parseDateTime(DateTimeFormatter.java:882)
	at org.joda.time.format.TestDateTimeFormatter.testPrinterParserMethods(TestDateTimeFormatter.java:338)

testParseLocalDate_simple(org.joda.time.format.TestDateTimeFormatter)  Time elapsed: 0.006 sec  <<< ERROR!
java.lang.ArrayIndexOutOfBoundsException: -1
	at org.joda.time.format.DateTimeParserBucket.computeMillis(DateTimeParserBucket.java:109)
	at org.joda.time.format.DateTimeParserBucket.computeMillis(DateTimeParserBucket.java:92)
	at org.joda.time.format.DateTimeFormatter.parseLocalDateTime(DateTimeFormatter.java:841)
	at org.joda.time.format.DateTimeFormatter.parseLocalDate(DateTimeFormatter.java:798)
	at org.joda.time.format.TestDateTimeFormatter.testParseLocalDate_simple(TestDateTimeFormatter.java:365)

testParseLocalDate_yearOfEra(org.joda.time.format.TestDateTimeFormatter)  Time elapsed: 0 sec  <<< ERROR!
java.lang.ArrayIndexOutOfBoundsException: -1
	at org.joda.time.format.DateTimeParserBucket.computeMillis(DateTimeParserBucket.java:109)
	at org.joda.time.format.DateTimeParserBucket.computeMillis(DateTimeParserBucket.java:92)
	at org.joda.time.format.DateTimeFormatter.parseLocalDateTime(DateTimeFormatter.java:841)
	at org.joda.time.format.DateTimeFormatter.parseLocalDate(DateTimeFormatter.java:798)
	at org.joda.time.format.TestDateTimeFormatter.testParseLocalDate_yearOfEra(TestDateTimeFormatter.java:384)

testParseLocalDate_yearOfCentury(org.joda.time.format.TestDateTimeFormatter)  Time elapsed: 0 sec  <<< ERROR!
java.lang.ArrayIndexOutOfBoundsException: -1
	at org.joda.time.format.DateTimeParserBucket.computeMillis(DateTimeParserBucket.java:109)
	at org.joda.time.format.DateTimeParserBucket.computeMillis(DateTimeParserBucket.java:92)
	at org.joda.time.format.DateTimeFormatter.parseLocalDateTime(DateTimeFormatter.java:841)
	at org.joda.time.format.DateTimeFormatter.parseLocalDate(DateTimeFormatter.java:798)
	at org.joda.time.format.TestDateTimeFormatter.testParseLocalDate_yearOfCentury(TestDateTimeFormatter.java:401)

testParseLocalDate_monthDay_feb29(org.joda.time.format.TestDateTimeFormatter)  Time elapsed: 0 sec  <<< ERROR!
java.lang.ArrayIndexOutOfBoundsException: -1
	at org.joda.time.format.DateTimeParserBucket.computeMillis(DateTimeParserBucket.java:109)
	at org.joda.time.format.DateTimeParserBucket.computeMillis(DateTimeParserBucket.java:102)
	at org.joda.time.format.DateTimeParserBucket.computeMillis(DateTimeParserBucket.java:92)
	at org.joda.time.format.DateTimeFormatter.parseLocalDateTime(DateTimeFormatter.java:841)
	at org.joda.time.format.DateTimeFormatter.parseLocalDate(DateTimeFormatter.java:798)
	at org.joda.time.format.TestDateTimeFormatter.testParseLocalDate_monthDay_feb29(TestDateTimeFormatter.java:411)

testParseLocalDate_monthDay_withDefaultYear_feb29(org.joda.time.format.TestDateTimeFormatter)  Time elapsed: 0 sec  <<< ERROR!
java.lang.ArrayIndexOutOfBoundsException: -1
	at org.joda.time.format.DateTimeParserBucket.computeMillis(DateTimeParserBucket.java:109)
	at org.joda.time.format.DateTimeParserBucket.computeMillis(DateTimeParserBucket.java:102)
	at org.joda.time.format.DateTimeParserBucket.computeMillis(DateTimeParserBucket.java:92)
	at org.joda.time.format.DateTimeFormatter.parseLocalDateTime(DateTimeFormatter.java:841)
	at org.joda.time.format.DateTimeFormatter.parseLocalDate(DateTimeFormatter.java:798)
	at org.joda.time.format.TestDateTimeFormatter.testParseLocalDate_monthDay_withDefaultYear_feb29(TestDateTimeFormatter.java:422)

testParseLocalDate_weekyear_month_week_2010(org.joda.time.format.TestDateTimeFormatter)  Time elapsed: 0.001 sec  <<< ERROR!
java.lang.ArrayIndexOutOfBoundsException: -1
	at org.joda.time.format.DateTimeParserBucket.computeMillis(DateTimeParserBucket.java:109)
	at org.joda.time.format.DateTimeParserBucket.computeMillis(DateTimeParserBucket.java:92)
	at org.joda.time.format.DateTimeFormatter.parseLocalDateTime(DateTimeFormatter.java:841)
	at org.joda.time.format.DateTimeFormatter.parseLocalDate(DateTimeFormatter.java:798)
	at org.joda.time.format.TestDateTimeFormatter.testParseLocalDate_weekyear_month_week_2010(TestDateTimeFormatter.java:428)

testParseLocalDate_weekyear_month_week_2011(org.joda.time.format.TestDateTimeFormatter)  Time elapsed: 0 sec  <<< ERROR!
java.lang.ArrayIndexOutOfBoundsException: -1
	at org.joda.time.format.DateTimeParserBucket.computeMillis(DateTimeParserBucket.java:109)
	at org.joda.time.format.DateTimeParserBucket.computeMillis(DateTimeParserBucket.java:92)
	at org.joda.time.format.DateTimeFormatter.parseLocalDateTime(DateTimeFormatter.java:841)
	at org.joda.time.format.DateTimeFormatter.parseLocalDate(DateTimeFormatter.java:798)
	at org.joda.time.format.TestDateTimeFormatter.testParseLocalDate_weekyear_month_week_2011(TestDateTimeFormatter.java:434)

testParseLocalDate_weekyear_month_week_2012(org.joda.time.format.TestDateTimeFormatter)  Time elapsed: 0 sec  <<< ERROR!
java.lang.ArrayIndexOutOfBoundsException: -1
	at org.joda.time.format.DateTimeParserBucket.computeMillis(DateTimeParserBucket.java:109)
	at org.joda.time.format.DateTimeParserBucket.computeMillis(DateTimeParserBucket.java:92)
	at org.joda.time.format.DateTimeFormatter.parseLocalDateTime(DateTimeFormatter.java:841)
	at org.joda.time.format.DateTimeFormatter.parseLocalDate(DateTimeFormatter.java:798)
	at org.joda.time.format.TestDateTimeFormatter.testParseLocalDate_weekyear_month_week_2012(TestDateTimeFormatter.java:440)

testParseLocalDate_year_month_week_2010(org.joda.time.format.TestDateTimeFormatter)  Time elapsed: 0 sec  <<< ERROR!
java.lang.ArrayIndexOutOfBoundsException: -1
	at org.joda.time.format.DateTimeParserBucket.computeMillis(DateTimeParserBucket.java:109)
	at org.joda.time.format.DateTimeParserBucket.computeMillis(DateTimeParserBucket.java:92)
	at org.joda.time.format.DateTimeFormatter.parseLocalDateTime(DateTimeFormatter.java:841)
	at org.joda.time.format.DateTimeFormatter.parseLocalDate(DateTimeFormatter.java:798)
	at org.joda.time.format.TestDateTimeFormatter.testParseLocalDate_year_month_week_2010(TestDateTimeFormatter.java:454)

testParseLocalDate_year_month_week_2011(org.joda.time.format.TestDateTimeFormatter)  Time elapsed: 0 sec  <<< ERROR!
java.lang.ArrayIndexOutOfBoundsException: -1
	at org.joda.time.format.DateTimeParserBucket.computeMillis(DateTimeParserBucket.java:109)
	at org.joda.time.format.DateTimeParserBucket.computeMillis(DateTimeParserBucket.java:92)
	at org.joda.time.format.DateTimeFormatter.parseLocalDateTime(DateTimeFormatter.java:841)
	at org.joda.time.format.DateTimeFormatter.parseLocalDate(DateTimeFormatter.java:798)
	at org.joda.time.format.TestDateTimeFormatter.testParseLocalDate_year_month_week_2011(TestDateTimeFormatter.java:460)

testParseLocalDate_year_month_week_2012(org.joda.time.format.TestDateTimeFormatter)  Time elapsed: 0 sec  <<< ERROR!
java.lang.ArrayIndexOutOfBoundsException: -1
	at org.joda.time.format.DateTimeParserBucket.computeMillis(DateTimeParserBucket.java:109)
	at org.joda.time.format.DateTimeParserBucket.computeMillis(DateTimeParserBucket.java:92)
	at org.joda.time.format.DateTimeFormatter.parseLocalDateTime(DateTimeFormatter.java:841)
	at org.joda.time.format.DateTimeFormatter.parseLocalDate(DateTimeFormatter.java:798)
	at org.joda.time.format.TestDateTimeFormatter.testParseLocalDate_year_month_week_2012(TestDateTimeFormatter.java:466)

testParseLocalDate_year_month_week_2013(org.joda.time.format.TestDateTimeFormatter)  Time elapsed: 0.001 sec  <<< ERROR!
java.lang.ArrayIndexOutOfBoundsException: -1
	at org.joda.time.format.DateTimeParserBucket.computeMillis(DateTimeParserBucket.java:109)
	at org.joda.time.format.DateTimeParserBucket.computeMillis(DateTimeParserBucket.java:92)
	at org.joda.time.format.DateTimeFormatter.parseLocalDateTime(DateTimeFormatter.java:841)
	at org.joda.time.format.DateTimeFormatter.parseLocalDate(DateTimeFormatter.java:798)
	at org.joda.time.format.TestDateTimeFormatter.testParseLocalDate_year_month_week_2013(TestDateTimeFormatter.java:472)

testParseLocalDate_year_month_week_2014(org.joda.time.format.TestDateTimeFormatter)  Time elapsed: 0 sec  <<< ERROR!
java.lang.ArrayIndexOutOfBoundsException: -1
	at org.joda.time.format.DateTimeParserBucket.computeMillis(DateTimeParserBucket.java:109)
	at org.joda.time.format.DateTimeParserBucket.computeMillis(DateTimeParserBucket.java:92)
	at org.joda.time.format.DateTimeFormatter.parseLocalDateTime(DateTimeFormatter.java:841)
	at org.joda.time.format.DateTimeFormatter.parseLocalDate(DateTimeFormatter.java:798)
	at org.joda.time.format.TestDateTimeFormatter.testParseLocalDate_year_month_week_2014(TestDateTimeFormatter.java:478)

testParseLocalDate_year_month_week_2015(org.joda.time.format.TestDateTimeFormatter)  Time elapsed: 0.001 sec  <<< ERROR!
java.lang.ArrayIndexOutOfBoundsException: -1
	at org.joda.time.format.DateTimeParserBucket.computeMillis(DateTimeParserBucket.java:109)
	at org.joda.time.format.DateTimeParserBucket.computeMillis(DateTimeParserBucket.java:92)
	at org.joda.time.format.DateTimeFormatter.parseLocalDateTime(DateTimeFormatter.java:841)
	at org.joda.time.format.DateTimeFormatter.parseLocalDate(DateTimeFormatter.java:798)
	at org.joda.time.format.TestDateTimeFormatter.testParseLocalDate_year_month_week_2015(TestDateTimeFormatter.java:484)

testParseLocalDate_year_month_week_2016(org.joda.time.format.TestDateTimeFormatter)  Time elapsed: 0 sec  <<< ERROR!
java.lang.ArrayIndexOutOfBoundsException: -1
	at org.joda.time.format.DateTimeParserBucket.computeMillis(DateTimeParserBucket.java:109)
	at org.joda.time.format.DateTimeParserBucket.computeMillis(DateTimeParserBucket.java:92)
	at org.joda.time.format.DateTimeFormatter.parseLocalDateTime(DateTimeFormatter.java:841)
	at org.joda.time.format.DateTimeFormatter.parseLocalDate(DateTimeFormatter.java:798)
	at org.joda.time.format.TestDateTimeFormatter.testParseLocalDate_year_month_week_2016(TestDateTimeFormatter.java:490)

testParseLocalTime_simple(org.joda.time.format.TestDateTimeFormatter)  Time elapsed: 0.001 sec  <<< ERROR!
java.lang.ArrayIndexOutOfBoundsException: -1
	at org.joda.time.format.DateTimeParserBucket.computeMillis(DateTimeParserBucket.java:109)
	at org.joda.time.format.DateTimeParserBucket.computeMillis(DateTimeParserBucket.java:92)
	at org.joda.time.format.DateTimeFormatter.parseLocalDateTime(DateTimeFormatter.java:841)
	at org.joda.time.format.DateTimeFormatter.parseLocalTime(DateTimeFormatter.java:816)
	at org.joda.time.format.TestDateTimeFormatter.testParseLocalTime_simple(TestDateTimeFormatter.java:495)

testParseLocalDateTime_simple(org.joda.time.format.TestDateTimeFormatter)  Time elapsed: 0 sec  <<< ERROR!
java.lang.ArrayIndexOutOfBoundsException: -1
	at org.joda.time.format.DateTimeParserBucket.computeMillis(DateTimeParserBucket.java:109)
	at org.joda.time.format.DateTimeParserBucket.computeMillis(DateTimeParserBucket.java:92)
	at org.joda.time.format.DateTimeFormatter.parseLocalDateTime(DateTimeFormatter.java:841)
	at org.joda.time.format.TestDateTimeFormatter.testParseLocalDateTime_simple(TestDateTimeFormatter.java:508)

testParseLocalDateTime_monthDay_feb29(org.joda.time.format.TestDateTimeFormatter)  Time elapsed: 0.001 sec  <<< ERROR!
java.lang.ArrayIndexOutOfBoundsException: -1
	at org.joda.time.format.DateTimeParserBucket.computeMillis(DateTimeParserBucket.java:109)
	at org.joda.time.format.DateTimeParserBucket.computeMillis(DateTimeParserBucket.java:102)
	at org.joda.time.format.DateTimeParserBucket.computeMillis(DateTimeParserBucket.java:92)
	at org.joda.time.format.DateTimeFormatter.parseLocalDateTime(DateTimeFormatter.java:841)
	at org.joda.time.format.TestDateTimeFormatter.testParseLocalDateTime_monthDay_feb29(TestDateTimeFormatter.java:526)

testParseLocalDateTime_monthDay_withDefaultYear_feb29(org.joda.time.format.TestDateTimeFormatter)  Time elapsed: 0 sec  <<< ERROR!
java.lang.ArrayIndexOutOfBoundsException: -1
	at org.joda.time.format.DateTimeParserBucket.computeMillis(DateTimeParserBucket.java:109)
	at org.joda.time.format.DateTimeParserBucket.computeMillis(DateTimeParserBucket.java:102)
	at org.joda.time.format.DateTimeParserBucket.computeMillis(DateTimeParserBucket.java:92)
	at org.joda.time.format.DateTimeFormatter.parseLocalDateTime(DateTimeFormatter.java:841)
	at org.joda.time.format.TestDateTimeFormatter.testParseLocalDateTime_monthDay_withDefaultYear_feb29(TestDateTimeFormatter.java:537)

testParseDateTime_simple(org.joda.time.format.TestDateTimeFormatter)  Time elapsed: 0.001 sec  <<< ERROR!
java.lang.ArrayIndexOutOfBoundsException: -1
	at org.joda.time.format.DateTimeParserBucket.computeMillis(DateTimeParserBucket.java:109)
	at org.joda.time.format.DateTimeParserBucket.computeMillis(DateTimeParserBucket.java:92)
	at org.joda.time.format.DateTimeFormatter.parseDateTime(DateTimeFormatter.java:882)
	at org.joda.time.format.TestDateTimeFormatter.testParseDateTime_simple(TestDateTimeFormatter.java:544)

testParseDateTime_zone(org.joda.time.format.TestDateTimeFormatter)  Time elapsed: 0.001 sec  <<< ERROR!
java.lang.ArrayIndexOutOfBoundsException: -1
	at org.joda.time.format.DateTimeParserBucket.computeMillis(DateTimeParserBucket.java:109)
	at org.joda.time.format.DateTimeParserBucket.computeMillis(DateTimeParserBucket.java:92)
	at org.joda.time.format.DateTimeFormatter.parseDateTime(DateTimeFormatter.java:882)
	at org.joda.time.format.TestDateTimeFormatter.testParseDateTime_zone(TestDateTimeFormatter.java:555)

testParseDateTime_zone2(org.joda.time.format.TestDateTimeFormatter)  Time elapsed: 0 sec  <<< ERROR!
java.lang.ArrayIndexOutOfBoundsException: -1
	at org.joda.time.format.DateTimeParserBucket.computeMillis(DateTimeParserBucket.java:109)
	at org.joda.time.format.DateTimeParserBucket.computeMillis(DateTimeParserBucket.java:92)
	at org.joda.time.format.DateTimeFormatter.parseDateTime(DateTimeFormatter.java:882)
	at org.joda.time.format.TestDateTimeFormatter.testParseDateTime_zone2(TestDateTimeFormatter.java:567)

testParseDateTime_zone3(org.joda.time.format.TestDateTimeFormatter)  Time elapsed: 0 sec  <<< ERROR!
java.lang.ArrayIndexOutOfBoundsException: -1
	at org.joda.time.format.DateTimeParserBucket.computeMillis(DateTimeParserBucket.java:109)
	at org.joda.time.format.DateTimeParserBucket.computeMillis(DateTimeParserBucket.java:92)
	at org.joda.time.format.DateTimeFormatter.parseDateTime(DateTimeFormatter.java:882)
	at org.joda.time.format.TestDateTimeFormatter.testParseDateTime_zone3(TestDateTimeFormatter.java:585)

testParseDateTime_simple_precedence(org.joda.time.format.TestDateTimeFormatter)  Time elapsed: 0.001 sec  <<< ERROR!
java.lang.ArrayIndexOutOfBoundsException: -1
	at org.joda.time.format.DateTimeParserBucket.computeMillis(DateTimeParserBucket.java:109)
	at org.joda.time.format.DateTimeParserBucket.computeMillis(DateTimeParserBucket.java:92)
	at org.joda.time.format.DateTimeFormatter.parseDateTime(DateTimeFormatter.java:882)
	at org.joda.time.format.TestDateTimeFormatter.testParseDateTime_simple_precedence(TestDateTimeFormatter.java:598)

testParseDateTime_offsetParsed(org.joda.time.format.TestDateTimeFormatter)  Time elapsed: 0 sec  <<< ERROR!
java.lang.ArrayIndexOutOfBoundsException: -1
	at org.joda.time.format.DateTimeParserBucket.computeMillis(DateTimeParserBucket.java:109)
	at org.joda.time.format.DateTimeParserBucket.computeMillis(DateTimeParserBucket.java:92)
	at org.joda.time.format.DateTimeFormatter.parseDateTime(DateTimeFormatter.java:882)
	at org.joda.time.format.TestDateTimeFormatter.testParseDateTime_offsetParsed(TestDateTimeFormatter.java:609)

testParseDateTime_chrono(org.joda.time.format.TestDateTimeFormatter)  Time elapsed: 0.001 sec  <<< ERROR!
java.lang.ArrayIndexOutOfBoundsException: -1
	at org.joda.time.format.DateTimeParserBucket.computeMillis(DateTimeParserBucket.java:109)
	at org.joda.time.format.DateTimeParserBucket.computeMillis(DateTimeParserBucket.java:92)
	at org.joda.time.format.DateTimeFormatter.parseDateTime(DateTimeFormatter.java:882)
	at org.joda.time.format.TestDateTimeFormatter.testParseDateTime_chrono(TestDateTimeFormatter.java:623)

testParseMutableDateTime_simple(org.joda.time.format.TestDateTimeFormatter)  Time elapsed: 0 sec  <<< ERROR!
java.lang.ArrayIndexOutOfBoundsException: -1
	at org.joda.time.format.DateTimeParserBucket.computeMillis(DateTimeParserBucket.java:109)
	at org.joda.time.format.DateTimeParserBucket.computeMillis(DateTimeParserBucket.java:92)
	at org.joda.time.format.DateTimeFormatter.parseMutableDateTime(DateTimeFormatter.java:927)
	at org.joda.time.format.TestDateTimeFormatter.testParseMutableDateTime_simple(TestDateTimeFormatter.java:639)

testParseMutableDateTime_zone(org.joda.time.format.TestDateTimeFormatter)  Time elapsed: 0.001 sec  <<< ERROR!
java.lang.ArrayIndexOutOfBoundsException: -1
	at org.joda.time.format.DateTimeParserBucket.computeMillis(DateTimeParserBucket.java:109)
	at org.joda.time.format.DateTimeParserBucket.computeMillis(DateTimeParserBucket.java:92)
	at org.joda.time.format.DateTimeFormatter.parseMutableDateTime(DateTimeFormatter.java:927)
	at org.joda.time.format.TestDateTimeFormatter.testParseMutableDateTime_zone(TestDateTimeFormatter.java:650)

testParseMutableDateTime_zone2(org.joda.time.format.TestDateTimeFormatter)  Time elapsed: 0 sec  <<< ERROR!
java.lang.ArrayIndexOutOfBoundsException: -1
	at org.joda.time.format.DateTimeParserBucket.computeMillis(DateTimeParserBucket.java:109)
	at org.joda.time.format.DateTimeParserBucket.computeMillis(DateTimeParserBucket.java:92)
	at org.joda.time.format.DateTimeFormatter.parseMutableDateTime(DateTimeFormatter.java:927)
	at org.joda.time.format.TestDateTimeFormatter.testParseMutableDateTime_zone2(TestDateTimeFormatter.java:662)

testParseMutableDateTime_zone3(org.joda.time.format.TestDateTimeFormatter)  Time elapsed: 0.001 sec  <<< ERROR!
java.lang.ArrayIndexOutOfBoundsException: -1
	at org.joda.time.format.DateTimeParserBucket.computeMillis(DateTimeParserBucket.java:109)
	at org.joda.time.format.DateTimeParserBucket.computeMillis(DateTimeParserBucket.java:92)
	at org.joda.time.format.DateTimeFormatter.parseMutableDateTime(DateTimeFormatter.java:927)
	at org.joda.time.format.TestDateTimeFormatter.testParseMutableDateTime_zone3(TestDateTimeFormatter.java:680)

testParseMutableDateTime_simple_precedence(org.joda.time.format.TestDateTimeFormatter)  Time elapsed: 0 sec  <<< ERROR!
java.lang.ArrayIndexOutOfBoundsException: -1
	at org.joda.time.format.DateTimeParserBucket.computeMillis(DateTimeParserBucket.java:109)
	at org.joda.time.format.DateTimeParserBucket.computeMillis(DateTimeParserBucket.java:92)
	at org.joda.time.format.DateTimeFormatter.parseDateTime(DateTimeFormatter.java:882)
	at org.joda.time.format.TestDateTimeFormatter.testParseMutableDateTime_simple_precedence(TestDateTimeFormatter.java:693)

testParseMutableDateTime_offsetParsed(org.joda.time.format.TestDateTimeFormatter)  Time elapsed: 0 sec  <<< ERROR!
java.lang.ArrayIndexOutOfBoundsException: -1
	at org.joda.time.format.DateTimeParserBucket.computeMillis(DateTimeParserBucket.java:109)
	at org.joda.time.format.DateTimeParserBucket.computeMillis(DateTimeParserBucket.java:92)
	at org.joda.time.format.DateTimeFormatter.parseMutableDateTime(DateTimeFormatter.java:927)
	at org.joda.time.format.TestDateTimeFormatter.testParseMutableDateTime_offsetParsed(TestDateTimeFormatter.java:704)

testParseMutableDateTime_chrono(org.joda.time.format.TestDateTimeFormatter)  Time elapsed: 0.001 sec  <<< ERROR!
java.lang.ArrayIndexOutOfBoundsException: -1
	at org.joda.time.format.DateTimeParserBucket.computeMillis(DateTimeParserBucket.java:109)
	at org.joda.time.format.DateTimeParserBucket.computeMillis(DateTimeParserBucket.java:92)
	at org.joda.time.format.DateTimeFormatter.parseMutableDateTime(DateTimeFormatter.java:927)
	at org.joda.time.format.TestDateTimeFormatter.testParseMutableDateTime_chrono(TestDateTimeFormatter.java:718)

testFormat_shortBasicParse(org.joda.time.format.TestDateTimeFormat)  Time elapsed: 0.001 sec  <<< ERROR!
java.lang.ArrayIndexOutOfBoundsException: -1
	at org.joda.time.format.DateTimeParserBucket.computeMillis(DateTimeParserBucket.java:109)
	at org.joda.time.format.DateTimeParserBucket.computeMillis(DateTimeParserBucket.java:92)
	at org.joda.time.format.DateTimeFormatter.parseDateTime(DateTimeFormatter.java:882)
	at org.joda.time.format.TestDateTimeFormat.testFormat_shortBasicParse(TestDateTimeFormat.java:854)

testParse_pivotYear(org.joda.time.format.TestDateTimeFormat)  Time elapsed: 0 sec  <<< ERROR!
java.lang.ArrayIndexOutOfBoundsException: -1
	at org.joda.time.format.DateTimeParserBucket.computeMillis(DateTimeParserBucket.java:109)
	at org.joda.time.format.DateTimeParserBucket.computeMillis(DateTimeParserBucket.java:92)
	at org.joda.time.format.DateTimeFormatter.parseDateTime(DateTimeFormatter.java:882)
	at org.joda.time.format.TestDateTimeFormat.testParse_pivotYear(TestDateTimeFormat.java:869)

testParse_pivotYear_ignored4DigitYear(org.joda.time.format.TestDateTimeFormat)  Time elapsed: 0.001 sec  <<< ERROR!
java.lang.ArrayIndexOutOfBoundsException: -1
	at org.joda.time.format.DateTimeParserBucket.computeMillis(DateTimeParserBucket.java:109)
	at org.joda.time.format.DateTimeParserBucket.computeMillis(DateTimeParserBucket.java:92)
	at org.joda.time.format.DateTimeFormatter.parseDateTime(DateTimeFormatter.java:882)
	at org.joda.time.format.TestDateTimeFormat.testParse_pivotYear_ignored4DigitYear(TestDateTimeFormat.java:882)

testFormatParse_textMonthJanShort_UK(org.joda.time.format.TestDateTimeFormat)  Time elapsed: 0 sec  <<< ERROR!
java.lang.ArrayIndexOutOfBoundsException: -1
	at org.joda.time.format.DateTimeParserBucket.computeMillis(DateTimeParserBucket.java:109)
	at org.joda.time.format.DateTimeParserBucket.computeMillis(DateTimeParserBucket.java:92)
	at org.joda.time.format.DateTimeFormatter.parseDateTime(DateTimeFormatter.java:882)
	at org.joda.time.format.TestDateTimeFormat.testFormatParse_textMonthJanShort_UK(TestDateTimeFormat.java:899)

testFormatParse_textMonthJanShortLowerCase_UK(org.joda.time.format.TestDateTimeFormat)  Time elapsed: 0.001 sec  <<< ERROR!
java.lang.ArrayIndexOutOfBoundsException: -1
	at org.joda.time.format.DateTimeParserBucket.computeMillis(DateTimeParserBucket.java:109)
	at org.joda.time.format.DateTimeParserBucket.computeMillis(DateTimeParserBucket.java:92)
	at org.joda.time.format.DateTimeFormatter.parseDateTime(DateTimeFormatter.java:882)
	at org.joda.time.format.TestDateTimeFormat.testFormatParse_textMonthJanShortLowerCase_UK(TestDateTimeFormat.java:906)

testFormatParse_textMonthJanShortUpperCase_UK(org.joda.time.format.TestDateTimeFormat)  Time elapsed: 0 sec  <<< ERROR!
java.lang.ArrayIndexOutOfBoundsException: -1
	at org.joda.time.format.DateTimeParserBucket.computeMillis(DateTimeParserBucket.java:109)
	at org.joda.time.format.DateTimeParserBucket.computeMillis(DateTimeParserBucket.java:92)
	at org.joda.time.format.DateTimeFormatter.parseDateTime(DateTimeFormatter.java:882)
	at org.joda.time.format.TestDateTimeFormat.testFormatParse_textMonthJanShortUpperCase_UK(TestDateTimeFormat.java:913)

testParse_textMonthJanLong_UK(org.joda.time.format.TestDateTimeFormat)  Time elapsed: 0.001 sec  <<< ERROR!
java.lang.ArrayIndexOutOfBoundsException: -1
	at org.joda.time.format.DateTimeParserBucket.computeMillis(DateTimeParserBucket.java:109)
	at org.joda.time.format.DateTimeParserBucket.computeMillis(DateTimeParserBucket.java:92)
	at org.joda.time.format.DateTimeFormatter.parseDateTime(DateTimeFormatter.java:882)
	at org.joda.time.format.TestDateTimeFormat.testParse_textMonthJanLong_UK(TestDateTimeFormat.java:921)

testFormatParse_textMonthJanLongLowerCase_UK(org.joda.time.format.TestDateTimeFormat)  Time elapsed: 0 sec  <<< ERROR!
java.lang.ArrayIndexOutOfBoundsException: -1
	at org.joda.time.format.DateTimeParserBucket.computeMillis(DateTimeParserBucket.java:109)
	at org.joda.time.format.DateTimeParserBucket.computeMillis(DateTimeParserBucket.java:92)
	at org.joda.time.format.DateTimeFormatter.parseDateTime(DateTimeFormatter.java:882)
	at org.joda.time.format.TestDateTimeFormat.testFormatParse_textMonthJanLongLowerCase_UK(TestDateTimeFormat.java:928)

testFormatParse_textMonthJanLongUpperCase_UK(org.joda.time.format.TestDateTimeFormat)  Time elapsed: 0.001 sec  <<< ERROR!
java.lang.ArrayIndexOutOfBoundsException: -1
	at org.joda.time.format.DateTimeParserBucket.computeMillis(DateTimeParserBucket.java:109)
	at org.joda.time.format.DateTimeParserBucket.computeMillis(DateTimeParserBucket.java:92)
	at org.joda.time.format.DateTimeFormatter.parseDateTime(DateTimeFormatter.java:882)
	at org.joda.time.format.TestDateTimeFormat.testFormatParse_textMonthJanLongUpperCase_UK(TestDateTimeFormat.java:935)

testFormatParse_textMonthJanShort_France(org.joda.time.format.TestDateTimeFormat)  Time elapsed: 0.001 sec  <<< ERROR!
java.lang.ArrayIndexOutOfBoundsException: -1
	at org.joda.time.format.DateTimeParserBucket.computeMillis(DateTimeParserBucket.java:109)
	at org.joda.time.format.DateTimeParserBucket.computeMillis(DateTimeParserBucket.java:92)
	at org.joda.time.format.DateTimeFormatter.parseDateTime(DateTimeFormatter.java:882)
	at org.joda.time.format.TestDateTimeFormat.testFormatParse_textMonthJanShort_France(TestDateTimeFormat.java:945)

testFormatParse_textMonthJanLong_France(org.joda.time.format.TestDateTimeFormat)  Time elapsed: 0.001 sec  <<< ERROR!
java.lang.ArrayIndexOutOfBoundsException: -1
	at org.joda.time.format.DateTimeParserBucket.computeMillis(DateTimeParserBucket.java:109)
	at org.joda.time.format.DateTimeParserBucket.computeMillis(DateTimeParserBucket.java:92)
	at org.joda.time.format.DateTimeFormatter.parseDateTime(DateTimeFormatter.java:882)
	at org.joda.time.format.TestDateTimeFormat.testFormatParse_textMonthJanLong_France(TestDateTimeFormat.java:953)

testFormatParse_textMonthApr_France(org.joda.time.format.TestDateTimeFormat)  Time elapsed: 0 sec  <<< ERROR!
java.lang.ArrayIndexOutOfBoundsException: -1
	at org.joda.time.format.DateTimeParserBucket.computeMillis(DateTimeParserBucket.java:109)
	at org.joda.time.format.DateTimeParserBucket.computeMillis(DateTimeParserBucket.java:92)
	at org.joda.time.format.DateTimeFormatter.parseDateTime(DateTimeFormatter.java:882)
	at org.joda.time.format.TestDateTimeFormat.testFormatParse_textMonthApr_France(TestDateTimeFormat.java:963)

testFormatParse_textMonthAtEnd_France(org.joda.time.format.TestDateTimeFormat)  Time elapsed: 0.001 sec  <<< ERROR!
java.lang.ArrayIndexOutOfBoundsException: -1
	at org.joda.time.format.DateTimeParserBucket.computeMillis(DateTimeParserBucket.java:109)
	at org.joda.time.format.DateTimeParserBucket.computeMillis(DateTimeParserBucket.java:102)
	at org.joda.time.format.DateTimeParserBucket.computeMillis(DateTimeParserBucket.java:92)
	at org.joda.time.format.DateTimeFormatter.parseDateTime(DateTimeFormatter.java:882)
	at org.joda.time.format.TestDateTimeFormat.testFormatParse_textMonthAtEnd_France(TestDateTimeFormat.java:973)

testFormatParse_textMonthAtEnd_France_withSpecifiedDefault(org.joda.time.format.TestDateTimeFormat)  Time elapsed: 0 sec  <<< ERROR!
java.lang.ArrayIndexOutOfBoundsException: -1
	at org.joda.time.format.DateTimeParserBucket.computeMillis(DateTimeParserBucket.java:109)
	at org.joda.time.format.DateTimeParserBucket.computeMillis(DateTimeParserBucket.java:102)
	at org.joda.time.format.DateTimeParserBucket.computeMillis(DateTimeParserBucket.java:92)
	at org.joda.time.format.DateTimeFormatter.parseDateTime(DateTimeFormatter.java:882)
	at org.joda.time.format.TestDateTimeFormat.testFormatParse_textMonthAtEnd_France_withSpecifiedDefault(TestDateTimeFormat.java:983)

testFormatParse_textMonthApr_Korean(org.joda.time.format.TestDateTimeFormat)  Time elapsed: 0.007 sec  <<< ERROR!
java.lang.ArrayIndexOutOfBoundsException: -1
	at org.joda.time.format.DateTimeParserBucket.computeMillis(DateTimeParserBucket.java:109)
	at org.joda.time.format.DateTimeParserBucket.computeMillis(DateTimeParserBucket.java:92)
	at org.joda.time.format.DateTimeFormatter.parseDateTime(DateTimeFormatter.java:882)
	at org.joda.time.format.TestDateTimeFormat.testFormatParse_textMonthApr_Korean(TestDateTimeFormat.java:992)

testFormatParse_textHalfdayAM_UK(org.joda.time.format.TestDateTimeFormat)  Time elapsed: 0 sec  <<< ERROR!
java.lang.ArrayIndexOutOfBoundsException: -1
	at org.joda.time.format.DateTimeParserBucket.computeMillis(DateTimeParserBucket.java:109)
	at org.joda.time.format.DateTimeParserBucket.computeMillis(DateTimeParserBucket.java:92)
	at org.joda.time.format.DateTimeFormatter.parseDateTime(DateTimeFormatter.java:882)
	at org.joda.time.format.TestDateTimeFormat.testFormatParse_textHalfdayAM_UK(TestDateTimeFormat.java:1010)

testFormatParse_textHalfdayAM_France(org.joda.time.format.TestDateTimeFormat)  Time elapsed: 0.001 sec  <<< ERROR!
java.lang.ArrayIndexOutOfBoundsException: -1
	at org.joda.time.format.DateTimeParserBucket.computeMillis(DateTimeParserBucket.java:109)
	at org.joda.time.format.DateTimeParserBucket.computeMillis(DateTimeParserBucket.java:92)
	at org.joda.time.format.DateTimeFormatter.parseDateTime(DateTimeFormatter.java:882)
	at org.joda.time.format.TestDateTimeFormat.testFormatParse_textHalfdayAM_France(TestDateTimeFormat.java:1027)

testFormatParse_textEraAD_UK(org.joda.time.format.TestDateTimeFormat)  Time elapsed: 0 sec  <<< ERROR!
java.lang.ArrayIndexOutOfBoundsException: -1
	at org.joda.time.format.DateTimeParserBucket.computeMillis(DateTimeParserBucket.java:109)
	at org.joda.time.format.DateTimeParserBucket.computeMillis(DateTimeParserBucket.java:92)
	at org.joda.time.format.DateTimeFormatter.parseDateTime(DateTimeFormatter.java:882)
	at org.joda.time.format.TestDateTimeFormat.testFormatParse_textEraAD_UK(TestDateTimeFormat.java:1042)

testFormatParse_textEraAD_France(org.joda.time.format.TestDateTimeFormat)  Time elapsed: 0 sec  <<< ERROR!
java.lang.ArrayIndexOutOfBoundsException: -1
	at org.joda.time.format.DateTimeParserBucket.computeMillis(DateTimeParserBucket.java:109)
	at org.joda.time.format.DateTimeParserBucket.computeMillis(DateTimeParserBucket.java:92)
	at org.joda.time.format.DateTimeFormatter.parseDateTime(DateTimeFormatter.java:882)
	at org.joda.time.format.TestDateTimeFormat.testFormatParse_textEraAD_France(TestDateTimeFormat.java:1056)

testFormatParse_textEraBC_France(org.joda.time.format.TestDateTimeFormat)  Time elapsed: 0.001 sec  <<< ERROR!
java.lang.ArrayIndexOutOfBoundsException: -1
	at org.joda.time.format.DateTimeParserBucket.computeMillis(DateTimeParserBucket.java:109)
	at org.joda.time.format.DateTimeParserBucket.computeMillis(DateTimeParserBucket.java:92)
	at org.joda.time.format.DateTimeFormatter.parseDateTime(DateTimeFormatter.java:882)
	at org.joda.time.format.TestDateTimeFormat.testFormatParse_textEraBC_France(TestDateTimeFormat.java:1070)

testFormatParse_textAdjoiningHelloWorld_UK(org.joda.time.format.TestDateTimeFormat)  Time elapsed: 0.001 sec  <<< ERROR!
java.lang.ArrayIndexOutOfBoundsException: -1
	at org.joda.time.format.DateTimeParserBucket.computeMillis(DateTimeParserBucket.java:109)
	at org.joda.time.format.DateTimeParserBucket.computeMillis(DateTimeParserBucket.java:102)
	at org.joda.time.format.DateTimeParserBucket.computeMillis(DateTimeParserBucket.java:92)
	at org.joda.time.format.DateTimeFormatter.parseDateTime(DateTimeFormatter.java:882)
	at org.joda.time.format.TestDateTimeFormat.testFormatParse_textAdjoiningHelloWorld_UK(TestDateTimeFormat.java:1121)

testFormatParse_textAdjoiningMonthDOW_UK(org.joda.time.format.TestDateTimeFormat)  Time elapsed: 0 sec  <<< ERROR!
java.lang.ArrayIndexOutOfBoundsException: -1
	at org.joda.time.format.DateTimeParserBucket.computeMillis(DateTimeParserBucket.java:109)
	at org.joda.time.format.DateTimeParserBucket.computeMillis(DateTimeParserBucket.java:102)
	at org.joda.time.format.DateTimeParserBucket.computeMillis(DateTimeParserBucket.java:92)
	at org.joda.time.format.DateTimeFormatter.parseDateTime(DateTimeFormatter.java:882)
	at org.joda.time.format.TestDateTimeFormat.testFormatParse_textAdjoiningMonthDOW_UK(TestDateTimeFormat.java:1135)

testFormatParse_zoneId_noColon(org.joda.time.format.TestDateTimeFormat)  Time elapsed: 0.002 sec  <<< ERROR!
java.lang.ArrayIndexOutOfBoundsException: -1
	at org.joda.time.format.DateTimeParserBucket.computeMillis(DateTimeParserBucket.java:109)
	at org.joda.time.format.DateTimeParserBucket.computeMillis(DateTimeParserBucket.java:92)
	at org.joda.time.format.DateTimeFormatter.parseDateTime(DateTimeFormatter.java:882)
	at org.joda.time.format.TestDateTimeFormat.testFormatParse_zoneId_noColon(TestDateTimeFormat.java:1143)

testFormatParse_zoneId_noColon_parseZ(org.joda.time.format.TestDateTimeFormat)  Time elapsed: 0 sec  <<< ERROR!
java.lang.ArrayIndexOutOfBoundsException: -1
	at org.joda.time.format.DateTimeParserBucket.computeMillis(DateTimeParserBucket.java:109)
	at org.joda.time.format.DateTimeParserBucket.computeMillis(DateTimeParserBucket.java:92)
	at org.joda.time.format.DateTimeFormatter.parseDateTime(DateTimeFormatter.java:882)
	at org.joda.time.format.TestDateTimeFormat.testFormatParse_zoneId_noColon_parseZ(TestDateTimeFormat.java:1150)

testFormatParse_zoneId_colon(org.joda.time.format.TestDateTimeFormat)  Time elapsed: 0 sec  <<< ERROR!
java.lang.ArrayIndexOutOfBoundsException: -1
	at org.joda.time.format.DateTimeParserBucket.computeMillis(DateTimeParserBucket.java:109)
	at org.joda.time.format.DateTimeParserBucket.computeMillis(DateTimeParserBucket.java:92)
	at org.joda.time.format.DateTimeFormatter.parseDateTime(DateTimeFormatter.java:882)
	at org.joda.time.format.TestDateTimeFormat.testFormatParse_zoneId_colon(TestDateTimeFormat.java:1159)

testFormatParse_zoneId_colon_parseZ(org.joda.time.format.TestDateTimeFormat)  Time elapsed: 0 sec  <<< ERROR!
java.lang.ArrayIndexOutOfBoundsException: -1
	at org.joda.time.format.DateTimeParserBucket.computeMillis(DateTimeParserBucket.java:109)
	at org.joda.time.format.DateTimeParserBucket.computeMillis(DateTimeParserBucket.java:92)
	at org.joda.time.format.DateTimeFormatter.parseDateTime(DateTimeFormatter.java:882)
	at org.joda.time.format.TestDateTimeFormat.testFormatParse_zoneId_colon_parseZ(TestDateTimeFormat.java:1166)

testFormat_yearOfEra_twoDigit(org.joda.time.format.TestDateTimeFormat)  Time elapsed: 0 sec  <<< ERROR!
java.lang.ArrayIndexOutOfBoundsException: -1
	at org.joda.time.format.DateTimeParserBucket.computeMillis(DateTimeParserBucket.java:109)
	at org.joda.time.format.DateTimeParserBucket.computeMillis(DateTimeParserBucket.java:92)
	at org.joda.time.format.DateTimeFormatter.parseDateTime(DateTimeFormatter.java:882)
	at org.joda.time.format.TestDateTimeFormat.testFormat_yearOfEra_twoDigit(TestDateTimeFormat.java:155)

testFormat_yearOfEraParse(org.joda.time.format.TestDateTimeFormat)  Time elapsed: 0 sec  <<< ERROR!
java.lang.ArrayIndexOutOfBoundsException: -1
	at org.joda.time.format.DateTimeParserBucket.computeMillis(DateTimeParserBucket.java:109)
	at org.joda.time.format.DateTimeParserBucket.computeMillis(DateTimeParserBucket.java:92)
	at org.joda.time.format.DateTimeFormatter.parseDateTime(DateTimeFormatter.java:882)
	at org.joda.time.format.TestDateTimeFormat.testFormat_yearOfEraParse(TestDateTimeFormat.java:200)

testFormat_year_twoDigit(org.joda.time.format.TestDateTimeFormat)  Time elapsed: 0.001 sec  <<< ERROR!
java.lang.ArrayIndexOutOfBoundsException: -1
	at org.joda.time.format.DateTimeParserBucket.computeMillis(DateTimeParserBucket.java:109)
	at org.joda.time.format.DateTimeParserBucket.computeMillis(DateTimeParserBucket.java:92)
	at org.joda.time.format.DateTimeFormatter.parseDateTime(DateTimeFormatter.java:882)
	at org.joda.time.format.TestDateTimeFormat.testFormat_year_twoDigit(TestDateTimeFormat.java:247)

testFormat_weekyearOfEra_twoDigit(org.joda.time.format.TestDateTimeFormat)  Time elapsed: 0 sec  <<< ERROR!
java.lang.ArrayIndexOutOfBoundsException: -1
	at org.joda.time.format.DateTimeParserBucket.computeMillis(DateTimeParserBucket.java:109)
	at org.joda.time.format.DateTimeParserBucket.computeMillis(DateTimeParserBucket.java:92)
	at org.joda.time.format.DateTimeFormatter.parseDateTime(DateTimeFormatter.java:882)
	at org.joda.time.format.TestDateTimeFormat.testFormat_weekyearOfEra_twoDigit(TestDateTimeFormat.java:392)

testForStyle_shortDate(org.joda.time.format.TestDateTimeFormatStyle)  Time elapsed: 0.008 sec  <<< ERROR!
java.lang.ArrayIndexOutOfBoundsException: -1
	at org.joda.time.format.DateTimeParserBucket.computeMillis(DateTimeParserBucket.java:109)
	at org.joda.time.format.DateTimeParserBucket.computeMillis(DateTimeParserBucket.java:92)
	at org.joda.time.format.DateTimeFormatter.parseDateTime(DateTimeFormatter.java:882)
	at org.joda.time.format.TestDateTimeFormatStyle.testForStyle_shortDate(TestDateTimeFormatStyle.java:141)

testForStyle_shortTime(org.joda.time.format.TestDateTimeFormatStyle)  Time elapsed: 0.001 sec  <<< ERROR!
java.lang.ArrayIndexOutOfBoundsException: -1
	at org.joda.time.format.DateTimeParserBucket.computeMillis(DateTimeParserBucket.java:109)
	at org.joda.time.format.DateTimeParserBucket.computeMillis(DateTimeParserBucket.java:92)
	at org.joda.time.format.DateTimeFormatter.parseDateTime(DateTimeFormatter.java:882)
	at org.joda.time.format.TestDateTimeFormatStyle.testForStyle_shortTime(TestDateTimeFormatStyle.java:161)

testForStyle_shortDateTime(org.joda.time.format.TestDateTimeFormatStyle)  Time elapsed: 0.002 sec  <<< ERROR!
java.lang.ArrayIndexOutOfBoundsException: -1
	at org.joda.time.format.DateTimeParserBucket.computeMillis(DateTimeParserBucket.java:109)
	at org.joda.time.format.DateTimeParserBucket.computeMillis(DateTimeParserBucket.java:92)
	at org.joda.time.format.DateTimeFormatter.parseDateTime(DateTimeFormatter.java:882)
	at org.joda.time.format.TestDateTimeFormatStyle.testForStyle_shortDateTime(TestDateTimeFormatStyle.java:179)

testParse(org.joda.time.format.TestDateTimeParserBucket)  Time elapsed: 0.001 sec  <<< ERROR!
java.lang.ArrayIndexOutOfBoundsException: -1
	at org.joda.time.format.DateTimeParserBucket.computeMillis(DateTimeParserBucket.java:109)
	at org.joda.time.format.DateTimeParserBucket.doParseMillis(DateTimeParserBucket.java:55)
	at org.joda.time.format.DateTimeParserBucket.parseMillis(DateTimeParserBucket.java:53)
	at org.joda.time.format.TestDateTimeParserBucket.testParse(TestDateTimeParserBucket.java:286)

testSaveCompute(org.joda.time.format.TestDateTimeParserBucket)  Time elapsed: 0.001 sec  <<< ERROR!
java.lang.ArrayIndexOutOfBoundsException: -1
	at org.joda.time.format.DateTimeParserBucket.computeMillis(DateTimeParserBucket.java:109)
	at org.joda.time.format.DateTimeParserBucket.computeMillis(DateTimeParserBucket.java:91)
	at org.joda.time.format.TestDateTimeParserBucket.testSaveCompute(TestDateTimeParserBucket.java:129)

test_basicOrdinalDate(org.joda.time.format.TestISODateTimeFormatParsing)  Time elapsed: 0 sec  <<< ERROR!
java.lang.ArrayIndexOutOfBoundsException: -1
	at org.joda.time.format.DateTimeParserBucket.computeMillis(DateTimeParserBucket.java:109)
	at org.joda.time.format.DateTimeParserBucket.computeMillis(DateTimeParserBucket.java:92)
	at org.joda.time.format.DateTimeFormatter.parseDateTime(DateTimeFormatter.java:882)
	at org.joda.time.format.TestISODateTimeFormatParsing.assertParse(TestISODateTimeFormatParsing.java:840)
	at org.joda.time.format.TestISODateTimeFormatParsing.test_basicOrdinalDate(TestISODateTimeFormatParsing.java:676)

test_basicOrdinalDateTime(org.joda.time.format.TestISODateTimeFormatParsing)  Time elapsed: 0 sec  <<< ERROR!
java.lang.ArrayIndexOutOfBoundsException: -1
	at org.joda.time.format.DateTimeParserBucket.computeMillis(DateTimeParserBucket.java:109)
	at org.joda.time.format.DateTimeParserBucket.computeMillis(DateTimeParserBucket.java:92)
	at org.joda.time.format.DateTimeFormatter.parseDateTime(DateTimeFormatter.java:882)
	at org.joda.time.format.TestISODateTimeFormatParsing.assertParse(TestISODateTimeFormatParsing.java:840)
	at org.joda.time.format.TestISODateTimeFormatParsing.test_basicOrdinalDateTime(TestISODateTimeFormatParsing.java:686)

test_basicOrdinalDateTimeNoMillis(org.joda.time.format.TestISODateTimeFormatParsing)  Time elapsed: 0 sec  <<< ERROR!
java.lang.ArrayIndexOutOfBoundsException: -1
	at org.joda.time.format.DateTimeParserBucket.computeMillis(DateTimeParserBucket.java:109)
	at org.joda.time.format.DateTimeParserBucket.computeMillis(DateTimeParserBucket.java:92)
	at org.joda.time.format.DateTimeFormatter.parseDateTime(DateTimeFormatter.java:882)
	at org.joda.time.format.TestISODateTimeFormatParsing.assertParse(TestISODateTimeFormatParsing.java:840)
	at org.joda.time.format.TestISODateTimeFormatParsing.test_basicOrdinalDateTimeNoMillis(TestISODateTimeFormatParsing.java:707)

test_basicWeekDate(org.joda.time.format.TestISODateTimeFormatParsing)  Time elapsed: 0 sec  <<< ERROR!
java.lang.ArrayIndexOutOfBoundsException: -1
	at org.joda.time.format.DateTimeParserBucket.computeMillis(DateTimeParserBucket.java:109)
	at org.joda.time.format.DateTimeParserBucket.computeMillis(DateTimeParserBucket.java:92)
	at org.joda.time.format.DateTimeFormatter.parseDateTime(DateTimeFormatter.java:882)
	at org.joda.time.format.TestISODateTimeFormatParsing.assertParse(TestISODateTimeFormatParsing.java:840)
	at org.joda.time.format.TestISODateTimeFormatParsing.test_basicWeekDate(TestISODateTimeFormatParsing.java:724)

test_basicWeekDateTime(org.joda.time.format.TestISODateTimeFormatParsing)  Time elapsed: 0 sec  <<< ERROR!
java.lang.ArrayIndexOutOfBoundsException: -1
	at org.joda.time.format.DateTimeParserBucket.computeMillis(DateTimeParserBucket.java:109)
	at org.joda.time.format.DateTimeParserBucket.computeMillis(DateTimeParserBucket.java:92)
	at org.joda.time.format.DateTimeFormatter.parseDateTime(DateTimeFormatter.java:882)
	at org.joda.time.format.TestISODateTimeFormatParsing.assertParse(TestISODateTimeFormatParsing.java:840)
	at org.joda.time.format.TestISODateTimeFormatParsing.test_basicWeekDateTime(TestISODateTimeFormatParsing.java:734)

test_basicWeekDateTimeNoMillis(org.joda.time.format.TestISODateTimeFormatParsing)  Time elapsed: 0.001 sec  <<< ERROR!
java.lang.ArrayIndexOutOfBoundsException: -1
	at org.joda.time.format.DateTimeParserBucket.computeMillis(DateTimeParserBucket.java:109)
	at org.joda.time.format.DateTimeParserBucket.computeMillis(DateTimeParserBucket.java:92)
	at org.joda.time.format.DateTimeFormatter.parseDateTime(DateTimeFormatter.java:882)
	at org.joda.time.format.TestISODateTimeFormatParsing.assertParse(TestISODateTimeFormatParsing.java:840)
	at org.joda.time.format.TestISODateTimeFormatParsing.test_basicWeekDateTimeNoMillis(TestISODateTimeFormatParsing.java:751)

test_hourMinute(org.joda.time.format.TestISODateTimeFormatParsing)  Time elapsed: 0 sec  <<< ERROR!
java.lang.ArrayIndexOutOfBoundsException: -1
	at org.joda.time.format.DateTimeParserBucket.computeMillis(DateTimeParserBucket.java:109)
	at org.joda.time.format.DateTimeParserBucket.computeMillis(DateTimeParserBucket.java:92)
	at org.joda.time.format.DateTimeFormatter.parseDateTime(DateTimeFormatter.java:882)
	at org.joda.time.format.TestISODateTimeFormatParsing.assertParse(TestISODateTimeFormatParsing.java:840)
	at org.joda.time.format.TestISODateTimeFormatParsing.test_hourMinute(TestISODateTimeFormatParsing.java:767)

test_hourMinuteSecond(org.joda.time.format.TestISODateTimeFormatParsing)  Time elapsed: 0 sec  <<< ERROR!
java.lang.ArrayIndexOutOfBoundsException: -1
	at org.joda.time.format.DateTimeParserBucket.computeMillis(DateTimeParserBucket.java:109)
	at org.joda.time.format.DateTimeParserBucket.computeMillis(DateTimeParserBucket.java:92)
	at org.joda.time.format.DateTimeFormatter.parseDateTime(DateTimeFormatter.java:882)
	at org.joda.time.format.TestISODateTimeFormatParsing.assertParse(TestISODateTimeFormatParsing.java:840)
	at org.joda.time.format.TestISODateTimeFormatParsing.test_hourMinuteSecond(TestISODateTimeFormatParsing.java:782)

test_hourMinuteSecondMillis(org.joda.time.format.TestISODateTimeFormatParsing)  Time elapsed: 0 sec  <<< ERROR!
java.lang.ArrayIndexOutOfBoundsException: -1
	at org.joda.time.format.DateTimeParserBucket.computeMillis(DateTimeParserBucket.java:109)
	at org.joda.time.format.DateTimeParserBucket.computeMillis(DateTimeParserBucket.java:92)
	at org.joda.time.format.DateTimeFormatter.parseDateTime(DateTimeFormatter.java:882)
	at org.joda.time.format.TestISODateTimeFormatParsing.assertParse(TestISODateTimeFormatParsing.java:840)
	at org.joda.time.format.TestISODateTimeFormatParsing.test_hourMinuteSecondMillis(TestISODateTimeFormatParsing.java:797)

test_hourMinuteSecondFraction(org.joda.time.format.TestISODateTimeFormatParsing)  Time elapsed: 0 sec  <<< ERROR!
java.lang.ArrayIndexOutOfBoundsException: -1
	at org.joda.time.format.DateTimeParserBucket.computeMillis(DateTimeParserBucket.java:109)
	at org.joda.time.format.DateTimeParserBucket.computeMillis(DateTimeParserBucket.java:92)
	at org.joda.time.format.DateTimeFormatter.parseDateTime(DateTimeFormatter.java:882)
	at org.joda.time.format.TestISODateTimeFormatParsing.assertParse(TestISODateTimeFormatParsing.java:840)
	at org.joda.time.format.TestISODateTimeFormatParsing.test_hourMinuteSecondFraction(TestISODateTimeFormatParsing.java:812)

test_dateParser(org.joda.time.format.TestISODateTimeFormatParsing)  Time elapsed: 0 sec  <<< ERROR!
java.lang.ArrayIndexOutOfBoundsException: -1
	at org.joda.time.format.DateTimeParserBucket.computeMillis(DateTimeParserBucket.java:109)
	at org.joda.time.format.DateTimeParserBucket.doParseMillis(DateTimeParserBucket.java:55)
	at org.joda.time.format.DateTimeFormatter.parseMillis(DateTimeFormatter.java:780)
	at org.joda.time.format.TestISODateTimeFormatParsing.assertParse(TestISODateTimeFormatParsing.java:828)
	at org.joda.time.format.TestISODateTimeFormatParsing.test_dateParser(TestISODateTimeFormatParsing.java:71)

test_localDateParser(org.joda.time.format.TestISODateTimeFormatParsing)  Time elapsed: 0 sec  <<< ERROR!
java.lang.ArrayIndexOutOfBoundsException: -1
	at org.joda.time.format.DateTimeParserBucket.computeMillis(DateTimeParserBucket.java:109)
	at org.joda.time.format.DateTimeParserBucket.doParseMillis(DateTimeParserBucket.java:55)
	at org.joda.time.format.DateTimeFormatter.parseMillis(DateTimeFormatter.java:780)
	at org.joda.time.format.TestISODateTimeFormatParsing.assertParse(TestISODateTimeFormatParsing.java:828)
	at org.joda.time.format.TestISODateTimeFormatParsing.test_localDateParser(TestISODateTimeFormatParsing.java:102)

test_dateElementParser(org.joda.time.format.TestISODateTimeFormatParsing)  Time elapsed: 0.001 sec  <<< ERROR!
java.lang.ArrayIndexOutOfBoundsException: -1
	at org.joda.time.format.DateTimeParserBucket.computeMillis(DateTimeParserBucket.java:109)
	at org.joda.time.format.DateTimeParserBucket.computeMillis(DateTimeParserBucket.java:92)
	at org.joda.time.format.DateTimeFormatter.parseDateTime(DateTimeFormatter.java:882)
	at org.joda.time.format.TestISODateTimeFormatParsing.assertParse(TestISODateTimeFormatParsing.java:840)
	at org.joda.time.format.TestISODateTimeFormatParsing.test_dateElementParser(TestISODateTimeFormatParsing.java:132)

test_timeParser(org.joda.time.format.TestISODateTimeFormatParsing)  Time elapsed: 0 sec  <<< ERROR!
java.lang.ArrayIndexOutOfBoundsException: -1
	at org.joda.time.format.DateTimeParserBucket.computeMillis(DateTimeParserBucket.java:109)
	at org.joda.time.format.DateTimeParserBucket.computeMillis(DateTimeParserBucket.java:92)
	at org.joda.time.format.DateTimeFormatter.parseDateTime(DateTimeFormatter.java:882)
	at org.joda.time.format.TestISODateTimeFormatParsing.assertParse(TestISODateTimeFormatParsing.java:840)
	at org.joda.time.format.TestISODateTimeFormatParsing.test_timeParser(TestISODateTimeFormatParsing.java:180)

test_localTimeParser(org.joda.time.format.TestISODateTimeFormatParsing)  Time elapsed: 0 sec  <<< ERROR!
java.lang.ArrayIndexOutOfBoundsException: -1
	at org.joda.time.format.DateTimeParserBucket.computeMillis(DateTimeParserBucket.java:109)
	at org.joda.time.format.DateTimeParserBucket.doParseMillis(DateTimeParserBucket.java:55)
	at org.joda.time.format.DateTimeFormatter.parseMillis(DateTimeFormatter.java:780)
	at org.joda.time.format.TestISODateTimeFormatParsing.assertParse(TestISODateTimeFormatParsing.java:828)
	at org.joda.time.format.TestISODateTimeFormatParsing.test_localTimeParser(TestISODateTimeFormatParsing.java:214)

test_timeElementParser(org.joda.time.format.TestISODateTimeFormatParsing)  Time elapsed: 0 sec  <<< ERROR!
java.lang.ArrayIndexOutOfBoundsException: -1
	at org.joda.time.format.DateTimeParserBucket.computeMillis(DateTimeParserBucket.java:109)
	at org.joda.time.format.DateTimeParserBucket.doParseMillis(DateTimeParserBucket.java:55)
	at org.joda.time.format.DateTimeFormatter.parseMillis(DateTimeFormatter.java:780)
	at org.joda.time.format.TestISODateTimeFormatParsing.assertParse(TestISODateTimeFormatParsing.java:828)
	at org.joda.time.format.TestISODateTimeFormatParsing.test_timeElementParser(TestISODateTimeFormatParsing.java:252)

test_dateTimeParser(org.joda.time.format.TestISODateTimeFormatParsing)  Time elapsed: 0.001 sec  <<< ERROR!
java.lang.ArrayIndexOutOfBoundsException: -1
	at org.joda.time.format.DateTimeParserBucket.computeMillis(DateTimeParserBucket.java:109)
	at org.joda.time.format.DateTimeParserBucket.doParseMillis(DateTimeParserBucket.java:55)
	at org.joda.time.format.DateTimeFormatter.parseMillis(DateTimeFormatter.java:780)
	at org.joda.time.format.TestISODateTimeFormatParsing.assertParse(TestISODateTimeFormatParsing.java:828)
	at org.joda.time.format.TestISODateTimeFormatParsing.test_dateTimeParser(TestISODateTimeFormatParsing.java:267)

test_dateOptionalTimeParser(org.joda.time.format.TestISODateTimeFormatParsing)  Time elapsed: 0 sec  <<< ERROR!
java.lang.ArrayIndexOutOfBoundsException: -1
	at org.joda.time.format.DateTimeParserBucket.computeMillis(DateTimeParserBucket.java:109)
	at org.joda.time.format.DateTimeParserBucket.doParseMillis(DateTimeParserBucket.java:55)
	at org.joda.time.format.DateTimeFormatter.parseMillis(DateTimeFormatter.java:780)
	at org.joda.time.format.TestISODateTimeFormatParsing.assertParse(TestISODateTimeFormatParsing.java:828)
	at org.joda.time.format.TestISODateTimeFormatParsing.test_dateOptionalTimeParser(TestISODateTimeFormatParsing.java:297)

test_localDateOptionalTimeParser(org.joda.time.format.TestISODateTimeFormatParsing)  Time elapsed: 0.001 sec  <<< ERROR!
java.lang.ArrayIndexOutOfBoundsException: -1
	at org.joda.time.format.DateTimeParserBucket.computeMillis(DateTimeParserBucket.java:109)
	at org.joda.time.format.DateTimeParserBucket.doParseMillis(DateTimeParserBucket.java:55)
	at org.joda.time.format.DateTimeFormatter.parseMillis(DateTimeFormatter.java:780)
	at org.joda.time.format.TestISODateTimeFormatParsing.assertParse(TestISODateTimeFormatParsing.java:828)
	at org.joda.time.format.TestISODateTimeFormatParsing.test_localDateOptionalTimeParser(TestISODateTimeFormatParsing.java:328)

test_date(org.joda.time.format.TestISODateTimeFormatParsing)  Time elapsed: 0 sec  <<< ERROR!
java.lang.ArrayIndexOutOfBoundsException: -1
	at org.joda.time.format.DateTimeParserBucket.computeMillis(DateTimeParserBucket.java:109)
	at org.joda.time.format.DateTimeParserBucket.computeMillis(DateTimeParserBucket.java:92)
	at org.joda.time.format.DateTimeFormatter.parseDateTime(DateTimeFormatter.java:882)
	at org.joda.time.format.TestISODateTimeFormatParsing.assertParse(TestISODateTimeFormatParsing.java:840)
	at org.joda.time.format.TestISODateTimeFormatParsing.test_date(TestISODateTimeFormatParsing.java:360)

test_time(org.joda.time.format.TestISODateTimeFormatParsing)  Time elapsed: 0.001 sec  <<< ERROR!
java.lang.ArrayIndexOutOfBoundsException: -1
	at org.joda.time.format.DateTimeParserBucket.computeMillis(DateTimeParserBucket.java:109)
	at org.joda.time.format.DateTimeParserBucket.computeMillis(DateTimeParserBucket.java:92)
	at org.joda.time.format.DateTimeFormatter.parseDateTime(DateTimeFormatter.java:882)
	at org.joda.time.format.TestISODateTimeFormatParsing.assertParse(TestISODateTimeFormatParsing.java:840)
	at org.joda.time.format.TestISODateTimeFormatParsing.test_time(TestISODateTimeFormatParsing.java:375)

test_timeNoMillis(org.joda.time.format.TestISODateTimeFormatParsing)  Time elapsed: 0 sec  <<< ERROR!
java.lang.ArrayIndexOutOfBoundsException: -1
	at org.joda.time.format.DateTimeParserBucket.computeMillis(DateTimeParserBucket.java:109)
	at org.joda.time.format.DateTimeParserBucket.computeMillis(DateTimeParserBucket.java:92)
	at org.joda.time.format.DateTimeFormatter.parseDateTime(DateTimeFormatter.java:882)
	at org.joda.time.format.TestISODateTimeFormatParsing.assertParse(TestISODateTimeFormatParsing.java:840)
	at org.joda.time.format.TestISODateTimeFormatParsing.test_timeNoMillis(TestISODateTimeFormatParsing.java:390)

test_tTime(org.joda.time.format.TestISODateTimeFormatParsing)  Time elapsed: 0.001 sec  <<< ERROR!
java.lang.ArrayIndexOutOfBoundsException: -1
	at org.joda.time.format.DateTimeParserBucket.computeMillis(DateTimeParserBucket.java:109)
	at org.joda.time.format.DateTimeParserBucket.computeMillis(DateTimeParserBucket.java:92)
	at org.joda.time.format.DateTimeFormatter.parseDateTime(DateTimeFormatter.java:882)
	at org.joda.time.format.TestISODateTimeFormatParsing.assertParse(TestISODateTimeFormatParsing.java:840)
	at org.joda.time.format.TestISODateTimeFormatParsing.test_tTime(TestISODateTimeFormatParsing.java:402)

test_tTimeNoMillis(org.joda.time.format.TestISODateTimeFormatParsing)  Time elapsed: 0 sec  <<< ERROR!
java.lang.ArrayIndexOutOfBoundsException: -1
	at org.joda.time.format.DateTimeParserBucket.computeMillis(DateTimeParserBucket.java:109)
	at org.joda.time.format.DateTimeParserBucket.computeMillis(DateTimeParserBucket.java:92)
	at org.joda.time.format.DateTimeFormatter.parseDateTime(DateTimeFormatter.java:882)
	at org.joda.time.format.TestISODateTimeFormatParsing.assertParse(TestISODateTimeFormatParsing.java:840)
	at org.joda.time.format.TestISODateTimeFormatParsing.test_tTimeNoMillis(TestISODateTimeFormatParsing.java:417)

test_dateTime(org.joda.time.format.TestISODateTimeFormatParsing)  Time elapsed: 0.001 sec  <<< ERROR!
java.lang.ArrayIndexOutOfBoundsException: -1
	at org.joda.time.format.DateTimeParserBucket.computeMillis(DateTimeParserBucket.java:109)
	at org.joda.time.format.DateTimeParserBucket.computeMillis(DateTimeParserBucket.java:92)
	at org.joda.time.format.DateTimeFormatter.parseDateTime(DateTimeFormatter.java:882)
	at org.joda.time.format.TestISODateTimeFormatParsing.assertParse(TestISODateTimeFormatParsing.java:840)
	at org.joda.time.format.TestISODateTimeFormatParsing.test_dateTime(TestISODateTimeFormatParsing.java:429)

test_dateTimeNoMillis(org.joda.time.format.TestISODateTimeFormatParsing)  Time elapsed: 0 sec  <<< ERROR!
java.lang.ArrayIndexOutOfBoundsException: -1
	at org.joda.time.format.DateTimeParserBucket.computeMillis(DateTimeParserBucket.java:109)
	at org.joda.time.format.DateTimeParserBucket.computeMillis(DateTimeParserBucket.java:92)
	at org.joda.time.format.DateTimeFormatter.parseDateTime(DateTimeFormatter.java:882)
	at org.joda.time.format.TestISODateTimeFormatParsing.assertParse(TestISODateTimeFormatParsing.java:840)
	at org.joda.time.format.TestISODateTimeFormatParsing.test_dateTimeNoMillis(TestISODateTimeFormatParsing.java:454)

test_ordinalDate(org.joda.time.format.TestISODateTimeFormatParsing)  Time elapsed: 0.001 sec  <<< ERROR!
java.lang.ArrayIndexOutOfBoundsException: -1
	at org.joda.time.format.DateTimeParserBucket.computeMillis(DateTimeParserBucket.java:109)
	at org.joda.time.format.DateTimeParserBucket.computeMillis(DateTimeParserBucket.java:92)
	at org.joda.time.format.DateTimeFormatter.parseDateTime(DateTimeFormatter.java:882)
	at org.joda.time.format.TestISODateTimeFormatParsing.assertParse(TestISODateTimeFormatParsing.java:840)
	at org.joda.time.format.TestISODateTimeFormatParsing.test_ordinalDate(TestISODateTimeFormatParsing.java:475)

test_ordinalDateTime(org.joda.time.format.TestISODateTimeFormatParsing)  Time elapsed: 0 sec  <<< ERROR!
java.lang.ArrayIndexOutOfBoundsException: -1
	at org.joda.time.format.DateTimeParserBucket.computeMillis(DateTimeParserBucket.java:109)
	at org.joda.time.format.DateTimeParserBucket.computeMillis(DateTimeParserBucket.java:92)
	at org.joda.time.format.DateTimeFormatter.parseDateTime(DateTimeFormatter.java:882)
	at org.joda.time.format.TestISODateTimeFormatParsing.assertParse(TestISODateTimeFormatParsing.java:840)
	at org.joda.time.format.TestISODateTimeFormatParsing.test_ordinalDateTime(TestISODateTimeFormatParsing.java:486)

test_ordinalDateTimeNoMillis(org.joda.time.format.TestISODateTimeFormatParsing)  Time elapsed: 0 sec  <<< ERROR!
java.lang.ArrayIndexOutOfBoundsException: -1
	at org.joda.time.format.DateTimeParserBucket.computeMillis(DateTimeParserBucket.java:109)
	at org.joda.time.format.DateTimeParserBucket.computeMillis(DateTimeParserBucket.java:92)
	at org.joda.time.format.DateTimeFormatter.parseDateTime(DateTimeFormatter.java:882)
	at org.joda.time.format.TestISODateTimeFormatParsing.assertParse(TestISODateTimeFormatParsing.java:840)
	at org.joda.time.format.TestISODateTimeFormatParsing.test_ordinalDateTimeNoMillis(TestISODateTimeFormatParsing.java:505)

test_weekDate(org.joda.time.format.TestISODateTimeFormatParsing)  Time elapsed: 0.001 sec  <<< ERROR!
java.lang.ArrayIndexOutOfBoundsException: -1
	at org.joda.time.format.DateTimeParserBucket.computeMillis(DateTimeParserBucket.java:109)
	at org.joda.time.format.DateTimeParserBucket.computeMillis(DateTimeParserBucket.java:92)
	at org.joda.time.format.DateTimeFormatter.parseDateTime(DateTimeFormatter.java:882)
	at org.joda.time.format.TestISODateTimeFormatParsing.assertParse(TestISODateTimeFormatParsing.java:840)
	at org.joda.time.format.TestISODateTimeFormatParsing.test_weekDate(TestISODateTimeFormatParsing.java:520)

test_weekDateTime(org.joda.time.format.TestISODateTimeFormatParsing)  Time elapsed: 0 sec  <<< ERROR!
java.lang.ArrayIndexOutOfBoundsException: -1
	at org.joda.time.format.DateTimeParserBucket.computeMillis(DateTimeParserBucket.java:109)
	at org.joda.time.format.DateTimeParserBucket.computeMillis(DateTimeParserBucket.java:92)
	at org.joda.time.format.DateTimeFormatter.parseDateTime(DateTimeFormatter.java:882)
	at org.joda.time.format.TestISODateTimeFormatParsing.assertParse(TestISODateTimeFormatParsing.java:840)
	at org.joda.time.format.TestISODateTimeFormatParsing.test_weekDateTime(TestISODateTimeFormatParsing.java:533)

test_weekDateTimeNoMillis(org.joda.time.format.TestISODateTimeFormatParsing)  Time elapsed: 0.001 sec  <<< ERROR!
java.lang.ArrayIndexOutOfBoundsException: -1
	at org.joda.time.format.DateTimeParserBucket.computeMillis(DateTimeParserBucket.java:109)
	at org.joda.time.format.DateTimeParserBucket.computeMillis(DateTimeParserBucket.java:92)
	at org.joda.time.format.DateTimeFormatter.parseDateTime(DateTimeFormatter.java:882)
	at org.joda.time.format.TestISODateTimeFormatParsing.assertParse(TestISODateTimeFormatParsing.java:840)
	at org.joda.time.format.TestISODateTimeFormatParsing.test_weekDateTimeNoMillis(TestISODateTimeFormatParsing.java:553)

test_basicDate(org.joda.time.format.TestISODateTimeFormatParsing)  Time elapsed: 0 sec  <<< ERROR!
java.lang.ArrayIndexOutOfBoundsException: -1
	at org.joda.time.format.DateTimeParserBucket.computeMillis(DateTimeParserBucket.java:109)
	at org.joda.time.format.DateTimeParserBucket.computeMillis(DateTimeParserBucket.java:92)
	at org.joda.time.format.DateTimeFormatter.parseDateTime(DateTimeFormatter.java:882)
	at org.joda.time.format.TestISODateTimeFormatParsing.assertParse(TestISODateTimeFormatParsing.java:840)
	at org.joda.time.format.TestISODateTimeFormatParsing.test_basicDate(TestISODateTimeFormatParsing.java:571)

test_basicTime(org.joda.time.format.TestISODateTimeFormatParsing)  Time elapsed: 0.001 sec  <<< ERROR!
java.lang.ArrayIndexOutOfBoundsException: -1
	at org.joda.time.format.DateTimeParserBucket.computeMillis(DateTimeParserBucket.java:109)
	at org.joda.time.format.DateTimeParserBucket.computeMillis(DateTimeParserBucket.java:92)
	at org.joda.time.format.DateTimeFormatter.parseDateTime(DateTimeFormatter.java:882)
	at org.joda.time.format.TestISODateTimeFormatParsing.assertParse(TestISODateTimeFormatParsing.java:840)
	at org.joda.time.format.TestISODateTimeFormatParsing.test_basicTime(TestISODateTimeFormatParsing.java:582)

test_basicTimeNoMillis(org.joda.time.format.TestISODateTimeFormatParsing)  Time elapsed: 0 sec  <<< ERROR!
java.lang.ArrayIndexOutOfBoundsException: -1
	at org.joda.time.format.DateTimeParserBucket.computeMillis(DateTimeParserBucket.java:109)
	at org.joda.time.format.DateTimeParserBucket.computeMillis(DateTimeParserBucket.java:92)
	at org.joda.time.format.DateTimeFormatter.parseDateTime(DateTimeFormatter.java:882)
	at org.joda.time.format.TestISODateTimeFormatParsing.assertParse(TestISODateTimeFormatParsing.java:840)
	at org.joda.time.format.TestISODateTimeFormatParsing.test_basicTimeNoMillis(TestISODateTimeFormatParsing.java:597)

test_basicTTime(org.joda.time.format.TestISODateTimeFormatParsing)  Time elapsed: 0 sec  <<< ERROR!
java.lang.ArrayIndexOutOfBoundsException: -1
	at org.joda.time.format.DateTimeParserBucket.computeMillis(DateTimeParserBucket.java:109)
	at org.joda.time.format.DateTimeParserBucket.computeMillis(DateTimeParserBucket.java:92)
	at org.joda.time.format.DateTimeFormatter.parseDateTime(DateTimeFormatter.java:882)
	at org.joda.time.format.TestISODateTimeFormatParsing.assertParse(TestISODateTimeFormatParsing.java:840)
	at org.joda.time.format.TestISODateTimeFormatParsing.test_basicTTime(TestISODateTimeFormatParsing.java:609)

test_basicTTimeNoMillis(org.joda.time.format.TestISODateTimeFormatParsing)  Time elapsed: 0.001 sec  <<< ERROR!
java.lang.ArrayIndexOutOfBoundsException: -1
	at org.joda.time.format.DateTimeParserBucket.computeMillis(DateTimeParserBucket.java:109)
	at org.joda.time.format.DateTimeParserBucket.computeMillis(DateTimeParserBucket.java:92)
	at org.joda.time.format.DateTimeFormatter.parseDateTime(DateTimeFormatter.java:882)
	at org.joda.time.format.TestISODateTimeFormatParsing.assertParse(TestISODateTimeFormatParsing.java:840)
	at org.joda.time.format.TestISODateTimeFormatParsing.test_basicTTimeNoMillis(TestISODateTimeFormatParsing.java:624)

test_basicDateTime(org.joda.time.format.TestISODateTimeFormatParsing)  Time elapsed: 0 sec  <<< ERROR!
java.lang.ArrayIndexOutOfBoundsException: -1
	at org.joda.time.format.DateTimeParserBucket.computeMillis(DateTimeParserBucket.java:109)
	at org.joda.time.format.DateTimeParserBucket.computeMillis(DateTimeParserBucket.java:92)
	at org.joda.time.format.DateTimeFormatter.parseDateTime(DateTimeFormatter.java:882)
	at org.joda.time.format.TestISODateTimeFormatParsing.assertParse(TestISODateTimeFormatParsing.java:840)
	at org.joda.time.format.TestISODateTimeFormatParsing.test_basicDateTime(TestISODateTimeFormatParsing.java:636)

test_basicDateTimeNoMillis(org.joda.time.format.TestISODateTimeFormatParsing)  Time elapsed: 0 sec  <<< ERROR!
java.lang.ArrayIndexOutOfBoundsException: -1
	at org.joda.time.format.DateTimeParserBucket.computeMillis(DateTimeParserBucket.java:109)
	at org.joda.time.format.DateTimeParserBucket.computeMillis(DateTimeParserBucket.java:92)
	at org.joda.time.format.DateTimeFormatter.parseDateTime(DateTimeFormatter.java:882)
	at org.joda.time.format.TestISODateTimeFormatParsing.assertParse(TestISODateTimeFormatParsing.java:840)
	at org.joda.time.format.TestISODateTimeFormatParsing.test_basicDateTimeNoMillis(TestISODateTimeFormatParsing.java:658)

test_printParseZoneTokyo(org.joda.time.format.TestDateTimeFormatterBuilder)  Time elapsed: 0.001 sec  <<< ERROR!
java.lang.ArrayIndexOutOfBoundsException: -1
	at org.joda.time.format.DateTimeParserBucket.computeMillis(DateTimeParserBucket.java:109)
	at org.joda.time.format.DateTimeParserBucket.computeMillis(DateTimeParserBucket.java:92)
	at org.joda.time.format.DateTimeFormatter.parseDateTime(DateTimeFormatter.java:882)
	at org.joda.time.format.TestDateTimeFormatterBuilder.test_printParseZoneTokyo(TestDateTimeFormatterBuilder.java:414)

test_printParseZoneParis(org.joda.time.format.TestDateTimeFormatterBuilder)  Time elapsed: 0.001 sec  <<< ERROR!
java.lang.ArrayIndexOutOfBoundsException: -1
	at org.joda.time.format.DateTimeParserBucket.computeMillis(DateTimeParserBucket.java:109)
	at org.joda.time.format.DateTimeParserBucket.computeMillis(DateTimeParserBucket.java:92)
	at org.joda.time.format.DateTimeFormatter.parseDateTime(DateTimeFormatter.java:882)
	at org.joda.time.format.TestDateTimeFormatterBuilder.test_printParseZoneParis(TestDateTimeFormatterBuilder.java:424)

test_printParseZoneDawsonCreek(org.joda.time.format.TestDateTimeFormatterBuilder)  Time elapsed: 0.001 sec  <<< ERROR!
java.lang.ArrayIndexOutOfBoundsException: -1
	at org.joda.time.format.DateTimeParserBucket.computeMillis(DateTimeParserBucket.java:109)
	at org.joda.time.format.DateTimeParserBucket.computeMillis(DateTimeParserBucket.java:92)
	at org.joda.time.format.DateTimeFormatter.parseDateTime(DateTimeFormatter.java:882)
	at org.joda.time.format.TestDateTimeFormatterBuilder.test_printParseZoneDawsonCreek(TestDateTimeFormatterBuilder.java:435)

test_printParseZoneBahiaBanderas(org.joda.time.format.TestDateTimeFormatterBuilder)  Time elapsed: 0.006 sec  <<< ERROR!
java.lang.ArrayIndexOutOfBoundsException: -1
	at org.joda.time.format.DateTimeParserBucket.computeMillis(DateTimeParserBucket.java:109)
	at org.joda.time.format.DateTimeParserBucket.computeMillis(DateTimeParserBucket.java:92)
	at org.joda.time.format.DateTimeFormatter.parseDateTime(DateTimeFormatter.java:882)
	at org.joda.time.format.TestDateTimeFormatterBuilder.test_printParseZoneBahiaBanderas(TestDateTimeFormatterBuilder.java:445)

test_printParseOffset(org.joda.time.format.TestDateTimeFormatterBuilder)  Time elapsed: 0 sec  <<< ERROR!
java.lang.ArrayIndexOutOfBoundsException: -1
	at org.joda.time.format.DateTimeParserBucket.computeMillis(DateTimeParserBucket.java:109)
	at org.joda.time.format.DateTimeParserBucket.computeMillis(DateTimeParserBucket.java:92)
	at org.joda.time.format.DateTimeFormatter.parseDateTime(DateTimeFormatter.java:882)
	at org.joda.time.format.TestDateTimeFormatterBuilder.test_printParseOffset(TestDateTimeFormatterBuilder.java:455)

test_printParseOffsetAndZone(org.joda.time.format.TestDateTimeFormatterBuilder)  Time elapsed: 0 sec  <<< ERROR!
java.lang.ArrayIndexOutOfBoundsException: -1
	at org.joda.time.format.DateTimeParserBucket.computeMillis(DateTimeParserBucket.java:109)
	at org.joda.time.format.DateTimeParserBucket.computeMillis(DateTimeParserBucket.java:92)
	at org.joda.time.format.DateTimeFormatter.parseDateTime(DateTimeFormatter.java:882)
	at org.joda.time.format.TestDateTimeFormatterBuilder.test_printParseOffsetAndZone(TestDateTimeFormatterBuilder.java:467)

test_parseWrongOffset(org.joda.time.format.TestDateTimeFormatterBuilder)  Time elapsed: 0 sec  <<< ERROR!
java.lang.ArrayIndexOutOfBoundsException: -1
	at org.joda.time.format.DateTimeParserBucket.computeMillis(DateTimeParserBucket.java:109)
	at org.joda.time.format.DateTimeParserBucket.computeMillis(DateTimeParserBucket.java:92)
	at org.joda.time.format.DateTimeFormatter.parseDateTime(DateTimeFormatter.java:882)
	at org.joda.time.format.TestDateTimeFormatterBuilder.test_parseWrongOffset(TestDateTimeFormatterBuilder.java:479)

test_parseWrongOffsetAndZone(org.joda.time.format.TestDateTimeFormatterBuilder)  Time elapsed: 0.004 sec  <<< ERROR!
java.lang.ArrayIndexOutOfBoundsException: -1
	at org.joda.time.format.DateTimeParserBucket.computeMillis(DateTimeParserBucket.java:109)
	at org.joda.time.format.DateTimeParserBucket.computeMillis(DateTimeParserBucket.java:92)
	at org.joda.time.format.DateTimeFormatter.parseDateTime(DateTimeFormatter.java:882)
	at org.joda.time.format.TestDateTimeFormatterBuilder.test_parseWrongOffsetAndZone(TestDateTimeFormatterBuilder.java:493)

test_localPrintParseZoneTokyo(org.joda.time.format.TestDateTimeFormatterBuilder)  Time elapsed: 0.002 sec  <<< ERROR!
java.lang.ArrayIndexOutOfBoundsException: -1
	at org.joda.time.format.DateTimeParserBucket.computeMillis(DateTimeParserBucket.java:109)
	at org.joda.time.format.DateTimeParserBucket.computeMillis(DateTimeParserBucket.java:92)
	at org.joda.time.format.DateTimeFormatter.parseLocalDateTime(DateTimeFormatter.java:841)
	at org.joda.time.format.TestDateTimeFormatterBuilder.test_localPrintParseZoneTokyo(TestDateTimeFormatterBuilder.java:510)

test_localPrintParseOffset(org.joda.time.format.TestDateTimeFormatterBuilder)  Time elapsed: 0 sec  <<< ERROR!
java.lang.ArrayIndexOutOfBoundsException: -1
	at org.joda.time.format.DateTimeParserBucket.computeMillis(DateTimeParserBucket.java:109)
	at org.joda.time.format.DateTimeParserBucket.computeMillis(DateTimeParserBucket.java:92)
	at org.joda.time.format.DateTimeFormatter.parseLocalDateTime(DateTimeFormatter.java:841)
	at org.joda.time.format.TestDateTimeFormatterBuilder.test_localPrintParseOffset(TestDateTimeFormatterBuilder.java:522)

test_localPrintParseOffsetAndZone(org.joda.time.format.TestDateTimeFormatterBuilder)  Time elapsed: 0.004 sec  <<< ERROR!
java.lang.ArrayIndexOutOfBoundsException: -1
	at org.joda.time.format.DateTimeParserBucket.computeMillis(DateTimeParserBucket.java:109)
	at org.joda.time.format.DateTimeParserBucket.computeMillis(DateTimeParserBucket.java:92)
	at org.joda.time.format.DateTimeFormatter.parseLocalDateTime(DateTimeFormatter.java:841)
	at org.joda.time.format.TestDateTimeFormatterBuilder.test_localPrintParseOffsetAndZone(TestDateTimeFormatterBuilder.java:536)

test_localParseWrongOffsetAndZone(org.joda.time.format.TestDateTimeFormatterBuilder)  Time elapsed: 0.004 sec  <<< ERROR!
java.lang.ArrayIndexOutOfBoundsException: -1
	at org.joda.time.format.DateTimeParserBucket.computeMillis(DateTimeParserBucket.java:109)
	at org.joda.time.format.DateTimeParserBucket.computeMillis(DateTimeParserBucket.java:92)
	at org.joda.time.format.DateTimeFormatter.parseLocalDateTime(DateTimeFormatter.java:841)
	at org.joda.time.format.TestDateTimeFormatterBuilder.test_localParseWrongOffsetAndZone(TestDateTimeFormatterBuilder.java:547)

test_printParseShortNameWithLookup(org.joda.time.format.TestDateTimeFormatterBuilder)  Time elapsed: 0.001 sec  <<< ERROR!
java.lang.ArrayIndexOutOfBoundsException: -1
	at org.joda.time.format.DateTimeParserBucket.computeMillis(DateTimeParserBucket.java:109)
	at org.joda.time.format.DateTimeParserBucket.computeMillis(DateTimeParserBucket.java:92)
	at org.joda.time.format.DateTimeFormatter.parseDateTime(DateTimeFormatter.java:882)
	at org.joda.time.format.TestDateTimeFormatterBuilder.test_printParseShortNameWithLookup(TestDateTimeFormatterBuilder.java:588)

test_printParseShortNameWithAutoLookup(org.joda.time.format.TestDateTimeFormatterBuilder)  Time elapsed: 0 sec  <<< ERROR!
java.lang.ArrayIndexOutOfBoundsException: -1
	at org.joda.time.format.DateTimeParserBucket.computeMillis(DateTimeParserBucket.java:109)
	at org.joda.time.format.DateTimeParserBucket.computeMillis(DateTimeParserBucket.java:92)
	at org.joda.time.format.DateTimeFormatter.parseDateTime(DateTimeFormatter.java:882)
	at org.joda.time.format.TestDateTimeFormatterBuilder.test_printParseShortNameWithAutoLookup(TestDateTimeFormatterBuilder.java:615)

test_printParseLongNameWithLookup(org.joda.time.format.TestDateTimeFormatterBuilder)  Time elapsed: 0 sec  <<< ERROR!
java.lang.ArrayIndexOutOfBoundsException: -1
	at org.joda.time.format.DateTimeParserBucket.computeMillis(DateTimeParserBucket.java:109)
	at org.joda.time.format.DateTimeParserBucket.computeMillis(DateTimeParserBucket.java:92)
	at org.joda.time.format.DateTimeFormatter.parseDateTime(DateTimeFormatter.java:882)
	at org.joda.time.format.TestDateTimeFormatterBuilder.test_printParseLongNameWithLookup(TestDateTimeFormatterBuilder.java:662)

test_appendFixedDecimal(org.joda.time.format.TestDateTimeFormatterBuilder)  Time elapsed: 0 sec  <<< ERROR!
java.lang.ArrayIndexOutOfBoundsException: -1
	at org.joda.time.format.DateTimeParserBucket.computeMillis(DateTimeParserBucket.java:109)
	at org.joda.time.format.DateTimeParserBucket.doParseMillis(DateTimeParserBucket.java:55)
	at org.joda.time.format.DateTimeFormatter.parseMillis(DateTimeFormatter.java:780)
	at org.joda.time.convert.StringConverter.getInstantMillis(StringConverter.java:65)
	at org.joda.time.base.BaseDateTime.<init>(BaseDateTime.java:175)
	at org.joda.time.DateTime.<init>(DateTime.java:257)
	at org.joda.time.format.TestDateTimeFormatterBuilder.test_appendFixedDecimal(TestDateTimeFormatterBuilder.java:246)

test_appendFixedSignedDecimal(org.joda.time.format.TestDateTimeFormatterBuilder)  Time elapsed: 0 sec  <<< ERROR!
java.lang.ArrayIndexOutOfBoundsException: -1
	at org.joda.time.format.DateTimeParserBucket.computeMillis(DateTimeParserBucket.java:109)
	at org.joda.time.format.DateTimeParserBucket.doParseMillis(DateTimeParserBucket.java:55)
	at org.joda.time.format.DateTimeFormatter.parseMillis(DateTimeFormatter.java:780)
	at org.joda.time.convert.StringConverter.getInstantMillis(StringConverter.java:65)
	at org.joda.time.base.BaseDateTime.<init>(BaseDateTime.java:175)
	at org.joda.time.DateTime.<init>(DateTime.java:257)
	at org.joda.time.format.TestDateTimeFormatterBuilder.test_appendFixedSignedDecimal(TestDateTimeFormatterBuilder.java:303)

testSerialization(org.joda.time.tz.TestBuilder)  Time elapsed: 0.01 sec  <<< ERROR!
java.lang.ArrayIndexOutOfBoundsException: -1
	at org.joda.time.format.DateTimeParserBucket.computeMillis(DateTimeParserBucket.java:109)
	at org.joda.time.format.DateTimeParserBucket.doParseMillis(DateTimeParserBucket.java:55)
	at org.joda.time.format.DateTimeFormatter.parseMillis(DateTimeFormatter.java:780)
	at org.joda.time.convert.StringConverter.getInstantMillis(StringConverter.java:65)
	at org.joda.time.base.BaseDateTime.<init>(BaseDateTime.java:175)
	at org.joda.time.DateTime.<init>(DateTime.java:257)
	at org.joda.time.tz.TestBuilder.testForwardTransitions(TestBuilder.java:241)
	at org.joda.time.tz.TestBuilder.testSerialization(TestBuilder.java:282)

testForwardTransitions(org.joda.time.tz.TestBuilder)  Time elapsed: 0.007 sec  <<< ERROR!
java.lang.ArrayIndexOutOfBoundsException: -1
	at org.joda.time.format.DateTimeParserBucket.computeMillis(DateTimeParserBucket.java:109)
	at org.joda.time.format.DateTimeParserBucket.doParseMillis(DateTimeParserBucket.java:55)
	at org.joda.time.format.DateTimeFormatter.parseMillis(DateTimeFormatter.java:780)
	at org.joda.time.convert.StringConverter.getInstantMillis(StringConverter.java:65)
	at org.joda.time.base.BaseDateTime.<init>(BaseDateTime.java:175)
	at org.joda.time.DateTime.<init>(DateTime.java:257)
	at org.joda.time.tz.TestBuilder.testForwardTransitions(TestBuilder.java:241)
	at org.joda.time.tz.TestBuilder.testForwardTransitions(TestBuilder.java:217)

testReverseTransitions(org.joda.time.tz.TestBuilder)  Time elapsed: 0.008 sec  <<< ERROR!
java.lang.ArrayIndexOutOfBoundsException: -1
	at org.joda.time.format.DateTimeParserBucket.computeMillis(DateTimeParserBucket.java:109)
	at org.joda.time.format.DateTimeParserBucket.doParseMillis(DateTimeParserBucket.java:55)
	at org.joda.time.format.DateTimeFormatter.parseMillis(DateTimeFormatter.java:780)
	at org.joda.time.convert.StringConverter.getInstantMillis(StringConverter.java:65)
	at org.joda.time.base.BaseDateTime.<init>(BaseDateTime.java:175)
	at org.joda.time.DateTime.<init>(DateTime.java:257)
	at org.joda.time.tz.TestBuilder.testReverseTransitions(TestBuilder.java:259)
	at org.joda.time.tz.TestBuilder.testReverseTransitions(TestBuilder.java:255)

testCompile(org.joda.time.tz.TestCompiler)  Time elapsed: 0.026 sec  <<< ERROR!
java.lang.ArrayIndexOutOfBoundsException: -1
	at org.joda.time.format.DateTimeParserBucket.computeMillis(DateTimeParserBucket.java:109)
	at org.joda.time.format.DateTimeParserBucket.doParseMillis(DateTimeParserBucket.java:55)
	at org.joda.time.format.DateTimeFormatter.parseMillis(DateTimeFormatter.java:780)
	at org.joda.time.convert.StringConverter.getInstantMillis(StringConverter.java:65)
	at org.joda.time.base.BaseDateTime.<init>(BaseDateTime.java:175)
	at org.joda.time.DateTime.<init>(DateTime.java:257)
	at org.joda.time.tz.TestBuilder.testForwardTransitions(TestBuilder.java:241)
	at org.joda.time.tz.TestCompiler.testCompile(TestCompiler.java:117)


Results :

Tests in error: 
  org.joda.time.TestDateMidnight_Constructors#testParse_formatter ArrayIndexOutOfBoundsException
  org.joda.time.TestDateMidnight_Constructors#testParse_noFormatter ArrayIndexOutOfBoundsException
  org.joda.time.TestDateTimeComparator#testDOM ArrayIndexOutOfBoundsException -1
  org.joda.time.TestDateTimeComparator#testDOW ArrayIndexOutOfBoundsException -1
  org.joda.time.TestDateTimeComparator#testDOY ArrayIndexOutOfBoundsException -1
  org.joda.time.TestDateTimeComparator#testHour ArrayIndexOutOfBoundsException -...
  org.joda.time.TestDateTimeComparator#testInvalidObj ArrayIndexOutOfBoundsException
  org.joda.time.TestDateTimeComparator#testListBasic ArrayIndexOutOfBoundsException
  org.joda.time.TestDateTimeComparator#testListDOM ArrayIndexOutOfBoundsException
  org.joda.time.TestDateTimeComparator#testListDOW ArrayIndexOutOfBoundsException
  org.joda.time.TestDateTimeComparator#testListDOY ArrayIndexOutOfBoundsException
  org.joda.time.TestDateTimeComparator#testListDate ArrayIndexOutOfBoundsException
  org.joda.time.TestDateTimeComparator#testListHour ArrayIndexOutOfBoundsException
  org.joda.time.TestDateTimeComparator#testListMinute ArrayIndexOutOfBoundsException
  org.joda.time.TestDateTimeComparator#testListMonth ArrayIndexOutOfBoundsException
  org.joda.time.TestDateTimeComparator#testListSecond ArrayIndexOutOfBoundsException
  org.joda.time.TestDateTimeComparator#testListTime ArrayIndexOutOfBoundsException
  org.joda.time.TestDateTimeComparator#testListWOW ArrayIndexOutOfBoundsException
  org.joda.time.TestDateTimeComparator#testListYOYY ArrayIndexOutOfBoundsException
  org.joda.time.TestDateTimeComparator#testListYear ArrayIndexOutOfBoundsException
  org.joda.time.TestDateTimeComparator#testMinute ArrayIndexOutOfBoundsException
  org.joda.time.TestDateTimeComparator#testMonth ArrayIndexOutOfBoundsException ...
  org.joda.time.TestDateTimeComparator#testNullDT ArrayIndexOutOfBoundsException
  org.joda.time.TestDateTimeComparator#testSecond ArrayIndexOutOfBoundsException
  org.joda.time.TestDateTimeComparator#testWOW ArrayIndexOutOfBoundsException -1
  org.joda.time.TestDateTimeComparator#testWOYY ArrayIndexOutOfBoundsException -...
  org.joda.time.TestDateTimeComparator#testYear ArrayIndexOutOfBoundsException -...
  org.joda.time.TestDateTimeZoneCutover#testPeriod ArrayIndexOutOfBoundsException
  org.joda.time.TestDateTimeZoneCutover#testPlusMillisInDstChange ArrayIndexOutOfBoundsException
  org.joda.time.TestDateTimeZoneCutover#testPlusMinutesInDstChange ArrayIndexOutOfBoundsException
  org.joda.time.TestDateTimeZoneCutover#testPlusSecondsInDstChange ArrayIndexOutOfBoundsException
  org.joda.time.TestDateTimeZoneCutover#testWithHourOfDayInDstChange ArrayIndexOutOfBoundsException
  org.joda.time.TestDateTimeZoneCutover#testWithMillisOfSecondInDstChange_NewYork_summer ArrayIndexOutOfBoundsException
  org.joda.time.TestDateTimeZoneCutover#testWithMillisOfSecondInDstChange_NewYork_winter ArrayIndexOutOfBoundsException
  org.joda.time.TestDateTimeZoneCutover#testWithMillisOfSecondInDstChange_Paris_summer ArrayIndexOutOfBoundsException
  org.joda.time.TestDateTimeZoneCutover#testWithMillisOfSecondInDstChange_Paris_winter ArrayIndexOutOfBoundsException
  org.joda.time.TestDateTimeZoneCutover#testWithMinuteOfHourInDstChange ArrayIndexOutOfBoundsException
  org.joda.time.TestDateTimeZoneCutover#testWithSecondOfMinuteInDstChange ArrayIndexOutOfBoundsException
  org.joda.time.TestDateTimeZoneCutover#test_DateTime_parse_Gaza ArrayIndexOutOfBoundsException
  org.joda.time.TestDateTimeZoneCutover#test_DateTime_parse_Turk ArrayIndexOutOfBoundsException
  org.joda.time.TestDateTime_Constructors#testConstructor_ObjectString1 ArrayIndexOutOfBoundsException
  org.joda.time.TestDateTime_Constructors#testConstructor_ObjectString2 ArrayIndexOutOfBoundsException
  org.joda.time.TestDateTime_Constructors#testConstructor_ObjectString3 ArrayIndexOutOfBoundsException
  org.joda.time.TestDateTime_Constructors#testConstructor_ObjectString4 ArrayIndexOutOfBoundsException
  org.joda.time.TestDateTime_Constructors#testConstructor_ObjectString5 ArrayIndexOutOfBoundsException
  org.joda.time.TestDateTime_Constructors#testConstructor_ObjectString6 ArrayIndexOutOfBoundsException
  org.joda.time.TestDateTime_Constructors#testConstructor_ObjectString7 ArrayIndexOutOfBoundsException
  org.joda.time.TestDateTime_Constructors#testParse_formatter ArrayIndexOutOfBoundsException
  org.joda.time.TestDateTime_Constructors#testParse_noFormatter ArrayIndexOutOfBoundsException
  org.joda.time.TestDateTime_Constructors#testParse_noFormatter_vs_constructor_correctOffset ArrayIndexOutOfBoundsException
  org.joda.time.TestDateTime_Constructors#testParse_noFormatter_vs_constructor_noOffset ArrayIndexOutOfBoundsException
  org.joda.time.TestIllegalFieldValueException#testGJCutover ArrayIndexOutOfBoundsException
  org.joda.time.TestInstant_Constructors#testParse_formatter ArrayIndexOutOfBoundsException
  org.joda.time.TestInstant_Constructors#testParse_noFormatter ArrayIndexOutOfBoundsException
  org.joda.time.TestInterval_Basics#testToString_reparse ArrayIndexOutOfBoundsException
  org.joda.time.TestInterval_Constructors#testConstructor_Object1 ArrayIndexOutOfBoundsException
  org.joda.time.TestInterval_Constructors#testParse_noFormatter ArrayIndexOutOfBoundsException
  org.joda.time.TestLocalDateTime_Constructors#testConstructor_ObjectString1 ArrayIndexOutOfBoundsException
  org.joda.time.TestLocalDateTime_Constructors#testConstructor_ObjectString2 ArrayIndexOutOfBoundsException
  org.joda.time.TestLocalDateTime_Constructors#testConstructor_ObjectString3 ArrayIndexOutOfBoundsException
  org.joda.time.TestLocalDateTime_Constructors#testConstructor_ObjectString4 ArrayIndexOutOfBoundsException
  org.joda.time.TestLocalDateTime_Constructors#testConstructor_Object_ChronologyMoscow ArrayIndexOutOfBoundsException
  org.joda.time.TestLocalDateTime_Constructors#testConstructor_Object_ChronologyMoscowBadDateTime ArrayIndexOutOfBoundsException
  org.joda.time.TestLocalDateTime_Constructors#testConstructor_Object_DateTimeZoneMoscow ArrayIndexOutOfBoundsException
  org.joda.time.TestLocalDateTime_Constructors#testConstructor_Object_DateTimeZoneMoscowBadDateTime ArrayIndexOutOfBoundsException
  org.joda.time.TestLocalDateTime_Constructors#testParse_formatter ArrayIndexOutOfBoundsException
  org.joda.time.TestLocalDateTime_Constructors#testParse_noFormatter ArrayIndexOutOfBoundsException
  org.joda.time.TestLocalDate_Constructors#testConstructor_ObjectString1 ArrayIndexOutOfBoundsException
  org.joda.time.TestLocalDate_Constructors#testConstructor_ObjectString2 ArrayIndexOutOfBoundsException
  org.joda.time.TestLocalDate_Constructors#testConstructor_ObjectString3 ArrayIndexOutOfBoundsException
  org.joda.time.TestLocalDate_Constructors#testParse_formatter ArrayIndexOutOfBoundsException
  org.joda.time.TestLocalDate_Constructors#testParse_noFormatter ArrayIndexOutOfBoundsException
  org.joda.time.TestLocalTime_Constructors#testConstructor_Object2_Chronology ArrayIndexOutOfBoundsException
  org.joda.time.TestLocalTime_Constructors#testConstructor_ObjectString1 ArrayIndexOutOfBoundsException
  org.joda.time.TestLocalTime_Constructors#testConstructor_ObjectString1NewYork ArrayIndexOutOfBoundsException
  org.joda.time.TestLocalTime_Constructors#testConstructor_ObjectString1Tokyo ArrayIndexOutOfBoundsException
  org.joda.time.TestLocalTime_Constructors#testConstructor_ObjectString2 ArrayIndexOutOfBoundsException
  org.joda.time.TestLocalTime_Constructors#testConstructor_ObjectString3 ArrayIndexOutOfBoundsException
  org.joda.time.TestLocalTime_Constructors#testConstructor_ObjectString4 ArrayIndexOutOfBoundsException
  org.joda.time.TestLocalTime_Constructors#testConstructor_ObjectString_DateTimeZoneLondon ArrayIndexOutOfBoundsException
  org.joda.time.TestLocalTime_Constructors#testConstructor_ObjectString_DateTimeZoneNewYork ArrayIndexOutOfBoundsException
  org.joda.time.TestLocalTime_Constructors#testConstructor_ObjectString_DateTimeZoneTokyo ArrayIndexOutOfBoundsException
  org.joda.time.TestLocalTime_Constructors#testParse_formatter ArrayIndexOutOfBoundsException
  org.joda.time.TestLocalTime_Constructors#testParse_noFormatter ArrayIndexOutOfBoundsException
  org.joda.time.TestMonthDay_Constructors#testConstructor_ObjectString1 ArrayIndexOutOfBoundsException
  org.joda.time.TestMonthDay_Constructors#testConstructor_ObjectString5 ArrayIndexOutOfBoundsException
  org.joda.time.TestMonthDay_Constructors#testParse_formatter ArrayIndexOutOfBoundsException
  org.joda.time.TestMonthDay_Constructors#testParse_noFormatter ArrayIndexOutOfBoundsException
  org.joda.time.TestMutableDateTime_Constructors#testParse_formatter ArrayIndexOutOfBoundsException
  org.joda.time.TestMutableDateTime_Constructors#testParse_noFormatter ArrayIndexOutOfBoundsException
  org.joda.time.TestMutableInterval_Constructors#testConstructor_Object1 ArrayIndexOutOfBoundsException
  org.joda.time.TestMutableInterval_Constructors#testParse_noFormatter ArrayIndexOutOfBoundsException
  org.joda.time.TestStringConvert#testDateMidnight ArrayIndexOutOfBoundsException
  org.joda.time.TestStringConvert#testDateTime ArrayIndexOutOfBoundsException -1
  org.joda.time.TestStringConvert#testLocalDate ArrayIndexOutOfBoundsException -...
  org.joda.time.TestStringConvert#testLocalDateTime ArrayIndexOutOfBoundsException
  org.joda.time.TestStringConvert#testLocalTime ArrayIndexOutOfBoundsException -...
  org.joda.time.TestStringConvert#testMonthDay ArrayIndexOutOfBoundsException -1
  org.joda.time.TestStringConvert#testMonthDay_leapDay ArrayIndexOutOfBoundsException
  org.joda.time.TestStringConvert#testMutableDateTime ArrayIndexOutOfBoundsException
  org.joda.time.TestStringConvert#testYearMonth ArrayIndexOutOfBoundsException -...
  org.joda.time.TestTimeOfDay_Constructors#testConstructor2_Object_Chronology ArrayIndexOutOfBoundsException
  org.joda.time.TestTimeOfDay_Constructors#testConstructor_ObjectString1 ArrayIndexOutOfBoundsException
  org.joda.time.TestTimeOfDay_Constructors#testConstructor_ObjectString2 ArrayIndexOutOfBoundsException
  org.joda.time.TestTimeOfDay_Constructors#testConstructor_ObjectString3 ArrayIndexOutOfBoundsException
  org.joda.time.TestTimeOfDay_Constructors#testConstructor_ObjectString4 ArrayIndexOutOfBoundsException
  org.joda.time.TestTimeOfDay_Constructors#testConstructor_ObjectString5 ArrayIndexOutOfBoundsException
  org.joda.time.TestTimeOfDay_Constructors#testConstructor_ObjectString6 ArrayIndexOutOfBoundsException
  org.joda.time.TestYearMonthDay_Constructors#testConstructor_ObjectString1 ArrayIndexOutOfBoundsException
  org.joda.time.TestYearMonthDay_Constructors#testConstructor_ObjectString2 ArrayIndexOutOfBoundsException
  org.joda.time.TestYearMonthDay_Constructors#testConstructor_ObjectString3 ArrayIndexOutOfBoundsException
  org.joda.time.TestYearMonthDay_Constructors#testConstructor_ObjectString4 ArrayIndexOutOfBoundsException
  org.joda.time.TestYearMonthDay_Constructors#testConstructor_ObjectString5 ArrayIndexOutOfBoundsException
  org.joda.time.TestYearMonth_Constructors#testConstructor_ObjectString1 ArrayIndexOutOfBoundsException
  org.joda.time.TestYearMonth_Constructors#testConstructor_ObjectString5 ArrayIndexOutOfBoundsException
  org.joda.time.TestYearMonth_Constructors#testParse_formatter ArrayIndexOutOfBoundsException
  org.joda.time.TestYearMonth_Constructors#testParse_noFormatter ArrayIndexOutOfBoundsException
  org.joda.time.chrono.TestGJChronology#testCutoverAddDays ArrayIndexOutOfBoundsException
  org.joda.time.chrono.TestGJChronology#testCutoverAddMonths ArrayIndexOutOfBoundsException
  org.joda.time.chrono.TestGJChronology#testCutoverAddWeeks ArrayIndexOutOfBoundsException
  org.joda.time.chrono.TestGJChronology#testCutoverAddWeekyears ArrayIndexOutOfBoundsException
  org.joda.time.chrono.TestGJChronology#testCutoverAddYears ArrayIndexOutOfBoundsException
  org.joda.time.chrono.TestGJChronology#testParseEquivalence ArrayIndexOutOfBoundsException
  org.joda.time.chrono.TestGJChronology#testPartialGetAsText ArrayIndexOutOfBoundsException
  org.joda.time.chrono.TestGJChronology#testYearEndAddDays ArrayIndexOutOfBoundsException
  org.joda.time.chrono.TestISOChronology#testAddMonths ArrayIndexOutOfBoundsException
  org.joda.time.chrono.TestISOChronology#testCutoverAddYears ArrayIndexOutOfBoundsException
  org.joda.time.chrono.TestISOChronology#testMaxYear ArrayIndexOutOfBoundsException
  org.joda.time.chrono.TestISOChronology#testMinYear ArrayIndexOutOfBoundsException
  org.joda.time.convert.TestStringConverter#testGetDateTime ArrayIndexOutOfBoundsException
  org.joda.time.convert.TestStringConverter#testGetDateTime1 ArrayIndexOutOfBoundsException
  org.joda.time.convert.TestStringConverter#testGetDateTime2 ArrayIndexOutOfBoundsException
  org.joda.time.convert.TestStringConverter#testGetDateTime3 ArrayIndexOutOfBoundsException
  org.joda.time.convert.TestStringConverter#testGetDateTime4 ArrayIndexOutOfBoundsException
  org.joda.time.convert.TestStringConverter#testGetDateTime5 ArrayIndexOutOfBoundsException
  org.joda.time.convert.TestStringConverter#testGetDateTime6 ArrayIndexOutOfBoundsException
  org.joda.time.convert.TestStringConverter#testGetInstantMillis_Object ArrayIndexOutOfBoundsException
  org.joda.time.convert.TestStringConverter#testGetInstantMillis_Object_Chronology ArrayIndexOutOfBoundsException
  org.joda.time.convert.TestStringConverter#testGetInstantMillis_Object_Zone ArrayIndexOutOfBoundsException
  org.joda.time.convert.TestStringConverter#testGetPartialValues ArrayIndexOutOfBoundsException
  org.joda.time.convert.TestStringConverter#testSetIntoInterval_Object_Chronology1 ArrayIndexOutOfBoundsException
  org.joda.time.convert.TestStringConverter#testSetIntoInterval_Object_Chronology2 ArrayIndexOutOfBoundsException
  org.joda.time.convert.TestStringConverter#testSetIntoInterval_Object_Chronology3 ArrayIndexOutOfBoundsException
  org.joda.time.convert.TestStringConverter#testSetIntoInterval_Object_Chronology4 ArrayIndexOutOfBoundsException
  org.joda.time.convert.TestStringConverter#testSetIntoInterval_Object_Chronology5 ArrayIndexOutOfBoundsException
  org.joda.time.convert.TestStringConverter#testSetIntoInterval_Object_Chronology6 ArrayIndexOutOfBoundsException
  org.joda.time.convert.TestStringConverter#testSetIntoInterval_Object_Chronology7 ArrayIndexOutOfBoundsException
  org.joda.time.convert.TestStringConverter#testSetIntoInterval_Object_Chronology8 ArrayIndexOutOfBoundsException
  org.joda.time.format.TestDateTimeFormat#testFormatParse_textAdjoiningHelloWorld_UK ArrayIndexOutOfBoundsException
  org.joda.time.format.TestDateTimeFormat#testFormatParse_textAdjoiningMonthDOW_UK ArrayIndexOutOfBoundsException
  org.joda.time.format.TestDateTimeFormat#testFormatParse_textEraAD_France ArrayIndexOutOfBoundsException
  org.joda.time.format.TestDateTimeFormat#testFormatParse_textEraAD_UK ArrayIndexOutOfBoundsException
  org.joda.time.format.TestDateTimeFormat#testFormatParse_textEraBC_France ArrayIndexOutOfBoundsException
  org.joda.time.format.TestDateTimeFormat#testFormatParse_textHalfdayAM_France ArrayIndexOutOfBoundsException
  org.joda.time.format.TestDateTimeFormat#testFormatParse_textHalfdayAM_UK ArrayIndexOutOfBoundsException
  org.joda.time.format.TestDateTimeFormat#testFormatParse_textMonthApr_France ArrayIndexOutOfBoundsException
  org.joda.time.format.TestDateTimeFormat#testFormatParse_textMonthApr_Korean ArrayIndexOutOfBoundsException
  org.joda.time.format.TestDateTimeFormat#testFormatParse_textMonthAtEnd_France ArrayIndexOutOfBoundsException
  org.joda.time.format.TestDateTimeFormat#testFormatParse_textMonthAtEnd_France_withSpecifiedDefault ArrayIndexOutOfBoundsException
  org.joda.time.format.TestDateTimeFormat#testFormatParse_textMonthJanLongLowerCase_UK ArrayIndexOutOfBoundsException
  org.joda.time.format.TestDateTimeFormat#testFormatParse_textMonthJanLongUpperCase_UK ArrayIndexOutOfBoundsException
  org.joda.time.format.TestDateTimeFormat#testFormatParse_textMonthJanLong_France ArrayIndexOutOfBoundsException
  org.joda.time.format.TestDateTimeFormat#testFormatParse_textMonthJanShortLowerCase_UK ArrayIndexOutOfBoundsException
  org.joda.time.format.TestDateTimeFormat#testFormatParse_textMonthJanShortUpperCase_UK ArrayIndexOutOfBoundsException
  org.joda.time.format.TestDateTimeFormat#testFormatParse_textMonthJanShort_France ArrayIndexOutOfBoundsException
  org.joda.time.format.TestDateTimeFormat#testFormatParse_textMonthJanShort_UK ArrayIndexOutOfBoundsException
  org.joda.time.format.TestDateTimeFormat#testFormatParse_zoneId_colon ArrayIndexOutOfBoundsException
  org.joda.time.format.TestDateTimeFormat#testFormatParse_zoneId_colon_parseZ ArrayIndexOutOfBoundsException
  org.joda.time.format.TestDateTimeFormat#testFormatParse_zoneId_noColon ArrayIndexOutOfBoundsException
  org.joda.time.format.TestDateTimeFormat#testFormatParse_zoneId_noColon_parseZ ArrayIndexOutOfBoundsException
  org.joda.time.format.TestDateTimeFormat#testFormat_shortBasicParse ArrayIndexOutOfBoundsException
  org.joda.time.format.TestDateTimeFormat#testFormat_weekyearOfEra_twoDigit ArrayIndexOutOfBoundsException
  org.joda.time.format.TestDateTimeFormat#testFormat_yearOfEraParse ArrayIndexOutOfBoundsException
  org.joda.time.format.TestDateTimeFormat#testFormat_yearOfEra_twoDigit ArrayIndexOutOfBoundsException
  org.joda.time.format.TestDateTimeFormat#testFormat_year_twoDigit ArrayIndexOutOfBoundsException
  org.joda.time.format.TestDateTimeFormat#testParse_pivotYear ArrayIndexOutOfBoundsException
  org.joda.time.format.TestDateTimeFormat#testParse_pivotYear_ignored4DigitYear ArrayIndexOutOfBoundsException
  org.joda.time.format.TestDateTimeFormat#testParse_textMonthJanLong_UK ArrayIndexOutOfBoundsException
  org.joda.time.format.TestDateTimeFormatStyle#testForStyle_shortDate ArrayIndexOutOfBoundsException
  org.joda.time.format.TestDateTimeFormatStyle#testForStyle_shortDateTime ArrayIndexOutOfBoundsException
  org.joda.time.format.TestDateTimeFormatStyle#testForStyle_shortTime ArrayIndexOutOfBoundsException
  org.joda.time.format.TestDateTimeFormatter#testParseDateTime_chrono ArrayIndexOutOfBoundsException
  org.joda.time.format.TestDateTimeFormatter#testParseDateTime_offsetParsed ArrayIndexOutOfBoundsException
  org.joda.time.format.TestDateTimeFormatter#testParseDateTime_simple ArrayIndexOutOfBoundsException
  org.joda.time.format.TestDateTimeFormatter#testParseDateTime_simple_precedence ArrayIndexOutOfBoundsException
  org.joda.time.format.TestDateTimeFormatter#testParseDateTime_zone ArrayIndexOutOfBoundsException
  org.joda.time.format.TestDateTimeFormatter#testParseDateTime_zone2 ArrayIndexOutOfBoundsException
  org.joda.time.format.TestDateTimeFormatter#testParseDateTime_zone3 ArrayIndexOutOfBoundsException
  org.joda.time.format.TestDateTimeFormatter#testParseLocalDateTime_monthDay_feb29 ArrayIndexOutOfBoundsException
  org.joda.time.format.TestDateTimeFormatter#testParseLocalDateTime_monthDay_withDefaultYear_feb29 ArrayIndexOutOfBoundsException
  org.joda.time.format.TestDateTimeFormatter#testParseLocalDateTime_simple ArrayIndexOutOfBoundsException
  org.joda.time.format.TestDateTimeFormatter#testParseLocalDate_monthDay_feb29 ArrayIndexOutOfBoundsException
  org.joda.time.format.TestDateTimeFormatter#testParseLocalDate_monthDay_withDefaultYear_feb29 ArrayIndexOutOfBoundsException
  org.joda.time.format.TestDateTimeFormatter#testParseLocalDate_simple ArrayIndexOutOfBoundsException
  org.joda.time.format.TestDateTimeFormatter#testParseLocalDate_weekyear_month_week_2010 ArrayIndexOutOfBoundsException
  org.joda.time.format.TestDateTimeFormatter#testParseLocalDate_weekyear_month_week_2011 ArrayIndexOutOfBoundsException
  org.joda.time.format.TestDateTimeFormatter#testParseLocalDate_weekyear_month_week_2012 ArrayIndexOutOfBoundsException
  org.joda.time.format.TestDateTimeFormatter#testParseLocalDate_yearOfCentury ArrayIndexOutOfBoundsException
  org.joda.time.format.TestDateTimeFormatter#testParseLocalDate_yearOfEra ArrayIndexOutOfBoundsException
  org.joda.time.format.TestDateTimeFormatter#testParseLocalDate_year_month_week_2010 ArrayIndexOutOfBoundsException
  org.joda.time.format.TestDateTimeFormatter#testParseLocalDate_year_month_week_2011 ArrayIndexOutOfBoundsException
  org.joda.time.format.TestDateTimeFormatter#testParseLocalDate_year_month_week_2012 ArrayIndexOutOfBoundsException
  org.joda.time.format.TestDateTimeFormatter#testParseLocalDate_year_month_week_2013 ArrayIndexOutOfBoundsException
  org.joda.time.format.TestDateTimeFormatter#testParseLocalDate_year_month_week_2014 ArrayIndexOutOfBoundsException
  org.joda.time.format.TestDateTimeFormatter#testParseLocalDate_year_month_week_2015 ArrayIndexOutOfBoundsException
  org.joda.time.format.TestDateTimeFormatter#testParseLocalDate_year_month_week_2016 ArrayIndexOutOfBoundsException
  org.joda.time.format.TestDateTimeFormatter#testParseLocalTime_simple ArrayIndexOutOfBoundsException
  org.joda.time.format.TestDateTimeFormatter#testParseMillis_fractionOfSecondLong ArrayIndexOutOfBoundsException
  org.joda.time.format.TestDateTimeFormatter#testParseMutableDateTime_chrono ArrayIndexOutOfBoundsException
  org.joda.time.format.TestDateTimeFormatter#testParseMutableDateTime_offsetParsed ArrayIndexOutOfBoundsException
  org.joda.time.format.TestDateTimeFormatter#testParseMutableDateTime_simple ArrayIndexOutOfBoundsException
  org.joda.time.format.TestDateTimeFormatter#testParseMutableDateTime_simple_precedence ArrayIndexOutOfBoundsException
  org.joda.time.format.TestDateTimeFormatter#testParseMutableDateTime_zone ArrayIndexOutOfBoundsException
  org.joda.time.format.TestDateTimeFormatter#testParseMutableDateTime_zone2 ArrayIndexOutOfBoundsException
  org.joda.time.format.TestDateTimeFormatter#testParseMutableDateTime_zone3 ArrayIndexOutOfBoundsException
  org.joda.time.format.TestDateTimeFormatter#testPrinterParserMethods ArrayIndexOutOfBoundsException
  org.joda.time.format.TestDateTimeFormatterBuilder#test_appendFixedDecimal ArrayIndexOutOfBoundsException
  org.joda.time.format.TestDateTimeFormatterBuilder#test_appendFixedSignedDecimal ArrayIndexOutOfBoundsException
  org.joda.time.format.TestDateTimeFormatterBuilder#test_localParseWrongOffsetAndZone ArrayIndexOutOfBoundsException
  org.joda.time.format.TestDateTimeFormatterBuilder#test_localPrintParseOffset ArrayIndexOutOfBoundsException
  org.joda.time.format.TestDateTimeFormatterBuilder#test_localPrintParseOffsetAndZone ArrayIndexOutOfBoundsException
  org.joda.time.format.TestDateTimeFormatterBuilder#test_localPrintParseZoneTokyo ArrayIndexOutOfBoundsException
  org.joda.time.format.TestDateTimeFormatterBuilder#test_parseWrongOffset ArrayIndexOutOfBoundsException
  org.joda.time.format.TestDateTimeFormatterBuilder#test_parseWrongOffsetAndZone ArrayIndexOutOfBoundsException
  org.joda.time.format.TestDateTimeFormatterBuilder#test_printParseLongNameWithLookup ArrayIndexOutOfBoundsException
  org.joda.time.format.TestDateTimeFormatterBuilder#test_printParseOffset ArrayIndexOutOfBoundsException
  org.joda.time.format.TestDateTimeFormatterBuilder#test_printParseOffsetAndZone ArrayIndexOutOfBoundsException
  org.joda.time.format.TestDateTimeFormatterBuilder#test_printParseShortNameWithAutoLookup ArrayIndexOutOfBoundsException
  org.joda.time.format.TestDateTimeFormatterBuilder#test_printParseShortNameWithLookup ArrayIndexOutOfBoundsException
  org.joda.time.format.TestDateTimeFormatterBuilder#test_printParseZoneBahiaBanderas ArrayIndexOutOfBoundsException
  org.joda.time.format.TestDateTimeFormatterBuilder#test_printParseZoneDawsonCreek ArrayIndexOutOfBoundsException
  org.joda.time.format.TestDateTimeFormatterBuilder#test_printParseZoneParis ArrayIndexOutOfBoundsException
  org.joda.time.format.TestDateTimeFormatterBuilder#test_printParseZoneTokyo ArrayIndexOutOfBoundsException
  org.joda.time.format.TestDateTimeParserBucket#testParse ArrayIndexOutOfBoundsException
  org.joda.time.format.TestDateTimeParserBucket#testSaveCompute ArrayIndexOutOfBoundsException
  org.joda.time.format.TestISODateTimeFormatParsing#test_basicDate ArrayIndexOutOfBoundsException
  org.joda.time.format.TestISODateTimeFormatParsing#test_basicDateTime ArrayIndexOutOfBoundsException
  org.joda.time.format.TestISODateTimeFormatParsing#test_basicDateTimeNoMillis ArrayIndexOutOfBoundsException
  org.joda.time.format.TestISODateTimeFormatParsing#test_basicOrdinalDate ArrayIndexOutOfBoundsException
  org.joda.time.format.TestISODateTimeFormatParsing#test_basicOrdinalDateTime ArrayIndexOutOfBoundsException
  org.joda.time.format.TestISODateTimeFormatParsing#test_basicOrdinalDateTimeNoMillis ArrayIndexOutOfBoundsException
  org.joda.time.format.TestISODateTimeFormatParsing#test_basicTTime ArrayIndexOutOfBoundsException
  org.joda.time.format.TestISODateTimeFormatParsing#test_basicTTimeNoMillis ArrayIndexOutOfBoundsException
  org.joda.time.format.TestISODateTimeFormatParsing#test_basicTime ArrayIndexOutOfBoundsException
  org.joda.time.format.TestISODateTimeFormatParsing#test_basicTimeNoMillis ArrayIndexOutOfBoundsException
  org.joda.time.format.TestISODateTimeFormatParsing#test_basicWeekDate ArrayIndexOutOfBoundsException
  org.joda.time.format.TestISODateTimeFormatParsing#test_basicWeekDateTime ArrayIndexOutOfBoundsException
  org.joda.time.format.TestISODateTimeFormatParsing#test_basicWeekDateTimeNoMillis ArrayIndexOutOfBoundsException
  org.joda.time.format.TestISODateTimeFormatParsing#test_date ArrayIndexOutOfBoundsException
  org.joda.time.format.TestISODateTimeFormatParsing#test_dateElementParser ArrayIndexOutOfBoundsException
  org.joda.time.format.TestISODateTimeFormatParsing#test_dateOptionalTimeParser ArrayIndexOutOfBoundsException
  org.joda.time.format.TestISODateTimeFormatParsing#test_dateParser ArrayIndexOutOfBoundsException
  org.joda.time.format.TestISODateTimeFormatParsing#test_dateTime ArrayIndexOutOfBoundsException
  org.joda.time.format.TestISODateTimeFormatParsing#test_dateTimeNoMillis ArrayIndexOutOfBoundsException
  org.joda.time.format.TestISODateTimeFormatParsing#test_dateTimeParser ArrayIndexOutOfBoundsException
  org.joda.time.format.TestISODateTimeFormatParsing#test_hourMinute ArrayIndexOutOfBoundsException
  org.joda.time.format.TestISODateTimeFormatParsing#test_hourMinuteSecond ArrayIndexOutOfBoundsException
  org.joda.time.format.TestISODateTimeFormatParsing#test_hourMinuteSecondFraction ArrayIndexOutOfBoundsException
  org.joda.time.format.TestISODateTimeFormatParsing#test_hourMinuteSecondMillis ArrayIndexOutOfBoundsException
  org.joda.time.format.TestISODateTimeFormatParsing#test_localDateOptionalTimeParser ArrayIndexOutOfBoundsException
  org.joda.time.format.TestISODateTimeFormatParsing#test_localDateParser ArrayIndexOutOfBoundsException
  org.joda.time.format.TestISODateTimeFormatParsing#test_localTimeParser ArrayIndexOutOfBoundsException
  org.joda.time.format.TestISODateTimeFormatParsing#test_ordinalDate ArrayIndexOutOfBoundsException
  org.joda.time.format.TestISODateTimeFormatParsing#test_ordinalDateTime ArrayIndexOutOfBoundsException
  org.joda.time.format.TestISODateTimeFormatParsing#test_ordinalDateTimeNoMillis ArrayIndexOutOfBoundsException
  org.joda.time.format.TestISODateTimeFormatParsing#test_tTime ArrayIndexOutOfBoundsException
  org.joda.time.format.TestISODateTimeFormatParsing#test_tTimeNoMillis ArrayIndexOutOfBoundsException
  org.joda.time.format.TestISODateTimeFormatParsing#test_time ArrayIndexOutOfBoundsException
  org.joda.time.format.TestISODateTimeFormatParsing#test_timeElementParser ArrayIndexOutOfBoundsException
  org.joda.time.format.TestISODateTimeFormatParsing#test_timeNoMillis ArrayIndexOutOfBoundsException
  org.joda.time.format.TestISODateTimeFormatParsing#test_timeParser ArrayIndexOutOfBoundsException
  org.joda.time.format.TestISODateTimeFormatParsing#test_weekDate ArrayIndexOutOfBoundsException
  org.joda.time.format.TestISODateTimeFormatParsing#test_weekDateTime ArrayIndexOutOfBoundsException
  org.joda.time.format.TestISODateTimeFormatParsing#test_weekDateTimeNoMillis ArrayIndexOutOfBoundsException
  org.joda.time.tz.TestBuilder#testForwardTransitions ArrayIndexOutOfBoundsException
  org.joda.time.tz.TestBuilder#testReverseTransitions ArrayIndexOutOfBoundsException
  org.joda.time.tz.TestBuilder#testSerialization ArrayIndexOutOfBoundsException ...
  org.joda.time.tz.TestCompiler#testCompile ArrayIndexOutOfBoundsException -1

Tests run: 4157, Failures: 0, Errors: 278, Skipped: 0

[INFO] ------------------------------------------------------------------------
[INFO] BUILD FAILURE
[INFO] ------------------------------------------------------------------------
[INFO] Total time: 15.970s
[INFO] Finished at: Thu Aug 06 08:37:36 BST 2015
[INFO] Final Memory: 9M/213M
[INFO] ------------------------------------------------------------------------
[ERROR] Failed to execute goal org.apache.maven.plugins:maven-surefire-plugin:2.18.1:test (default-test) on project joda-time: There are test failures.
[ERROR] 
[ERROR] Please refer to /home/perham/Study/LittleDarwin/Cases/joda-time-2.8.1/target/surefire-reports for the individual test results.
[ERROR] -> [Help 1]
[ERROR] 
[ERROR] To see the full stack trace of the errors, re-run Maven with the -e switch.
[ERROR] Re-run Maven using the -X switch to enable full debug logging.
[ERROR] 
[ERROR] For more information about the errors and possible solutions, please read the following articles:
[ERROR] [Help 1] http://cwiki.apache.org/confluence/display/MAVEN/MojoFailureException
