[INFO] Scanning for projects...
[INFO]                                                                         
[INFO] ------------------------------------------------------------------------
[INFO] Building Joda-Time 2.8.1
[INFO] ------------------------------------------------------------------------
[INFO] 
[INFO] --- maven-resources-plugin:2.7:resources (default-resources) @ joda-time ---
[INFO] Using 'UTF-8' encoding to copy filtered resources.
[INFO] Copying 2 resources to META-INF
[INFO] Copying 10 resources
[INFO] 
[INFO] --- maven-compiler-plugin:3.3:compile (default-compile) @ joda-time ---
[INFO] Changes detected - recompiling the module!
[INFO] Compiling 166 source files to /home/perham/Study/LittleDarwin/Cases/joda-time-2.8.1/target/classes
[INFO] 
[INFO] --- exec-maven-plugin:1.4.0:java (compile-tzdb) @ joda-time ---
Writing zoneinfo files
Writing ZoneInfoMap
[INFO] 
[INFO] --- maven-resources-plugin:2.7:testResources (default-testResources) @ joda-time ---
[INFO] Using 'UTF-8' encoding to copy filtered resources.
[INFO] Copying 34 resources
[INFO] 
[INFO] --- maven-compiler-plugin:3.3:testCompile (default-testCompile) @ joda-time ---
[INFO] Nothing to compile - all classes are up to date
[INFO] 
[INFO] --- maven-surefire-plugin:2.18.1:test (default-test) @ joda-time ---
[INFO] Surefire report directory: /home/perham/Study/LittleDarwin/Cases/joda-time-2.8.1/target/surefire-reports

-------------------------------------------------------
 T E S T S
-------------------------------------------------------
Running org.joda.time.TestAllPackages

TestBuddhistChronology.testCalendar

TestCopticChronology.testCalendar

TestEthiopicChronology.testCalendar

TestIslamicChronology.testCalendar

Testing Gregorian chronology over 1000 iterations
100% complete (i=1000)

Testing Julian chronology over 1000 iterations
100% complete (i=1000)
Writing zoneinfo files
Writing ZoneInfoMap
Tests run: 4157, Failures: 33, Errors: 6, Skipped: 0, Time elapsed: 5.479 sec <<< FAILURE! - in org.joda.time.TestAllPackages
testConstructor_ObjectString5(org.joda.time.TestDateTime_Constructors)  Time elapsed: 0.005 sec  <<< FAILURE!
junit.framework.AssertionFailedError: expected:<1970> but was:<2000>
	at junit.framework.Assert.fail(Assert.java:47)
	at junit.framework.Assert.failNotEquals(Assert.java:280)
	at junit.framework.Assert.assertEquals(Assert.java:64)
	at junit.framework.Assert.assertEquals(Assert.java:198)
	at junit.framework.Assert.assertEquals(Assert.java:204)
	at org.joda.time.TestDateTime_Constructors.testConstructor_ObjectString5(TestDateTime_Constructors.java:425)

testConstructor_ObjectString6(org.joda.time.TestDateTime_Constructors)  Time elapsed: 0.001 sec  <<< FAILURE!
junit.framework.AssertionFailedError: expected:<1969> but was:<1999>
	at junit.framework.Assert.fail(Assert.java:47)
	at junit.framework.Assert.failNotEquals(Assert.java:280)
	at junit.framework.Assert.assertEquals(Assert.java:64)
	at junit.framework.Assert.assertEquals(Assert.java:198)
	at junit.framework.Assert.assertEquals(Assert.java:204)
	at org.joda.time.TestDateTime_Constructors.testConstructor_ObjectString6(TestDateTime_Constructors.java:437)

testConstructor_ObjectString2(org.joda.time.TestTimeOfDay_Constructors)  Time elapsed: 0.001 sec  <<< FAILURE!
junit.framework.AssertionFailedError: expected:<7> but was:<6>
	at junit.framework.Assert.fail(Assert.java:47)
	at junit.framework.Assert.failNotEquals(Assert.java:280)
	at junit.framework.Assert.assertEquals(Assert.java:64)
	at junit.framework.Assert.assertEquals(Assert.java:198)
	at junit.framework.Assert.assertEquals(Assert.java:204)
	at org.joda.time.TestTimeOfDay_Constructors.testConstructor_ObjectString2(TestTimeOfDay_Constructors.java:376)

testConstructor_ObjectString4(org.joda.time.TestTimeOfDay_Constructors)  Time elapsed: 0 sec  <<< FAILURE!
junit.framework.AssertionFailedError: expected:<7> but was:<6>
	at junit.framework.Assert.fail(Assert.java:47)
	at junit.framework.Assert.failNotEquals(Assert.java:280)
	at junit.framework.Assert.assertEquals(Assert.java:64)
	at junit.framework.Assert.assertEquals(Assert.java:198)
	at junit.framework.Assert.assertEquals(Assert.java:204)
	at org.joda.time.TestTimeOfDay_Constructors.testConstructor_ObjectString4(TestTimeOfDay_Constructors.java:394)

testParse_noFormatter(org.joda.time.TestMonthDay_Constructors)  Time elapsed: 0.001 sec  <<< ERROR!
org.joda.time.IllegalFieldValueException: Cannot parse "--02-29": Value 29 for dayOfMonth must be in the range [1,28]
	at org.joda.time.field.FieldUtils.verifyValueBounds(FieldUtils.java:234)
	at org.joda.time.field.PreciseDurationDateTimeField.set(PreciseDurationDateTimeField.java:79)
	at org.joda.time.format.DateTimeParserBucket$SavedField.set(DateTimeParserBucket.java:154)
	at org.joda.time.format.DateTimeParserBucket.computeMillis(DateTimeParserBucket.java:106)
	at org.joda.time.format.DateTimeParserBucket.computeMillis(DateTimeParserBucket.java:92)
	at org.joda.time.format.DateTimeFormatter.parseLocalDateTime(DateTimeFormatter.java:841)
	at org.joda.time.format.DateTimeFormatter.parseLocalDate(DateTimeFormatter.java:798)
	at org.joda.time.MonthDay.parse(MonthDay.java:160)
	at org.joda.time.MonthDay.parse(MonthDay.java:149)
	at org.joda.time.TestMonthDay_Constructors.testParse_noFormatter(TestMonthDay_Constructors.java:83)

testMonthDay_leapDay(org.joda.time.TestStringConvert)  Time elapsed: 0.001 sec  <<< ERROR!
org.joda.time.IllegalFieldValueException: Cannot parse "--02-29": Value 29 for dayOfMonth must be in the range [1,28]
	at org.joda.time.field.FieldUtils.verifyValueBounds(FieldUtils.java:234)
	at org.joda.time.field.PreciseDurationDateTimeField.set(PreciseDurationDateTimeField.java:79)
	at org.joda.time.format.DateTimeParserBucket$SavedField.set(DateTimeParserBucket.java:154)
	at org.joda.time.format.DateTimeParserBucket.computeMillis(DateTimeParserBucket.java:106)
	at org.joda.time.format.DateTimeParserBucket.computeMillis(DateTimeParserBucket.java:92)
	at org.joda.time.format.DateTimeFormatter.parseLocalDateTime(DateTimeFormatter.java:841)
	at org.joda.time.format.DateTimeFormatter.parseLocalDate(DateTimeFormatter.java:798)
	at org.joda.time.MonthDay.parse(MonthDay.java:160)
	at org.joda.time.MonthDay.parse(MonthDay.java:149)
	at sun.reflect.NativeMethodAccessorImpl.invoke0(Native Method)
	at sun.reflect.NativeMethodAccessorImpl.invoke(NativeMethodAccessorImpl.java:57)
	at sun.reflect.DelegatingMethodAccessorImpl.invoke(DelegatingMethodAccessorImpl.java:43)
	at java.lang.reflect.Method.invoke(Method.java:606)
	at org.joda.convert.MethodsStringConverter.convertFromString(MethodsStringConverter.java:70)
	at org.joda.convert.StringConvert.convertFromString(StringConvert.java:163)
	at org.joda.time.TestStringConvert.testMonthDay_leapDay(TestStringConvert.java:113)

testParseMillis_fractionOfSecondLong(org.joda.time.format.TestDateTimeFormatter)  Time elapsed: 0.001 sec  <<< FAILURE!
junit.framework.AssertionFailedError: expected:<10512> but was:<946684810512>
	at junit.framework.Assert.fail(Assert.java:47)
	at junit.framework.Assert.failNotEquals(Assert.java:280)
	at junit.framework.Assert.assertEquals(Assert.java:64)
	at junit.framework.Assert.assertEquals(Assert.java:133)
	at junit.framework.Assert.assertEquals(Assert.java:139)
	at org.joda.time.format.TestDateTimeFormatter.testParseMillis_fractionOfSecondLong(TestDateTimeFormatter.java:989)

testParseLocalDateTime_monthDay_withDefaultYear_feb29(org.joda.time.format.TestDateTimeFormatter)  Time elapsed: 0.001 sec  <<< ERROR!
org.joda.time.IllegalFieldValueException: Cannot parse "2 29 13 40": Value 29 for dayOfMonth must be in the range [1,28]
	at org.joda.time.field.FieldUtils.verifyValueBounds(FieldUtils.java:234)
	at org.joda.time.field.PreciseDurationDateTimeField.set(PreciseDurationDateTimeField.java:79)
	at org.joda.time.chrono.GJChronology$CutoverField.set(GJChronology.java:727)
	at org.joda.time.format.DateTimeParserBucket$SavedField.set(DateTimeParserBucket.java:154)
	at org.joda.time.format.DateTimeParserBucket.computeMillis(DateTimeParserBucket.java:106)
	at org.joda.time.format.DateTimeParserBucket.computeMillis(DateTimeParserBucket.java:92)
	at org.joda.time.format.DateTimeFormatter.parseLocalDateTime(DateTimeFormatter.java:841)
	at org.joda.time.format.TestDateTimeFormatter.testParseLocalDateTime_monthDay_withDefaultYear_feb29(TestDateTimeFormatter.java:537)

testParseLocalDate_monthDay_feb29(org.joda.time.format.TestDateTimeFormatter)  Time elapsed: 0.002 sec  <<< ERROR!
org.joda.time.IllegalFieldValueException: Cannot parse "2 29": Value 29 for dayOfMonth must be in the range [1,28]
	at org.joda.time.field.FieldUtils.verifyValueBounds(FieldUtils.java:234)
	at org.joda.time.field.PreciseDurationDateTimeField.set(PreciseDurationDateTimeField.java:79)
	at org.joda.time.chrono.GJChronology$CutoverField.set(GJChronology.java:727)
	at org.joda.time.format.DateTimeParserBucket$SavedField.set(DateTimeParserBucket.java:154)
	at org.joda.time.format.DateTimeParserBucket.computeMillis(DateTimeParserBucket.java:106)
	at org.joda.time.format.DateTimeParserBucket.computeMillis(DateTimeParserBucket.java:92)
	at org.joda.time.format.DateTimeFormatter.parseLocalDateTime(DateTimeFormatter.java:841)
	at org.joda.time.format.DateTimeFormatter.parseLocalDate(DateTimeFormatter.java:798)
	at org.joda.time.format.TestDateTimeFormatter.testParseLocalDate_monthDay_feb29(TestDateTimeFormatter.java:411)

testParseLocalDate_monthDay_withDefaultYear_feb29(org.joda.time.format.TestDateTimeFormatter)  Time elapsed: 0 sec  <<< ERROR!
org.joda.time.IllegalFieldValueException: Cannot parse "2 29": Value 29 for dayOfMonth must be in the range [1,28]
	at org.joda.time.field.FieldUtils.verifyValueBounds(FieldUtils.java:234)
	at org.joda.time.field.PreciseDurationDateTimeField.set(PreciseDurationDateTimeField.java:79)
	at org.joda.time.chrono.GJChronology$CutoverField.set(GJChronology.java:727)
	at org.joda.time.format.DateTimeParserBucket$SavedField.set(DateTimeParserBucket.java:154)
	at org.joda.time.format.DateTimeParserBucket.computeMillis(DateTimeParserBucket.java:106)
	at org.joda.time.format.DateTimeParserBucket.computeMillis(DateTimeParserBucket.java:92)
	at org.joda.time.format.DateTimeFormatter.parseLocalDateTime(DateTimeFormatter.java:841)
	at org.joda.time.format.DateTimeFormatter.parseLocalDate(DateTimeFormatter.java:798)
	at org.joda.time.format.TestDateTimeFormatter.testParseLocalDate_monthDay_withDefaultYear_feb29(TestDateTimeFormatter.java:422)

testParseLocalDateTime_monthDay_feb29(org.joda.time.format.TestDateTimeFormatter)  Time elapsed: 0.001 sec  <<< ERROR!
org.joda.time.IllegalFieldValueException: Cannot parse "2 29 13 40": Value 29 for dayOfMonth must be in the range [1,28]
	at org.joda.time.field.FieldUtils.verifyValueBounds(FieldUtils.java:234)
	at org.joda.time.field.PreciseDurationDateTimeField.set(PreciseDurationDateTimeField.java:79)
	at org.joda.time.chrono.GJChronology$CutoverField.set(GJChronology.java:727)
	at org.joda.time.format.DateTimeParserBucket$SavedField.set(DateTimeParserBucket.java:154)
	at org.joda.time.format.DateTimeParserBucket.computeMillis(DateTimeParserBucket.java:106)
	at org.joda.time.format.DateTimeParserBucket.computeMillis(DateTimeParserBucket.java:92)
	at org.joda.time.format.DateTimeFormatter.parseLocalDateTime(DateTimeFormatter.java:841)
	at org.joda.time.format.TestDateTimeFormatter.testParseLocalDateTime_monthDay_feb29(TestDateTimeFormatter.java:526)

testFormatParse_textMonthAtEnd_France(org.joda.time.format.TestDateTimeFormat)  Time elapsed: 0.001 sec  <<< FAILURE!
junit.framework.AssertionFailedError: expected:<2000> but was:<1970>
	at junit.framework.Assert.fail(Assert.java:47)
	at junit.framework.Assert.failNotEquals(Assert.java:280)
	at junit.framework.Assert.assertEquals(Assert.java:64)
	at junit.framework.Assert.assertEquals(Assert.java:198)
	at junit.framework.Assert.assertEquals(Assert.java:204)
	at org.joda.time.format.TestDateTimeFormat.check(TestDateTimeFormat.java:1173)
	at org.joda.time.format.TestDateTimeFormat.testFormatParse_textMonthAtEnd_France(TestDateTimeFormat.java:974)

testFormatParse_textMonthAtEnd_France_withSpecifiedDefault(org.joda.time.format.TestDateTimeFormat)  Time elapsed: 0.002 sec  <<< FAILURE!
junit.framework.AssertionFailedError: expected:<1980> but was:<1970>
	at junit.framework.Assert.fail(Assert.java:47)
	at junit.framework.Assert.failNotEquals(Assert.java:280)
	at junit.framework.Assert.assertEquals(Assert.java:64)
	at junit.framework.Assert.assertEquals(Assert.java:198)
	at junit.framework.Assert.assertEquals(Assert.java:204)
	at org.joda.time.format.TestDateTimeFormat.check(TestDateTimeFormat.java:1173)
	at org.joda.time.format.TestDateTimeFormat.testFormatParse_textMonthAtEnd_France_withSpecifiedDefault(TestDateTimeFormat.java:984)

testForStyle_shortTime(org.joda.time.format.TestDateTimeFormatStyle)  Time elapsed: 0.001 sec  <<< FAILURE!
junit.framework.AssertionFailedError: expected:<1970-01-01T10:20:00.000+01:00> but was:<2000-01-01T10:20:00.000Z>
	at junit.framework.Assert.fail(Assert.java:47)
	at junit.framework.Assert.failNotEquals(Assert.java:280)
	at junit.framework.Assert.assertEquals(Assert.java:64)
	at junit.framework.Assert.assertEquals(Assert.java:71)
	at org.joda.time.format.TestDateTimeFormatStyle.testForStyle_shortTime(TestDateTimeFormatStyle.java:161)

testParse(org.joda.time.format.TestDateTimeParserBucket)  Time elapsed: 0.001 sec  <<< FAILURE!
junit.framework.AssertionFailedError: expected:<-6840000> but was:<946677960000>
	at junit.framework.Assert.fail(Assert.java:47)
	at junit.framework.Assert.failNotEquals(Assert.java:280)
	at junit.framework.Assert.assertEquals(Assert.java:64)
	at junit.framework.Assert.assertEquals(Assert.java:133)
	at junit.framework.Assert.assertEquals(Assert.java:139)
	at org.joda.time.format.TestDateTimeParserBucket.testParse(TestDateTimeParserBucket.java:287)

testSaveCompute(org.joda.time.format.TestDateTimeParserBucket)  Time elapsed: 0.001 sec  <<< FAILURE!
junit.framework.AssertionFailedError: expected:<-7199900> but was:<946677600100>
	at junit.framework.Assert.fail(Assert.java:47)
	at junit.framework.Assert.failNotEquals(Assert.java:280)
	at junit.framework.Assert.assertEquals(Assert.java:64)
	at junit.framework.Assert.assertEquals(Assert.java:133)
	at junit.framework.Assert.assertEquals(Assert.java:139)
	at org.joda.time.format.TestDateTimeParserBucket.testSaveCompute(TestDateTimeParserBucket.java:125)

testSaveRestoreState(org.joda.time.format.TestDateTimeParserBucket)  Time elapsed: 0 sec  <<< FAILURE!
junit.framework.AssertionFailedError: expected:<-7199900> but was:<946677600100>
	at junit.framework.Assert.fail(Assert.java:47)
	at junit.framework.Assert.failNotEquals(Assert.java:280)
	at junit.framework.Assert.assertEquals(Assert.java:64)
	at junit.framework.Assert.assertEquals(Assert.java:133)
	at junit.framework.Assert.assertEquals(Assert.java:139)
	at org.joda.time.format.TestDateTimeParserBucket.testSaveRestoreState(TestDateTimeParserBucket.java:136)

testSaveRestoreState_avoidSideEffects(org.joda.time.format.TestDateTimeParserBucket)  Time elapsed: 0.001 sec  <<< FAILURE!
junit.framework.AssertionFailedError: expected:<-6779900> but was:<946678020100>
	at junit.framework.Assert.fail(Assert.java:47)
	at junit.framework.Assert.failNotEquals(Assert.java:280)
	at junit.framework.Assert.assertEquals(Assert.java:64)
	at junit.framework.Assert.assertEquals(Assert.java:133)
	at junit.framework.Assert.assertEquals(Assert.java:139)
	at org.joda.time.format.TestDateTimeParserBucket.testSaveRestoreState_avoidSideEffects(TestDateTimeParserBucket.java:157)

testSaveRestoreState_offset(org.joda.time.format.TestDateTimeParserBucket)  Time elapsed: 0 sec  <<< FAILURE!
junit.framework.AssertionFailedError: expected:<-7199900> but was:<946677600100>
	at junit.framework.Assert.fail(Assert.java:47)
	at junit.framework.Assert.failNotEquals(Assert.java:280)
	at junit.framework.Assert.assertEquals(Assert.java:64)
	at junit.framework.Assert.assertEquals(Assert.java:133)
	at junit.framework.Assert.assertEquals(Assert.java:139)
	at org.joda.time.format.TestDateTimeParserBucket.testSaveRestoreState_offset(TestDateTimeParserBucket.java:165)

testSaveRestoreState_zone(org.joda.time.format.TestDateTimeParserBucket)  Time elapsed: 0.001 sec  <<< FAILURE!
junit.framework.AssertionFailedError: expected:<-7199900> but was:<946677600100>
	at junit.framework.Assert.fail(Assert.java:47)
	at junit.framework.Assert.failNotEquals(Assert.java:280)
	at junit.framework.Assert.assertEquals(Assert.java:64)
	at junit.framework.Assert.assertEquals(Assert.java:133)
	at junit.framework.Assert.assertEquals(Assert.java:139)
	at org.joda.time.format.TestDateTimeParserBucket.testSaveRestoreState_zone(TestDateTimeParserBucket.java:177)

testSaveRestoreState_text(org.joda.time.format.TestDateTimeParserBucket)  Time elapsed: 0 sec  <<< FAILURE!
junit.framework.AssertionFailedError: expected:<-7199900> but was:<946677600100>
	at junit.framework.Assert.fail(Assert.java:47)
	at junit.framework.Assert.failNotEquals(Assert.java:280)
	at junit.framework.Assert.assertEquals(Assert.java:64)
	at junit.framework.Assert.assertEquals(Assert.java:133)
	at junit.framework.Assert.assertEquals(Assert.java:139)
	at org.joda.time.format.TestDateTimeParserBucket.testSaveRestoreState_text(TestDateTimeParserBucket.java:189)

testSaveRestoreState_twoStates(org.joda.time.format.TestDateTimeParserBucket)  Time elapsed: 0.001 sec  <<< FAILURE!
junit.framework.AssertionFailedError: expected:<-7199900> but was:<946677600100>
	at junit.framework.Assert.fail(Assert.java:47)
	at junit.framework.Assert.failNotEquals(Assert.java:280)
	at junit.framework.Assert.assertEquals(Assert.java:64)
	at junit.framework.Assert.assertEquals(Assert.java:133)
	at junit.framework.Assert.assertEquals(Assert.java:139)
	at org.joda.time.format.TestDateTimeParserBucket.testSaveRestoreState_twoStates(TestDateTimeParserBucket.java:201)

testSaveRestoreState_sameStates(org.joda.time.format.TestDateTimeParserBucket)  Time elapsed: 0 sec  <<< FAILURE!
junit.framework.AssertionFailedError: expected:<-7199900> but was:<946677600100>
	at junit.framework.Assert.fail(Assert.java:47)
	at junit.framework.Assert.failNotEquals(Assert.java:280)
	at junit.framework.Assert.assertEquals(Assert.java:64)
	at junit.framework.Assert.assertEquals(Assert.java:133)
	at junit.framework.Assert.assertEquals(Assert.java:139)
	at org.joda.time.format.TestDateTimeParserBucket.testSaveRestoreState_sameStates(TestDateTimeParserBucket.java:223)

testReset(org.joda.time.format.TestDateTimeParserBucket)  Time elapsed: 0 sec  <<< FAILURE!
junit.framework.AssertionFailedError: expected:<7199900> but was:<946691999900>
	at junit.framework.Assert.fail(Assert.java:47)
	at junit.framework.Assert.failNotEquals(Assert.java:280)
	at junit.framework.Assert.assertEquals(Assert.java:64)
	at junit.framework.Assert.assertEquals(Assert.java:133)
	at junit.framework.Assert.assertEquals(Assert.java:139)
	at org.joda.time.format.TestDateTimeParserBucket.testReset(TestDateTimeParserBucket.java:261)

test_basicTime(org.joda.time.format.TestISODateTimeFormatParsing)  Time elapsed: 0 sec  <<< FAILURE!
junit.framework.AssertionFailedError: expected:<1970-01-01T10:20:30.400Z> but was:<2000-01-01T10:20:30.400Z>
	at junit.framework.Assert.fail(Assert.java:47)
	at junit.framework.Assert.failNotEquals(Assert.java:280)
	at junit.framework.Assert.assertEquals(Assert.java:64)
	at junit.framework.Assert.assertEquals(Assert.java:71)
	at org.joda.time.format.TestISODateTimeFormatParsing.assertParse(TestISODateTimeFormatParsing.java:841)
	at org.joda.time.format.TestISODateTimeFormatParsing.test_basicTime(TestISODateTimeFormatParsing.java:582)

test_basicTimeNoMillis(org.joda.time.format.TestISODateTimeFormatParsing)  Time elapsed: 0 sec  <<< FAILURE!
junit.framework.AssertionFailedError: expected:<1970-01-01T10:20:30.000Z> but was:<2000-01-01T10:20:30.000Z>
	at junit.framework.Assert.fail(Assert.java:47)
	at junit.framework.Assert.failNotEquals(Assert.java:280)
	at junit.framework.Assert.assertEquals(Assert.java:64)
	at junit.framework.Assert.assertEquals(Assert.java:71)
	at org.joda.time.format.TestISODateTimeFormatParsing.assertParse(TestISODateTimeFormatParsing.java:841)
	at org.joda.time.format.TestISODateTimeFormatParsing.test_basicTimeNoMillis(TestISODateTimeFormatParsing.java:597)

test_basicTTime(org.joda.time.format.TestISODateTimeFormatParsing)  Time elapsed: 0.001 sec  <<< FAILURE!
junit.framework.AssertionFailedError: expected:<1970-01-01T10:20:30.400Z> but was:<2000-01-01T10:20:30.400Z>
	at junit.framework.Assert.fail(Assert.java:47)
	at junit.framework.Assert.failNotEquals(Assert.java:280)
	at junit.framework.Assert.assertEquals(Assert.java:64)
	at junit.framework.Assert.assertEquals(Assert.java:71)
	at org.joda.time.format.TestISODateTimeFormatParsing.assertParse(TestISODateTimeFormatParsing.java:841)
	at org.joda.time.format.TestISODateTimeFormatParsing.test_basicTTime(TestISODateTimeFormatParsing.java:609)

test_basicTTimeNoMillis(org.joda.time.format.TestISODateTimeFormatParsing)  Time elapsed: 0.001 sec  <<< FAILURE!
junit.framework.AssertionFailedError: expected:<1970-01-01T10:20:30.000Z> but was:<2000-01-01T10:20:30.000Z>
	at junit.framework.Assert.fail(Assert.java:47)
	at junit.framework.Assert.failNotEquals(Assert.java:280)
	at junit.framework.Assert.assertEquals(Assert.java:64)
	at junit.framework.Assert.assertEquals(Assert.java:71)
	at org.joda.time.format.TestISODateTimeFormatParsing.assertParse(TestISODateTimeFormatParsing.java:841)
	at org.joda.time.format.TestISODateTimeFormatParsing.test_basicTTimeNoMillis(TestISODateTimeFormatParsing.java:624)

test_hourMinute(org.joda.time.format.TestISODateTimeFormatParsing)  Time elapsed: 0.001 sec  <<< FAILURE!
junit.framework.AssertionFailedError: expected:<1970-01-01T10:20:00.000Z> but was:<2000-01-01T10:20:00.000Z>
	at junit.framework.Assert.fail(Assert.java:47)
	at junit.framework.Assert.failNotEquals(Assert.java:280)
	at junit.framework.Assert.assertEquals(Assert.java:64)
	at junit.framework.Assert.assertEquals(Assert.java:71)
	at org.joda.time.format.TestISODateTimeFormatParsing.assertParse(TestISODateTimeFormatParsing.java:841)
	at org.joda.time.format.TestISODateTimeFormatParsing.test_hourMinute(TestISODateTimeFormatParsing.java:767)

test_hourMinuteSecond(org.joda.time.format.TestISODateTimeFormatParsing)  Time elapsed: 0.001 sec  <<< FAILURE!
junit.framework.AssertionFailedError: expected:<1970-01-01T10:20:30.000Z> but was:<2000-01-01T10:20:30.000Z>
	at junit.framework.Assert.fail(Assert.java:47)
	at junit.framework.Assert.failNotEquals(Assert.java:280)
	at junit.framework.Assert.assertEquals(Assert.java:64)
	at junit.framework.Assert.assertEquals(Assert.java:71)
	at org.joda.time.format.TestISODateTimeFormatParsing.assertParse(TestISODateTimeFormatParsing.java:841)
	at org.joda.time.format.TestISODateTimeFormatParsing.test_hourMinuteSecond(TestISODateTimeFormatParsing.java:782)

test_hourMinuteSecondMillis(org.joda.time.format.TestISODateTimeFormatParsing)  Time elapsed: 0.001 sec  <<< FAILURE!
junit.framework.AssertionFailedError: expected:<1970-01-01T10:20:30.400Z> but was:<2000-01-01T10:20:30.400Z>
	at junit.framework.Assert.fail(Assert.java:47)
	at junit.framework.Assert.failNotEquals(Assert.java:280)
	at junit.framework.Assert.assertEquals(Assert.java:64)
	at junit.framework.Assert.assertEquals(Assert.java:71)
	at org.joda.time.format.TestISODateTimeFormatParsing.assertParse(TestISODateTimeFormatParsing.java:841)
	at org.joda.time.format.TestISODateTimeFormatParsing.test_hourMinuteSecondMillis(TestISODateTimeFormatParsing.java:797)

test_hourMinuteSecondFraction(org.joda.time.format.TestISODateTimeFormatParsing)  Time elapsed: 0.001 sec  <<< FAILURE!
junit.framework.AssertionFailedError: expected:<1970-01-01T10:20:30.400Z> but was:<2000-01-01T10:20:30.400Z>
	at junit.framework.Assert.fail(Assert.java:47)
	at junit.framework.Assert.failNotEquals(Assert.java:280)
	at junit.framework.Assert.assertEquals(Assert.java:64)
	at junit.framework.Assert.assertEquals(Assert.java:71)
	at org.joda.time.format.TestISODateTimeFormatParsing.assertParse(TestISODateTimeFormatParsing.java:841)
	at org.joda.time.format.TestISODateTimeFormatParsing.test_hourMinuteSecondFraction(TestISODateTimeFormatParsing.java:812)

test_timeParser(org.joda.time.format.TestISODateTimeFormatParsing)  Time elapsed: 0.001 sec  <<< FAILURE!
junit.framework.AssertionFailedError: expected:<1970-01-01T10:20:30.040Z> but was:<2000-01-01T10:20:30.040Z>
	at junit.framework.Assert.fail(Assert.java:47)
	at junit.framework.Assert.failNotEquals(Assert.java:280)
	at junit.framework.Assert.assertEquals(Assert.java:64)
	at junit.framework.Assert.assertEquals(Assert.java:71)
	at org.joda.time.format.TestISODateTimeFormatParsing.assertParse(TestISODateTimeFormatParsing.java:841)
	at org.joda.time.format.TestISODateTimeFormatParsing.test_timeParser(TestISODateTimeFormatParsing.java:180)

test_localTimeParser(org.joda.time.format.TestISODateTimeFormatParsing)  Time elapsed: 0.002 sec  <<< FAILURE!
junit.framework.AssertionFailedError: expected:<10512> but was:<946684810512>
	at junit.framework.Assert.fail(Assert.java:47)
	at junit.framework.Assert.failNotEquals(Assert.java:280)
	at junit.framework.Assert.assertEquals(Assert.java:64)
	at junit.framework.Assert.assertEquals(Assert.java:133)
	at junit.framework.Assert.assertEquals(Assert.java:139)
	at org.joda.time.format.TestISODateTimeFormatParsing.test_localTimeParser(TestISODateTimeFormatParsing.java:225)

test_timeElementParser(org.joda.time.format.TestISODateTimeFormatParsing)  Time elapsed: 0.002 sec  <<< FAILURE!
junit.framework.AssertionFailedError: expected:<10512> but was:<946688410512>
	at junit.framework.Assert.fail(Assert.java:47)
	at junit.framework.Assert.failNotEquals(Assert.java:280)
	at junit.framework.Assert.assertEquals(Assert.java:64)
	at junit.framework.Assert.assertEquals(Assert.java:133)
	at junit.framework.Assert.assertEquals(Assert.java:139)
	at org.joda.time.format.TestISODateTimeFormatParsing.test_timeElementParser(TestISODateTimeFormatParsing.java:259)

test_time(org.joda.time.format.TestISODateTimeFormatParsing)  Time elapsed: 0.001 sec  <<< FAILURE!
junit.framework.AssertionFailedError: expected:<1970-01-01T10:20:30.400Z> but was:<2000-01-01T10:20:30.400Z>
	at junit.framework.Assert.fail(Assert.java:47)
	at junit.framework.Assert.failNotEquals(Assert.java:280)
	at junit.framework.Assert.assertEquals(Assert.java:64)
	at junit.framework.Assert.assertEquals(Assert.java:71)
	at org.joda.time.format.TestISODateTimeFormatParsing.assertParse(TestISODateTimeFormatParsing.java:841)
	at org.joda.time.format.TestISODateTimeFormatParsing.test_time(TestISODateTimeFormatParsing.java:375)

test_timeNoMillis(org.joda.time.format.TestISODateTimeFormatParsing)  Time elapsed: 0 sec  <<< FAILURE!
junit.framework.AssertionFailedError: expected:<1970-01-01T10:20:30.000Z> but was:<2000-01-01T10:20:30.000Z>
	at junit.framework.Assert.fail(Assert.java:47)
	at junit.framework.Assert.failNotEquals(Assert.java:280)
	at junit.framework.Assert.assertEquals(Assert.java:64)
	at junit.framework.Assert.assertEquals(Assert.java:71)
	at org.joda.time.format.TestISODateTimeFormatParsing.assertParse(TestISODateTimeFormatParsing.java:841)
	at org.joda.time.format.TestISODateTimeFormatParsing.test_timeNoMillis(TestISODateTimeFormatParsing.java:390)

test_tTime(org.joda.time.format.TestISODateTimeFormatParsing)  Time elapsed: 0 sec  <<< FAILURE!
junit.framework.AssertionFailedError: expected:<1970-01-01T10:20:30.400Z> but was:<2000-01-01T10:20:30.400Z>
	at junit.framework.Assert.fail(Assert.java:47)
	at junit.framework.Assert.failNotEquals(Assert.java:280)
	at junit.framework.Assert.assertEquals(Assert.java:64)
	at junit.framework.Assert.assertEquals(Assert.java:71)
	at org.joda.time.format.TestISODateTimeFormatParsing.assertParse(TestISODateTimeFormatParsing.java:841)
	at org.joda.time.format.TestISODateTimeFormatParsing.test_tTime(TestISODateTimeFormatParsing.java:402)

test_tTimeNoMillis(org.joda.time.format.TestISODateTimeFormatParsing)  Time elapsed: 0.001 sec  <<< FAILURE!
junit.framework.AssertionFailedError: expected:<1970-01-01T10:20:30.000Z> but was:<2000-01-01T10:20:30.000Z>
	at junit.framework.Assert.fail(Assert.java:47)
	at junit.framework.Assert.failNotEquals(Assert.java:280)
	at junit.framework.Assert.assertEquals(Assert.java:64)
	at junit.framework.Assert.assertEquals(Assert.java:71)
	at org.joda.time.format.TestISODateTimeFormatParsing.assertParse(TestISODateTimeFormatParsing.java:841)
	at org.joda.time.format.TestISODateTimeFormatParsing.test_tTimeNoMillis(TestISODateTimeFormatParsing.java:417)


Results :

Failed tests: 
  org.joda.time.TestDateTime_Constructors#testConstructor_ObjectString5 AssertionFailedError
  org.joda.time.TestDateTime_Constructors#testConstructor_ObjectString6 AssertionFailedError
  org.joda.time.TestTimeOfDay_Constructors#testConstructor_ObjectString2 AssertionFailedError
  org.joda.time.TestTimeOfDay_Constructors#testConstructor_ObjectString4 AssertionFailedError
  org.joda.time.format.TestDateTimeFormat#testFormatParse_textMonthAtEnd_France AssertionFailedError
  org.joda.time.format.TestDateTimeFormat#testFormatParse_textMonthAtEnd_France_withSpecifiedDefault AssertionFailedError
  org.joda.time.format.TestDateTimeFormatStyle#testForStyle_shortTime AssertionFailedError
  org.joda.time.format.TestDateTimeFormatter#testParseMillis_fractionOfSecondLong AssertionFailedError
  org.joda.time.format.TestDateTimeParserBucket#testParse AssertionFailedError e...
  org.joda.time.format.TestDateTimeParserBucket#testReset AssertionFailedError e...
  org.joda.time.format.TestDateTimeParserBucket#testSaveCompute AssertionFailedError
  org.joda.time.format.TestDateTimeParserBucket#testSaveRestoreState AssertionFailedError
  org.joda.time.format.TestDateTimeParserBucket#testSaveRestoreState_avoidSideEffects AssertionFailedError
  org.joda.time.format.TestDateTimeParserBucket#testSaveRestoreState_offset AssertionFailedError
  org.joda.time.format.TestDateTimeParserBucket#testSaveRestoreState_sameStates AssertionFailedError
  org.joda.time.format.TestDateTimeParserBucket#testSaveRestoreState_text AssertionFailedError
  org.joda.time.format.TestDateTimeParserBucket#testSaveRestoreState_twoStates AssertionFailedError
  org.joda.time.format.TestDateTimeParserBucket#testSaveRestoreState_zone AssertionFailedError
  org.joda.time.format.TestISODateTimeFormatParsing#test_basicTTime AssertionFailedError
  org.joda.time.format.TestISODateTimeFormatParsing#test_basicTTimeNoMillis AssertionFailedError
  org.joda.time.format.TestISODateTimeFormatParsing#test_basicTime AssertionFailedError
  org.joda.time.format.TestISODateTimeFormatParsing#test_basicTimeNoMillis AssertionFailedError
  org.joda.time.format.TestISODateTimeFormatParsing#test_hourMinute AssertionFailedError
  org.joda.time.format.TestISODateTimeFormatParsing#test_hourMinuteSecond AssertionFailedError
  org.joda.time.format.TestISODateTimeFormatParsing#test_hourMinuteSecondFraction AssertionFailedError
  org.joda.time.format.TestISODateTimeFormatParsing#test_hourMinuteSecondMillis AssertionFailedError
  org.joda.time.format.TestISODateTimeFormatParsing#test_localTimeParser AssertionFailedError
  org.joda.time.format.TestISODateTimeFormatParsing#test_tTime AssertionFailedError
  org.joda.time.format.TestISODateTimeFormatParsing#test_tTimeNoMillis AssertionFailedError
  org.joda.time.format.TestISODateTimeFormatParsing#test_time AssertionFailedError
  org.joda.time.format.TestISODateTimeFormatParsing#test_timeElementParser AssertionFailedError
  org.joda.time.format.TestISODateTimeFormatParsing#test_timeNoMillis AssertionFailedError
  org.joda.time.format.TestISODateTimeFormatParsing#test_timeParser AssertionFailedError
Tests in error: 
  org.joda.time.TestMonthDay_Constructors#testParse_noFormatter IllegalFieldValueException
  org.joda.time.TestStringConvert#testMonthDay_leapDay IllegalFieldValueException
  org.joda.time.format.TestDateTimeFormatter#testParseLocalDateTime_monthDay_feb29 IllegalFieldValueException
  org.joda.time.format.TestDateTimeFormatter#testParseLocalDateTime_monthDay_withDefaultYear_feb29 IllegalFieldValueException
  org.joda.time.format.TestDateTimeFormatter#testParseLocalDate_monthDay_feb29 IllegalFieldValueException
  org.joda.time.format.TestDateTimeFormatter#testParseLocalDate_monthDay_withDefaultYear_feb29 IllegalFieldValueException

Tests run: 4157, Failures: 33, Errors: 6, Skipped: 0

[INFO] ------------------------------------------------------------------------
[INFO] BUILD FAILURE
[INFO] ------------------------------------------------------------------------
[INFO] Total time: 15.994s
[INFO] Finished at: Thu Aug 06 08:43:35 BST 2015
[INFO] Final Memory: 9M/213M
[INFO] ------------------------------------------------------------------------
[ERROR] Failed to execute goal org.apache.maven.plugins:maven-surefire-plugin:2.18.1:test (default-test) on project joda-time: There are test failures.
[ERROR] 
[ERROR] Please refer to /home/perham/Study/LittleDarwin/Cases/joda-time-2.8.1/target/surefire-reports for the individual test results.
[ERROR] -> [Help 1]
[ERROR] 
[ERROR] To see the full stack trace of the errors, re-run Maven with the -e switch.
[ERROR] Re-run Maven using the -X switch to enable full debug logging.
[ERROR] 
[ERROR] For more information about the errors and possible solutions, please read the following articles:
[ERROR] [Help 1] http://cwiki.apache.org/confluence/display/MAVEN/MojoFailureException
